Test results for amd64, tripwire, crypto_hash/sha3224

[Page version: 20261004 16:18:08]

Measurements for amd64, tripwire, crypto_hash Test results for amd64, tripwire, crypto_hash Test results for crypto_hash/sha3224
Computer: tripwire
Microarchitecture: amd64; Zen 5 (b00f21)
Architecture: amd64
CPU ID: AuthenticAMD-00b00f21-178bfbff
SUPERCOP version: 20260831
Operation: crypto_hash
Primitive: sha3224
TimeObject sizeTest sizeImplementationCompilerBenchmark dateSUPERCOP version
9590546 0 080399 1208 1560oncore64bitsgcc -march=native -mtune=native -Os -fwrapv -fPIC -fPIE -gdwarf-4 -Wall2026093020260831
11233224 0 020820 1264 1560opensslgcc -march=native -mtune=native -Os -fwrapv -fPIC -fPIE -gdwarf-4 -Wall2026093020260831
11238242 0 027033 1288 1656opensslgcc -march=native -mtune=native -O3 -fwrapv -fPIC -fPIE -gdwarf-4 -Wall2026093020260831
11253256 0 022168 1280 1592opensslgcc -march=native -mtune=native -O -fwrapv -fPIC -fPIE -gdwarf-4 -Wall2026093020260831
11292242 0 022489 1288 1656opensslgcc -march=native -mtune=native -O2 -fwrapv -fPIC -fPIE -gdwarf-4 -Wall2026093020260831
1296325786 0 047455 1216 1592kcp/optimized1600AVX512gcc -march=native -mtune=native -O -fwrapv -fPIC -fPIE -gdwarf-4 -Wall2026093020260831
1298425799 0 052255 1216 1656kcp/optimized1600AVX512gcc -march=native -mtune=native -O3 -fwrapv -fPIC -fPIE -gdwarf-4 -Wall2026093020260831
1300024992 0 046839 1216 1656kcp/optimized1600AVX512gcc -march=native -mtune=native -O2 -fwrapv -fPIC -fPIE -gdwarf-4 -Wall2026093020260831
1301723666 0 043762 1192 1560kcp/optimized1600AVX512gcc -march=native -mtune=native -Os -fwrapv -fPIC -fPIE -gdwarf-4 -Wall2026093020260831
13381929 0 086871 1216 1656oncore64bitsgcc -march=native -mtune=native -O3 -fwrapv -fPIC -fPIE -gdwarf-4 -Wall2026093020260831
13472736 0 082071 1216 1656oncore64bitsgcc -march=native -mtune=native -O2 -fwrapv -fPIC -fPIE -gdwarf-4 -Wall2026093020260831
13534714 0 081887 1216 1592oncore64bitsgcc -march=native -mtune=native -O -fwrapv -fPIC -fPIE -gdwarf-4 -Wall2026093020260831
199504456 0 042143 1216 1656oncore32bitsgcc -march=native -mtune=native -O3 -fwrapv -fPIC -fPIE -gdwarf-4 -Wall2026093020260831
214181752 0 034871 1216 1656oncore32bitsgcc -march=native -mtune=native -O2 -fwrapv -fPIC -fPIE -gdwarf-4 -Wall2026093020260831
223211513 0 032914 1192 1560oncore32bitsgcc -march=native -mtune=native -Os -fwrapv -fPIC -fPIE -gdwarf-4 -Wall2026093020260831
224281749 0 034510 1208 1592oncore32bitsgcc -march=native -mtune=native -O -fwrapv -fPIC -fPIE -gdwarf-4 -Wall2026093020260831

Compiler output


KeccakP-1600-AVX2.c: KeccakP-1600-AVX2.c: In function 'crypto_hash_sha3224_kcp_optimized1600AVX2_constbranchindex_KeccakP1600_Permute_Nrounds':
KeccakP-1600-AVX2.c: KeccakP-1600-AVX2.c:86:17: warning: unused variable 'SRLV_C4' [-Wunused-variable]
KeccakP-1600-AVX2.c:    86 |     _ROLV_TYPE  SRLV##name = SET(64 - i0, 64 - i1, 64 - i2, 64 - i3);
KeccakP-1600-AVX2.c:       |                 ^~~~
KeccakP-1600-AVX2.c: KeccakP-1600-AVX2.c:100:1: note: in expansion of macro '_ROLV_CONST'
KeccakP-1600-AVX2.c:   100 | _ROLV_CONST(_C4, 27, 20, 39,  8)
KeccakP-1600-AVX2.c:       | ^~~~~~~~~~~
KeccakP-1600-AVX2.c: KeccakP-1600-AVX2.c:637:5: note: in expansion of macro 'KECCAK_CONSTANTS'
KeccakP-1600-AVX2.c:   637 |     KECCAK_CONSTANTS
KeccakP-1600-AVX2.c:       |     ^~~~~~~~~~~~~~~~
KeccakP-1600-AVX2.c: KeccakP-1600-AVX2.c:85:17: warning: unused variable 'SLLV_C4' [-Wunused-variable]
KeccakP-1600-AVX2.c:    85 |     _ROLV_TYPE  SLLV##name = SET(i0, i1, i2, i3); \
KeccakP-1600-AVX2.c:       |                 ^~~~
KeccakP-1600-AVX2.c: KeccakP-1600-AVX2.c:100:1: note: in expansion of macro '_ROLV_CONST'
KeccakP-1600-AVX2.c:   100 | _ROLV_CONST(_C4, 27, 20, 39,  8)
KeccakP-1600-AVX2.c:       | ^~~~~~~~~~~
KeccakP-1600-AVX2.c: KeccakP-1600-AVX2.c:637:5: note: in expansion of macro 'KECCAK_CONSTANTS'
KeccakP-1600-AVX2.c:   637 |     KECCAK_CONSTANTS
KeccakP-1600-AVX2.c:       |     ^~~~~~~~~~~~~~~~
KeccakP-1600-AVX2.c: KeccakP-1600-AVX2.c:86:17: warning: unused variable 'SRLV_A4' [-Wunused-variable]
KeccakP-1600-AVX2.c:    86 |     _ROLV_TYPE  SRLV##name = SET(64 - i0, 64 - i1, 64 - i2, 64 - i3);
KeccakP-1600-AVX2.c:       |                 ^~~~
KeccakP-1600-AVX2.c: KeccakP-1600-AVX2.c:99:1: note: in expansion of macro '_ROLV_CONST'
KeccakP-1600-AVX2.c:    99 | _ROLV_CONST(_A4, 18,  2, 61, 56) \
KeccakP-1600-AVX2.c:       | ^~~~~~~~~~~
KeccakP-1600-AVX2.c: ...
try.c: /usr/bin/ld: libcrypto_hash_sha3224.a(SHA3-224.o): in function `crypto_hash_sha3224_kcp_optimized1600AVX2_constbranchindex':
try.c: .../supercop-data/tripwire/amd64/try/c/gcc_-march=native_-mtune=native_-O2_-fwrapv_-fPIC_-fPIE_-gdwarf-4_-Wall/constbranchindex/crypto_hash/sha3224/kcp/optimized1600AVX2/work/SHA3-224.c:24:(.text+0x...): undefined reference to `KeccakWidth1600_Sponge'
try.c: collect2: error: ld returned 1 exit status

Number of similar (implementation,compiler) pairs: 1, namely:
ImplementationCompiler
kcp/optimized1600AVX2gcc -march=native -mtune=native -O2 -fwrapv -fPIC -fPIE -gdwarf-4 -Wall (14.2.0)

Compiler output


KeccakP-1600-AVX2.c: KeccakP-1600-AVX2.c: In function 'crypto_hash_sha3224_kcp_optimized1600AVX2_constbranchindex_KeccakP1600_Permute_Nrounds':
KeccakP-1600-AVX2.c: KeccakP-1600-AVX2.c:86:17: warning: unused variable 'SRLV_C4' [-Wunused-variable]
KeccakP-1600-AVX2.c:    86 |     _ROLV_TYPE  SRLV##name = SET(64 - i0, 64 - i1, 64 - i2, 64 - i3);
KeccakP-1600-AVX2.c:       |                 ^~~~
KeccakP-1600-AVX2.c: KeccakP-1600-AVX2.c:100:1: note: in expansion of macro '_ROLV_CONST'
KeccakP-1600-AVX2.c:   100 | _ROLV_CONST(_C4, 27, 20, 39,  8)
KeccakP-1600-AVX2.c:       | ^~~~~~~~~~~
KeccakP-1600-AVX2.c: KeccakP-1600-AVX2.c:637:5: note: in expansion of macro 'KECCAK_CONSTANTS'
KeccakP-1600-AVX2.c:   637 |     KECCAK_CONSTANTS
KeccakP-1600-AVX2.c:       |     ^~~~~~~~~~~~~~~~
KeccakP-1600-AVX2.c: KeccakP-1600-AVX2.c:85:17: warning: unused variable 'SLLV_C4' [-Wunused-variable]
KeccakP-1600-AVX2.c:    85 |     _ROLV_TYPE  SLLV##name = SET(i0, i1, i2, i3); \
KeccakP-1600-AVX2.c:       |                 ^~~~
KeccakP-1600-AVX2.c: KeccakP-1600-AVX2.c:100:1: note: in expansion of macro '_ROLV_CONST'
KeccakP-1600-AVX2.c:   100 | _ROLV_CONST(_C4, 27, 20, 39,  8)
KeccakP-1600-AVX2.c:       | ^~~~~~~~~~~
KeccakP-1600-AVX2.c: KeccakP-1600-AVX2.c:637:5: note: in expansion of macro 'KECCAK_CONSTANTS'
KeccakP-1600-AVX2.c:   637 |     KECCAK_CONSTANTS
KeccakP-1600-AVX2.c:       |     ^~~~~~~~~~~~~~~~
KeccakP-1600-AVX2.c: KeccakP-1600-AVX2.c:86:17: warning: unused variable 'SRLV_A4' [-Wunused-variable]
KeccakP-1600-AVX2.c:    86 |     _ROLV_TYPE  SRLV##name = SET(64 - i0, 64 - i1, 64 - i2, 64 - i3);
KeccakP-1600-AVX2.c:       |                 ^~~~
KeccakP-1600-AVX2.c: KeccakP-1600-AVX2.c:99:1: note: in expansion of macro '_ROLV_CONST'
KeccakP-1600-AVX2.c:    99 | _ROLV_CONST(_A4, 18,  2, 61, 56) \
KeccakP-1600-AVX2.c:       | ^~~~~~~~~~~
KeccakP-1600-AVX2.c: ...
try.c: /usr/bin/ld: libcrypto_hash_sha3224.a(SHA3-224.o): in function `crypto_hash_sha3224_kcp_optimized1600AVX2_constbranchindex':
try.c: .../supercop-data/tripwire/amd64/try/c/gcc_-march=native_-mtune=native_-O3_-fwrapv_-fPIC_-fPIE_-gdwarf-4_-Wall/constbranchindex/crypto_hash/sha3224/kcp/optimized1600AVX2/work/SHA3-224.c:24:(.text+0x...): undefined reference to `KeccakWidth1600_Sponge'
try.c: collect2: error: ld returned 1 exit status

Number of similar (implementation,compiler) pairs: 1, namely:
ImplementationCompiler
kcp/optimized1600AVX2gcc -march=native -mtune=native -O3 -fwrapv -fPIC -fPIE -gdwarf-4 -Wall (14.2.0)

Compiler output


KeccakP-1600-AVX2.c: KeccakP-1600-AVX2.c: In function 'crypto_hash_sha3224_kcp_optimized1600AVX2_constbranchindex_KeccakP1600_Permute_Nrounds':
KeccakP-1600-AVX2.c: KeccakP-1600-AVX2.c:86:17: warning: unused variable 'SRLV_C4' [-Wunused-variable]
KeccakP-1600-AVX2.c:    86 |     _ROLV_TYPE  SRLV##name = SET(64 - i0, 64 - i1, 64 - i2, 64 - i3);
KeccakP-1600-AVX2.c:       |                 ^~~~
KeccakP-1600-AVX2.c: KeccakP-1600-AVX2.c:100:1: note: in expansion of macro '_ROLV_CONST'
KeccakP-1600-AVX2.c:   100 | _ROLV_CONST(_C4, 27, 20, 39,  8)
KeccakP-1600-AVX2.c:       | ^~~~~~~~~~~
KeccakP-1600-AVX2.c: KeccakP-1600-AVX2.c:637:5: note: in expansion of macro 'KECCAK_CONSTANTS'
KeccakP-1600-AVX2.c:   637 |     KECCAK_CONSTANTS
KeccakP-1600-AVX2.c:       |     ^~~~~~~~~~~~~~~~
KeccakP-1600-AVX2.c: KeccakP-1600-AVX2.c:85:17: warning: unused variable 'SLLV_C4' [-Wunused-variable]
KeccakP-1600-AVX2.c:    85 |     _ROLV_TYPE  SLLV##name = SET(i0, i1, i2, i3); \
KeccakP-1600-AVX2.c:       |                 ^~~~
KeccakP-1600-AVX2.c: KeccakP-1600-AVX2.c:100:1: note: in expansion of macro '_ROLV_CONST'
KeccakP-1600-AVX2.c:   100 | _ROLV_CONST(_C4, 27, 20, 39,  8)
KeccakP-1600-AVX2.c:       | ^~~~~~~~~~~
KeccakP-1600-AVX2.c: KeccakP-1600-AVX2.c:637:5: note: in expansion of macro 'KECCAK_CONSTANTS'
KeccakP-1600-AVX2.c:   637 |     KECCAK_CONSTANTS
KeccakP-1600-AVX2.c:       |     ^~~~~~~~~~~~~~~~
KeccakP-1600-AVX2.c: KeccakP-1600-AVX2.c:86:17: warning: unused variable 'SRLV_A4' [-Wunused-variable]
KeccakP-1600-AVX2.c:    86 |     _ROLV_TYPE  SRLV##name = SET(64 - i0, 64 - i1, 64 - i2, 64 - i3);
KeccakP-1600-AVX2.c:       |                 ^~~~
KeccakP-1600-AVX2.c: KeccakP-1600-AVX2.c:99:1: note: in expansion of macro '_ROLV_CONST'
KeccakP-1600-AVX2.c:    99 | _ROLV_CONST(_A4, 18,  2, 61, 56) \
KeccakP-1600-AVX2.c:       | ^~~~~~~~~~~
KeccakP-1600-AVX2.c: ...
try.c: /usr/bin/ld: libcrypto_hash_sha3224.a(SHA3-224.o): in function `crypto_hash_sha3224_kcp_optimized1600AVX2_constbranchindex':
try.c: .../supercop-data/tripwire/amd64/try/c/gcc_-march=native_-mtune=native_-O_-fwrapv_-fPIC_-fPIE_-gdwarf-4_-Wall/constbranchindex/crypto_hash/sha3224/kcp/optimized1600AVX2/work/SHA3-224.c:24:(.text+0x...): undefined reference to `KeccakWidth1600_Sponge'
try.c: collect2: error: ld returned 1 exit status

Number of similar (implementation,compiler) pairs: 1, namely:
ImplementationCompiler
kcp/optimized1600AVX2gcc -march=native -mtune=native -O -fwrapv -fPIC -fPIE -gdwarf-4 -Wall (14.2.0)

Compiler output


KeccakP-1600-AVX2.c: KeccakP-1600-AVX2.c: In function 'crypto_hash_sha3224_kcp_optimized1600AVX2_constbranchindex_KeccakP1600_Permute_Nrounds':
KeccakP-1600-AVX2.c: KeccakP-1600-AVX2.c:86:17: warning: unused variable 'SRLV_C4' [-Wunused-variable]
KeccakP-1600-AVX2.c:    86 |     _ROLV_TYPE  SRLV##name = SET(64 - i0, 64 - i1, 64 - i2, 64 - i3);
KeccakP-1600-AVX2.c:       |                 ^~~~
KeccakP-1600-AVX2.c: KeccakP-1600-AVX2.c:100:1: note: in expansion of macro '_ROLV_CONST'
KeccakP-1600-AVX2.c:   100 | _ROLV_CONST(_C4, 27, 20, 39,  8)
KeccakP-1600-AVX2.c:       | ^~~~~~~~~~~
KeccakP-1600-AVX2.c: KeccakP-1600-AVX2.c:637:5: note: in expansion of macro 'KECCAK_CONSTANTS'
KeccakP-1600-AVX2.c:   637 |     KECCAK_CONSTANTS
KeccakP-1600-AVX2.c:       |     ^~~~~~~~~~~~~~~~
KeccakP-1600-AVX2.c: KeccakP-1600-AVX2.c:85:17: warning: unused variable 'SLLV_C4' [-Wunused-variable]
KeccakP-1600-AVX2.c:    85 |     _ROLV_TYPE  SLLV##name = SET(i0, i1, i2, i3); \
KeccakP-1600-AVX2.c:       |                 ^~~~
KeccakP-1600-AVX2.c: KeccakP-1600-AVX2.c:100:1: note: in expansion of macro '_ROLV_CONST'
KeccakP-1600-AVX2.c:   100 | _ROLV_CONST(_C4, 27, 20, 39,  8)
KeccakP-1600-AVX2.c:       | ^~~~~~~~~~~
KeccakP-1600-AVX2.c: KeccakP-1600-AVX2.c:637:5: note: in expansion of macro 'KECCAK_CONSTANTS'
KeccakP-1600-AVX2.c:   637 |     KECCAK_CONSTANTS
KeccakP-1600-AVX2.c:       |     ^~~~~~~~~~~~~~~~
KeccakP-1600-AVX2.c: KeccakP-1600-AVX2.c:86:17: warning: unused variable 'SRLV_A4' [-Wunused-variable]
KeccakP-1600-AVX2.c:    86 |     _ROLV_TYPE  SRLV##name = SET(64 - i0, 64 - i1, 64 - i2, 64 - i3);
KeccakP-1600-AVX2.c:       |                 ^~~~
KeccakP-1600-AVX2.c: KeccakP-1600-AVX2.c:99:1: note: in expansion of macro '_ROLV_CONST'
KeccakP-1600-AVX2.c:    99 | _ROLV_CONST(_A4, 18,  2, 61, 56) \
KeccakP-1600-AVX2.c:       | ^~~~~~~~~~~
KeccakP-1600-AVX2.c: ...
try.c: /usr/bin/ld: libcrypto_hash_sha3224.a(SHA3-224.o): in function `crypto_hash_sha3224_kcp_optimized1600AVX2_constbranchindex':
try.c: .../supercop-data/tripwire/amd64/try/c/gcc_-march=native_-mtune=native_-Os_-fwrapv_-fPIC_-fPIE_-gdwarf-4_-Wall/constbranchindex/crypto_hash/sha3224/kcp/optimized1600AVX2/work/SHA3-224.c:24:(.text+0x...): undefined reference to `KeccakWidth1600_Sponge'
try.c: collect2: error: ld returned 1 exit status

Number of similar (implementation,compiler) pairs: 1, namely:
ImplementationCompiler
kcp/optimized1600AVX2gcc -march=native -mtune=native -Os -fwrapv -fPIC -fPIE -gdwarf-4 -Wall (14.2.0)

Compiler output


KeccakP-1600-AVX512.c: KeccakP-1600-AVX512.c: In function 'KeccakP1600_Permute_12rounds':
KeccakP-1600-AVX512.c: KeccakP-1600-AVX512.c:525:18: warning: unused variable 'i' [-Wunused-variable]
KeccakP-1600-AVX512.c:   525 |     unsigned int i;
KeccakP-1600-AVX512.c:       |                  ^
try.c: In file included from try-anything-timecop.c:3:
try.c: try-anything.c:26:10: fatal error: valgrind/memcheck.h: No such file or directory
try.c:    26 | #include <valgrind/memcheck.h>
try.c:       |          ^~~~~~~~~~~~~~~~~~~~~
try.c: compilation terminated.

Number of similar (implementation,compiler) pairs: 4, namely:
ImplementationCompiler
kcp/optimized1600AVX512gcc -march=native -mtune=native -O2 -fwrapv -fPIC -fPIE -gdwarf-4 -Wall (14.2.0)
kcp/optimized1600AVX512gcc -march=native -mtune=native -O3 -fwrapv -fPIC -fPIE -gdwarf-4 -Wall (14.2.0)
kcp/optimized1600AVX512gcc -march=native -mtune=native -O -fwrapv -fPIC -fPIE -gdwarf-4 -Wall (14.2.0)
kcp/optimized1600AVX512gcc -march=native -mtune=native -Os -fwrapv -fPIC -fPIE -gdwarf-4 -Wall (14.2.0)

Compiler output


try.c: In file included from try-anything-timecop.c:3:
try.c: try-anything.c:26:10: fatal error: valgrind/memcheck.h: No such file or directory
try.c:    26 | #include <valgrind/memcheck.h>
try.c:       |          ^~~~~~~~~~~~~~~~~~~~~
try.c: compilation terminated.

Number of similar (implementation,compiler) pairs: 12, namely:
ImplementationCompiler
oncore32bitsgcc -march=native -mtune=native -O2 -fwrapv -fPIC -fPIE -gdwarf-4 -Wall (14.2.0)
oncore32bitsgcc -march=native -mtune=native -O3 -fwrapv -fPIC -fPIE -gdwarf-4 -Wall (14.2.0)
oncore32bitsgcc -march=native -mtune=native -O -fwrapv -fPIC -fPIE -gdwarf-4 -Wall (14.2.0)
oncore32bitsgcc -march=native -mtune=native -Os -fwrapv -fPIC -fPIE -gdwarf-4 -Wall (14.2.0)
oncore64bitsgcc -march=native -mtune=native -O2 -fwrapv -fPIC -fPIE -gdwarf-4 -Wall (14.2.0)
oncore64bitsgcc -march=native -mtune=native -O3 -fwrapv -fPIC -fPIE -gdwarf-4 -Wall (14.2.0)
oncore64bitsgcc -march=native -mtune=native -O -fwrapv -fPIC -fPIE -gdwarf-4 -Wall (14.2.0)
oncore64bitsgcc -march=native -mtune=native -Os -fwrapv -fPIC -fPIE -gdwarf-4 -Wall (14.2.0)
opensslgcc -march=native -mtune=native -O2 -fwrapv -fPIC -fPIE -gdwarf-4 -Wall (14.2.0)
opensslgcc -march=native -mtune=native -O3 -fwrapv -fPIC -fPIE -gdwarf-4 -Wall (14.2.0)
opensslgcc -march=native -mtune=native -O -fwrapv -fPIC -fPIE -gdwarf-4 -Wall (14.2.0)
opensslgcc -march=native -mtune=native -Os -fwrapv -fPIC -fPIE -gdwarf-4 -Wall (14.2.0)

Compiler output


hash.c: hash.c:1:10: fatal error: libkeccak.a.headers/KeccakSponge.h: No such file or directory
hash.c:     1 | #include <libkeccak.a.headers/KeccakSponge.h>
hash.c:       |          ^~~~~~~~~~~~~~~~~~~~~~~~~~~~~~~~~~~~
hash.c: compilation terminated.

Number of similar (implementation,compiler) pairs: 4, namely:
ImplementationCompiler
usekcpgcc -march=native -mtune=native -O2 -fwrapv -fPIC -fPIE -gdwarf-4 -Wall (14.2.0)
usekcpgcc -march=native -mtune=native -O3 -fwrapv -fPIC -fPIE -gdwarf-4 -Wall (14.2.0)
usekcpgcc -march=native -mtune=native -O -fwrapv -fPIC -fPIE -gdwarf-4 -Wall (14.2.0)
usekcpgcc -march=native -mtune=native -Os -fwrapv -fPIC -fPIE -gdwarf-4 -Wall (14.2.0)

Namespace violations


KeccakP-1600-AVX512.o KeccakF1600_FastLoop_Absorb T
KeccakP-1600-AVX512.o KeccakP1600RoundConstants R
KeccakP-1600-AVX512.o KeccakP1600_12rounds_FastLoop_Absorb T
KeccakP-1600-AVX512.o KeccakP1600_AddBytes T
KeccakP-1600-AVX512.o KeccakP1600_ExtractAndAddBytes T
KeccakP-1600-AVX512.o KeccakP1600_ExtractBytes T
KeccakP-1600-AVX512.o KeccakP1600_Initialize T
KeccakP-1600-AVX512.o KeccakP1600_OverwriteBytes T
KeccakP-1600-AVX512.o KeccakP1600_OverwriteWithZeroes T
KeccakP-1600-AVX512.o KeccakP1600_Permute_12rounds T
KeccakP-1600-AVX512.o KeccakP1600_Permute_24rounds T
KeccakP-1600-AVX512.o KeccakP1600_Permute_Nrounds T
KeccakSpongeWidth1600.o KeccakWidth1600_12rounds_Sponge T
KeccakSpongeWidth1600.o KeccakWidth1600_12rounds_SpongeAbsorb T
KeccakSpongeWidth1600.o KeccakWidth1600_12rounds_SpongeAbsorbLastFewBits T
KeccakSpongeWidth1600.o KeccakWidth1600_12rounds_SpongeInitialize T
KeccakSpongeWidth1600.o KeccakWidth1600_12rounds_SpongeSqueeze T
KeccakSpongeWidth1600.o KeccakWidth1600_Sponge T
KeccakSpongeWidth1600.o KeccakWidth1600_SpongeAbsorb T
KeccakSpongeWidth1600.o KeccakWidth1600_SpongeAbsorbLastFewBits T
KeccakSpongeWidth1600.o KeccakWidth1600_SpongeInitialize T
KeccakSpongeWidth1600.o KeccakWidth1600_SpongeSqueeze T

Number of similar (implementation,compiler) pairs: 4, namely:
ImplementationCompiler
kcp/optimized1600AVX512gcc -march=native -mtune=native -O2 -fwrapv -fPIC -fPIE -gdwarf-4 -Wall (14.2.0)
kcp/optimized1600AVX512gcc -march=native -mtune=native -O3 -fwrapv -fPIC -fPIE -gdwarf-4 -Wall (14.2.0)
kcp/optimized1600AVX512gcc -march=native -mtune=native -O -fwrapv -fPIC -fPIE -gdwarf-4 -Wall (14.2.0)
kcp/optimized1600AVX512gcc -march=native -mtune=native -Os -fwrapv -fPIC -fPIE -gdwarf-4 -Wall (14.2.0)

TIMECOP error (can be valgrind bug)


error 127
timeout: failed to run command 'valgrind': No such file or directory

Number of similar (implementation,compiler) pairs: 16, namely:
ImplementationCompiler
kcp/optimized1600AVX512gcc -march=native -mtune=native -O2 -fwrapv -fPIC -fPIE -gdwarf-4 -Wall (14.2.0)
kcp/optimized1600AVX512gcc -march=native -mtune=native -O3 -fwrapv -fPIC -fPIE -gdwarf-4 -Wall (14.2.0)
kcp/optimized1600AVX512gcc -march=native -mtune=native -O -fwrapv -fPIC -fPIE -gdwarf-4 -Wall (14.2.0)
kcp/optimized1600AVX512gcc -march=native -mtune=native -Os -fwrapv -fPIC -fPIE -gdwarf-4 -Wall (14.2.0)
oncore32bitsgcc -march=native -mtune=native -O2 -fwrapv -fPIC -fPIE -gdwarf-4 -Wall (14.2.0)
oncore32bitsgcc -march=native -mtune=native -O3 -fwrapv -fPIC -fPIE -gdwarf-4 -Wall (14.2.0)
oncore32bitsgcc -march=native -mtune=native -O -fwrapv -fPIC -fPIE -gdwarf-4 -Wall (14.2.0)
oncore32bitsgcc -march=native -mtune=native -Os -fwrapv -fPIC -fPIE -gdwarf-4 -Wall (14.2.0)
oncore64bitsgcc -march=native -mtune=native -O2 -fwrapv -fPIC -fPIE -gdwarf-4 -Wall (14.2.0)
oncore64bitsgcc -march=native -mtune=native -O3 -fwrapv -fPIC -fPIE -gdwarf-4 -Wall (14.2.0)
oncore64bitsgcc -march=native -mtune=native -O -fwrapv -fPIC -fPIE -gdwarf-4 -Wall (14.2.0)
oncore64bitsgcc -march=native -mtune=native -Os -fwrapv -fPIC -fPIE -gdwarf-4 -Wall (14.2.0)
opensslgcc -march=native -mtune=native -O2 -fwrapv -fPIC -fPIE -gdwarf-4 -Wall (14.2.0)
opensslgcc -march=native -mtune=native -O3 -fwrapv -fPIC -fPIE -gdwarf-4 -Wall (14.2.0)
opensslgcc -march=native -mtune=native -O -fwrapv -fPIC -fPIE -gdwarf-4 -Wall (14.2.0)
opensslgcc -march=native -mtune=native -Os -fwrapv -fPIC -fPIE -gdwarf-4 -Wall (14.2.0)