Test results for amd64, tripwire, crypto_hash/mgrostl256

[Page version: 20261004 16:18:08]

Measurements for amd64, tripwire, crypto_hash Test results for amd64, tripwire, crypto_hash Test results for crypto_hash/mgrostl256
Computer: tripwire
Microarchitecture: amd64; Zen 5 (b00f21)
Architecture: amd64
CPU ID: AuthenticAMD-00b00f21-178bfbff
SUPERCOP version: 20260831
Operation: crypto_hash
Primitive: mgrostl256
TimeObject sizeTest sizeImplementationCompilerBenchmark dateSUPERCOP version
3901646748 0 044942 1224 1592T:opt-32gcc -march=native -mtune=native -O -fwrapv -fPIC -fPIE -gdwarf-4 -Wall2026093020260831
4004142818 0 041682 1208 1560T:opt-32gcc -march=native -mtune=native -Os -fwrapv -fPIC -fPIE -gdwarf-4 -Wall2026093020260831
4114149057 0 051239 1232 1656T:opt-32gcc -march=native -mtune=native -O3 -fwrapv -fPIC -fPIE -gdwarf-4 -Wall2026093020260831
4200346865 0 045463 1232 1656T:opt-32gcc -march=native -mtune=native -O2 -fwrapv -fPIC -fPIE -gdwarf-4 -Wall2026093020260831
126467215674 384 041974 1616 1656T:refgcc -march=native -mtune=native -O3 -fwrapv -fPIC -fPIE -gdwarf-4 -Wall2026093020260831
12671415770 384 027558 1616 1656T:refgcc -march=native -mtune=native -O2 -fwrapv -fPIC -fPIE -gdwarf-4 -Wall2026093020260831
16593715018 384 026549 1608 1592T:refgcc -march=native -mtune=native -O -fwrapv -fPIC -fPIE -gdwarf-4 -Wall2026093020260831
34677423684 384 023833 1592 1560T:refgcc -march=native -mtune=native -Os -fwrapv -fPIC -fPIE -gdwarf-4 -Wall2026093020260831

Compiler output


hash.c: hash.c: In function 'Transform':
hash.c: hash.c:386:5: warning: 'F' may be used uninitialized [-Wmaybe-uninitialized]
hash.c:   386 |     F(ctx->chaining,(u32*)input,(u32*)ctx->counter);//modified oct28
hash.c:       |     ^~~~~~~~~~~~~~~~~~~~~~~~~~~~~~~~~~~~~~~~~~~~~~~
hash.c: hash.c:361:10: note: 'F' was declared here
hash.c:   361 |   void (*F)(u32*,const u32*,u32*);      //modified oct28
hash.c:       |          ^
mGroestl.c: mGroestl.c: In function 'Transform':
mGroestl.c: mGroestl.c:384:5: warning: 'F' may be used uninitialized [-Wmaybe-uninitialized]
mGroestl.c:   384 |     F(ctx->chaining,(u32*)input,(u32*)ctx->counter);//modified oct28
mGroestl.c:       |     ^~~~~~~~~~~~~~~~~~~~~~~~~~~~~~~~~~~~~~~~~~~~~~~
mGroestl.c: mGroestl.c:359:10: note: 'F' was declared here
mGroestl.c:   359 |   void (*F)(u32*,const u32*,u32*);      //modified oct28
mGroestl.c:       |          ^

Number of similar (implementation,compiler) pairs: 3, namely:
ImplementationCompiler
T:opt-32gcc -march=native -mtune=native -O2 -fwrapv -fPIC -fPIE -gdwarf-4 -Wall (14.2.0)
T:opt-32gcc -march=native -mtune=native -O -fwrapv -fPIC -fPIE -gdwarf-4 -Wall (14.2.0)
T:opt-32gcc -march=native -mtune=native -Os -fwrapv -fPIC -fPIE -gdwarf-4 -Wall (14.2.0)

Compiler output


hash.c: hash.c: In function 'Transform':
hash.c: hash.c:386:5: warning: 'F' may be used uninitialized [-Wmaybe-uninitialized]
hash.c:   386 |     F(ctx->chaining,(u32*)input,(u32*)ctx->counter);//modified oct28
hash.c:       |     ^~~~~~~~~~~~~~~~~~~~~~~~~~~~~~~~~~~~~~~~~~~~~~~
hash.c: hash.c:361:10: note: 'F' was declared here
hash.c:   361 |   void (*F)(u32*,const u32*,u32*);      //modified oct28
hash.c:       |          ^
hash.c: In function 'Transform',
hash.c:     inlined from 'Update' at hash.c:562:3:
hash.c: hash.c:386:5: warning: 'F' may be used uninitialized [-Wmaybe-uninitialized]
hash.c:   386 |     F(ctx->chaining,(u32*)input,(u32*)ctx->counter);//modified oct28
hash.c:       |     ^~~~~~~~~~~~~~~~~~~~~~~~~~~~~~~~~~~~~~~~~~~~~~~
hash.c: hash.c: In function 'Update':
hash.c: hash.c:361:10: note: 'F' was declared here
hash.c:   361 |   void (*F)(u32*,const u32*,u32*);      //modified oct28
hash.c:       |          ^
hash.c: In function 'Init',
hash.c:     inlined from 'Init' at hash.c:474:12,
hash.c:     inlined from 'Hash' at hash.c:709:14:
hash.c: hash.c:497:27: warning: 'context.blocksize' may be used uninitialized [-Wmaybe-uninitialized]
hash.c:   497 |   ctx->buffer = malloc(ctx->blocksize);         //modified
hash.c:       |                        ~~~^~~~~~~~~~~
hash.c: hash.c: In function 'Hash':
hash.c: hash.c:706:13: note: 'context' declared here
hash.c:   706 |   hashState context;
hash.c: ...
mGroestl.c: mGroestl.c: In function 'Transform':
mGroestl.c: mGroestl.c:384:5: warning: 'F' may be used uninitialized [-Wmaybe-uninitialized]
mGroestl.c:   384 |     F(ctx->chaining,(u32*)input,(u32*)ctx->counter);//modified oct28
mGroestl.c:       |     ^~~~~~~~~~~~~~~~~~~~~~~~~~~~~~~~~~~~~~~~~~~~~~~
mGroestl.c: mGroestl.c:359:10: note: 'F' was declared here
mGroestl.c:   359 |   void (*F)(u32*,const u32*,u32*);      //modified oct28
mGroestl.c:       |          ^
mGroestl.c: In function 'Transform',
mGroestl.c:     inlined from 'Update' at mGroestl.c:560:3:
mGroestl.c: mGroestl.c:384:5: warning: 'F' may be used uninitialized [-Wmaybe-uninitialized]
mGroestl.c:   384 |     F(ctx->chaining,(u32*)input,(u32*)ctx->counter);//modified oct28
mGroestl.c:       |     ^~~~~~~~~~~~~~~~~~~~~~~~~~~~~~~~~~~~~~~~~~~~~~~
mGroestl.c: mGroestl.c: In function 'Update':
mGroestl.c: mGroestl.c:359:10: note: 'F' was declared here
mGroestl.c:   359 |   void (*F)(u32*,const u32*,u32*);      //modified oct28
mGroestl.c:       |          ^
mGroestl.c: In function 'Init',
mGroestl.c:     inlined from 'Init' at mGroestl.c:472:12,
mGroestl.c:     inlined from 'Hash' at mGroestl.c:707:14:
mGroestl.c: mGroestl.c:495:27: warning: 'context.blocksize' may be used uninitialized [-Wmaybe-uninitialized]
mGroestl.c:   495 |   ctx->buffer = malloc(ctx->blocksize);         //modified
mGroestl.c:       |                        ~~~^~~~~~~~~~~
mGroestl.c: mGroestl.c: In function 'Hash':
mGroestl.c: mGroestl.c:704:13: note: 'context' declared here
mGroestl.c:   704 |   hashState context;
mGroestl.c: ...

Number of similar (implementation,compiler) pairs: 1, namely:
ImplementationCompiler
T:opt-32gcc -march=native -mtune=native -O3 -fwrapv -fPIC -fPIE -gdwarf-4 -Wall (14.2.0)

Compiler output


hash.c: hash.c: In function 'F512':
hash.c: hash.c:230: warning: ignoring '#pragma vector aligned' [-Wunknown-pragmas]
hash.c:   230 | #pragma vector aligned
hash.c: hash.c: In function 'F1024':
hash.c: hash.c:267: warning: ignoring '#pragma vector aligned' [-Wunknown-pragmas]
hash.c:   267 | #pragma vector aligned
hash.c: In function 'Init',
hash.c:     inlined from 'Init' at hash.c:396:12,
hash.c:     inlined from 'Hash' at hash.c:619:14:
hash.c: hash.c:434:30: warning: 'context.statesize' may be used uninitialized [-Wmaybe-uninitialized]
hash.c:   434 | while (ctx->cnt_buf_ptr < ctx->statesize) {
hash.c:       |                           ~~~^~~~~~~~~~~
hash.c: hash.c: In function 'Hash':
hash.c: hash.c:616:13: note: 'context' declared here
hash.c:   616 |   hashState context;
hash.c:       |             ^~~~~~~
try.c: /usr/bin/ld: libcrypto_hash_mgrostl256.a(hash.o): in function `Transform':
try.c: .../supercop-data/tripwire/amd64/try/c/gcc_-march=native_-mtune=native_-O2_-fwrapv_-fPIC_-fPIE_-gdwarf-4_-Wall/timingleaks/crypto_hash/mgrostl256/opt-64/work/hash.c:304:(.text+0x...): undefined reference to `F512'
try.c: collect2: error: ld returned 1 exit status

Number of similar (implementation,compiler) pairs: 1, namely:
ImplementationCompiler
T:opt-64gcc -march=native -mtune=native -O2 -fwrapv -fPIC -fPIE -gdwarf-4 -Wall (14.2.0)

Compiler output


hash.c: hash.c: In function 'F512':
hash.c: hash.c:230: warning: ignoring '#pragma vector aligned' [-Wunknown-pragmas]
hash.c:   230 | #pragma vector aligned
hash.c: hash.c: In function 'F1024':
hash.c: hash.c:267: warning: ignoring '#pragma vector aligned' [-Wunknown-pragmas]
hash.c:   267 | #pragma vector aligned
hash.c: In function 'Init',
hash.c:     inlined from 'Init' at hash.c:396:12,
hash.c:     inlined from 'Hash' at hash.c:619:14:
hash.c: hash.c:434:30: warning: 'context.statesize' may be used uninitialized [-Wmaybe-uninitialized]
hash.c:   434 | while (ctx->cnt_buf_ptr < ctx->statesize) {
hash.c:       |                           ~~~^~~~~~~~~~~
hash.c: hash.c: In function 'Hash':
hash.c: hash.c:616:13: note: 'context' declared here
hash.c:   616 |   hashState context;
hash.c:       |             ^~~~~~~
hash.c: In function 'Transform',
hash.c:     inlined from 'Update' at hash.c:479:3,
hash.c:     inlined from 'Hash' at hash.c:623:14:
hash.c: hash.c:300:10: warning: 'context.size' may be used uninitialized [-Wmaybe-uninitialized]
hash.c:   300 |   if (ctx->size == SHORT) {
hash.c:       |       ~~~^~~~~~
hash.c: hash.c: In function 'Hash':
hash.c: hash.c:616:13: note: 'context' declared here
hash.c:   616 |   hashState context;
hash.c: ...
try.c: /usr/bin/ld: libcrypto_hash_mgrostl256.a(hash.o): in function `Transform':
try.c: .../supercop-data/tripwire/amd64/try/c/gcc_-march=native_-mtune=native_-O3_-fwrapv_-fPIC_-fPIE_-gdwarf-4_-Wall/timingleaks/crypto_hash/mgrostl256/opt-64/work/hash.c:304:(.text+0x...): undefined reference to `F512'
try.c: /usr/bin/ld: .../supercop-data/tripwire/amd64/try/c/gcc_-march=native_-mtune=native_-O3_-fwrapv_-fPIC_-fPIE_-gdwarf-4_-Wall/timingleaks/crypto_hash/mgrostl256/opt-64/work/hash.c:304:(.text+0x...): undefined reference to `F512'
try.c: /usr/bin/ld: .../supercop-data/tripwire/amd64/try/c/gcc_-march=native_-mtune=native_-O3_-fwrapv_-fPIC_-fPIE_-gdwarf-4_-Wall/timingleaks/crypto_hash/mgrostl256/opt-64/work/hash.c:304:(.text+0x...): undefined reference to `F512'
try.c: /usr/bin/ld: .../supercop-data/tripwire/amd64/try/c/gcc_-march=native_-mtune=native_-O3_-fwrapv_-fPIC_-fPIE_-gdwarf-4_-Wall/timingleaks/crypto_hash/mgrostl256/opt-64/work/hash.c:304:(.text+0x...): undefined reference to `F512'
try.c: /usr/bin/ld: .../supercop-data/tripwire/amd64/try/c/gcc_-march=native_-mtune=native_-O3_-fwrapv_-fPIC_-fPIE_-gdwarf-4_-Wall/timingleaks/crypto_hash/mgrostl256/opt-64/work/hash.c:304:(.text+0x...): undefined reference to `F512'
try.c: /usr/bin/ld: libcrypto_hash_mgrostl256.a(hash.o):.../supercop-data/tripwire/amd64/try/c/gcc_-march=native_-mtune=native_-O3_-fwrapv_-fPIC_-fPIE_-gdwarf-4_-Wall/timingleaks/crypto_hash/mgrostl256/opt-64/work/hash.c:304: more undefined references to `F512' follow
try.c: collect2: error: ld returned 1 exit status

Number of similar (implementation,compiler) pairs: 1, namely:
ImplementationCompiler
T:opt-64gcc -march=native -mtune=native -O3 -fwrapv -fPIC -fPIE -gdwarf-4 -Wall (14.2.0)

Compiler output


hash.c: hash.c: In function 'F512':
hash.c: hash.c:230: warning: ignoring '#pragma vector aligned' [-Wunknown-pragmas]
hash.c:   230 | #pragma vector aligned
hash.c: hash.c: In function 'F1024':
hash.c: hash.c:267: warning: ignoring '#pragma vector aligned' [-Wunknown-pragmas]
hash.c:   267 | #pragma vector aligned
try.c: /usr/bin/ld: libcrypto_hash_mgrostl256.a(hash.o): in function `Transform':
try.c: .../supercop-data/tripwire/amd64/try/c/gcc_-march=native_-mtune=native_-O_-fwrapv_-fPIC_-fPIE_-gdwarf-4_-Wall/timingleaks/crypto_hash/mgrostl256/opt-64/work/hash.c:304:(.text+0x...): undefined reference to `F512'
try.c: collect2: error: ld returned 1 exit status

Number of similar (implementation,compiler) pairs: 1, namely:
ImplementationCompiler
T:opt-64gcc -march=native -mtune=native -O -fwrapv -fPIC -fPIE -gdwarf-4 -Wall (14.2.0)

Compiler output


hash.c: hash.c: In function 'F512':
hash.c: hash.c:230: warning: ignoring '#pragma vector aligned' [-Wunknown-pragmas]
hash.c:   230 | #pragma vector aligned
hash.c: hash.c: In function 'F1024':
hash.c: hash.c:267: warning: ignoring '#pragma vector aligned' [-Wunknown-pragmas]
hash.c:   267 | #pragma vector aligned
try.c: /usr/bin/ld: libcrypto_hash_mgrostl256.a(hash.o): in function `Transform':
try.c: .../supercop-data/tripwire/amd64/try/c/gcc_-march=native_-mtune=native_-Os_-fwrapv_-fPIC_-fPIE_-gdwarf-4_-Wall/timingleaks/crypto_hash/mgrostl256/opt-64/work/hash.c:304:(.text+0x...): undefined reference to `F512'
try.c: collect2: error: ld returned 1 exit status

Number of similar (implementation,compiler) pairs: 1, namely:
ImplementationCompiler
T:opt-64gcc -march=native -mtune=native -Os -fwrapv -fPIC -fPIE -gdwarf-4 -Wall (14.2.0)

Namespace violations


hash.o F1024 T
hash.o F512 T
hash.o Final T
hash.o Hash T
hash.o Init T
hash.o OutputTransformation T
hash.o PrintHash T
hash.o RND1024P T
hash.o RND1024Q T
hash.o RND512P T
hash.o RND512Q T
hash.o T R
hash.o Transform T
hash.o Update T
mGroestl.o F1024 T
mGroestl.o F512 T
mGroestl.o Final T
mGroestl.o Hash T
mGroestl.o Init T
mGroestl.o OutputTransformation T
mGroestl.o PrintHash T
mGroestl.o RND1024P T
mGroestl.o RND1024Q T
mGroestl.o RND512P T
mGroestl.o RND512Q T
mGroestl.o T R
mGroestl.o Transform T
mGroestl.o Update T

Number of similar (implementation,compiler) pairs: 4, namely:
ImplementationCompiler
T:opt-32gcc -march=native -mtune=native -O2 -fwrapv -fPIC -fPIE -gdwarf-4 -Wall (14.2.0)
T:opt-32gcc -march=native -mtune=native -O3 -fwrapv -fPIC -fPIE -gdwarf-4 -Wall (14.2.0)
T:opt-32gcc -march=native -mtune=native -O -fwrapv -fPIC -fPIE -gdwarf-4 -Wall (14.2.0)
T:opt-32gcc -march=native -mtune=native -Os -fwrapv -fPIC -fPIE -gdwarf-4 -Wall (14.2.0)

Namespace violations


hash.o AddRoundConstant T
hash.o Final T
hash.o Hash T
hash.o Init T
hash.o MixBytes T
hash.o OutputTransformation T
hash.o P T
hash.o PrintHash T
hash.o Q T
hash.o S D
hash.o Shift D
hash.o ShiftBytes T
hash.o SubBytes T
hash.o Transform T
hash.o Update T

Number of similar (implementation,compiler) pairs: 4, namely:
ImplementationCompiler
T:refgcc -march=native -mtune=native -O2 -fwrapv -fPIC -fPIE -gdwarf-4 -Wall (14.2.0)
T:refgcc -march=native -mtune=native -O3 -fwrapv -fPIC -fPIE -gdwarf-4 -Wall (14.2.0)
T:refgcc -march=native -mtune=native -O -fwrapv -fPIC -fPIE -gdwarf-4 -Wall (14.2.0)
T:refgcc -march=native -mtune=native -Os -fwrapv -fPIC -fPIE -gdwarf-4 -Wall (14.2.0)