Test results for amd64, tripwire, crypto_hash/luffa512
[Page version: 20261004 16:18:08]
Measurements for amd64, tripwire, crypto_hash
Test results for amd64, tripwire, crypto_hash
Test results for crypto_hash/luffa512
Computer: tripwire
Microarchitecture: amd64; Zen 5 (b00f21)
Architecture: amd64
CPU ID: AuthenticAMD-00b00f21-178bfbff
SUPERCOP version: 20260831
Operation: crypto_hash
Primitive: luffa512
| Time | Object size | Test size | Implementation | Compiler | Benchmark date | SUPERCOP version |
| 31542 | 10189 0 544 | 36375 1216 2200 | T:sse2 | gcc -march=native -mtune=native -O3 -fwrapv -fPIC -fPIE -gdwarf-4 -Wall | 20260930 | 20260831 |
| 32671 | 8348 0 544 | 28370 1192 2104 | T:sse2 | gcc -march=native -mtune=native -Os -fwrapv -fPIC -fPIE -gdwarf-4 -Wall | 20260930 | 20260831 |
| 32683 | 10428 0 544 | 31838 1208 2136 | T:sse2 | gcc -march=native -mtune=native -O -fwrapv -fPIC -fPIE -gdwarf-4 -Wall | 20260930 | 20260831 |
| 32890 | 9816 0 544 | 31511 1216 2200 | T:sse2 | gcc -march=native -mtune=native -O2 -fwrapv -fPIC -fPIE -gdwarf-4 -Wall | 20260930 | 20260831 |
| 35720 | 28697 0 0 | 55007 1216 1656 | T:sphlib | gcc -march=native -mtune=native -O3 -fwrapv -fPIC -fPIE -gdwarf-4 -Wall | 20260930 | 20260831 |
| 36089 | 28697 0 0 | 50455 1216 1656 | T:sphlib | gcc -march=native -mtune=native -O2 -fwrapv -fPIC -fPIE -gdwarf-4 -Wall | 20260930 | 20260831 |
| 37669 | 24744 0 0 | 44858 1192 1560 | T:sphlib | gcc -march=native -mtune=native -Os -fwrapv -fPIC -fPIE -gdwarf-4 -Wall | 20260930 | 20260831 |
| 37728 | 27712 0 0 | 49199 1216 1592 | T:sphlib | gcc -march=native -mtune=native -O -fwrapv -fPIC -fPIE -gdwarf-4 -Wall | 20260930 | 20260831 |
| 42890 | 11568 320 0 | 33295 1544 1656 | T:opt32 | gcc -march=native -mtune=native -O2 -fwrapv -fPIC -fPIE -gdwarf-4 -Wall | 20260930 | 20260831 |
| 47190 | 18669 320 0 | 44959 1544 1656 | T:opt32 | gcc -march=native -mtune=native -O3 -fwrapv -fPIC -fPIE -gdwarf-4 -Wall | 20260930 | 20260831 |
| 59966 | 8831 320 0 | 28922 1520 1560 | T:opt32 | gcc -march=native -mtune=native -Os -fwrapv -fPIC -fPIE -gdwarf-4 -Wall | 20260930 | 20260831 |
| 71557 | 11816 320 0 | 33294 1536 1592 | T:opt32 | gcc -march=native -mtune=native -O -fwrapv -fPIC -fPIE -gdwarf-4 -Wall | 20260930 | 20260831 |
Compiler output
luffa.c: luffa.c:143:22: warning: 'RC34' defined but not used [-Wunused-const-variable=]
luffa.c: 143 | static const sph_u32 RC34[8] = {
luffa.c: | ^~~~
luffa.c: luffa.c:136:22: warning: 'RC30' defined but not used [-Wunused-const-variable=]
luffa.c: 136 | static const sph_u32 RC30[8] = {
luffa.c: | ^~~~
luffa.c: luffa.c:97:22: warning: 'RC14' defined but not used [-Wunused-const-variable=]
luffa.c: 97 | static const sph_u32 RC14[8] = {
luffa.c: | ^~~~
luffa.c: luffa.c:90:22: warning: 'RC10' defined but not used [-Wunused-const-variable=]
luffa.c: 90 | static const sph_u32 RC10[8] = {
luffa.c: | ^~~~
luffa.c: luffa.c:83:22: warning: 'RC04' defined but not used [-Wunused-const-variable=]
luffa.c: 83 | static const sph_u32 RC04[8] = {
luffa.c: | ^~~~
luffa.c: luffa.c:76:22: warning: 'RC00' defined but not used [-Wunused-const-variable=]
luffa.c: 76 | static const sph_u32 RC00[8] = {
luffa.c: | ^~~~
Number of similar (implementation,compiler) pairs: 4, namely:
| Implementation | Compiler |
| T:sphlib | gcc -march=native -mtune=native -O2 -fwrapv -fPIC -fPIE -gdwarf-4 -Wall (14.2.0) |
| T:sphlib | gcc -march=native -mtune=native -O3 -fwrapv -fPIC -fPIE -gdwarf-4 -Wall (14.2.0) |
| T:sphlib | gcc -march=native -mtune=native -O -fwrapv -fPIC -fPIE -gdwarf-4 -Wall (14.2.0) |
| T:sphlib | gcc -march=native -mtune=native -Os -fwrapv -fPIC -fPIE -gdwarf-4 -Wall (14.2.0) |
Compiler output
try.c: /usr/bin/ld: libcrypto_hash_luffa512.a(luffa_x64asm.o): relocation R_X86_64_32S against symbol `IV' can not be used when making a PIE object; recompile with -fPIE
try.c: /usr/bin/ld: failed to set dynamic section sizes: bad value
try.c: collect2: error: ld returned 1 exit status
Number of similar (implementation,compiler) pairs: 16, namely:
| Implementation | Compiler |
| T:sse2_x64asm | gcc -march=native -mtune=native -O2 -fwrapv -fPIC -fPIE -gdwarf-4 -Wall (14.2.0) |
| T:sse2_x64asm | gcc -march=native -mtune=native -O3 -fwrapv -fPIC -fPIE -gdwarf-4 -Wall (14.2.0) |
| T:sse2_x64asm | gcc -march=native -mtune=native -O -fwrapv -fPIC -fPIE -gdwarf-4 -Wall (14.2.0) |
| T:sse2_x64asm | gcc -march=native -mtune=native -Os -fwrapv -fPIC -fPIE -gdwarf-4 -Wall (14.2.0) |
| T:sse2_x64asm-2 | gcc -march=native -mtune=native -O2 -fwrapv -fPIC -fPIE -gdwarf-4 -Wall (14.2.0) |
| T:sse2_x64asm-2 | gcc -march=native -mtune=native -O3 -fwrapv -fPIC -fPIE -gdwarf-4 -Wall (14.2.0) |
| T:sse2_x64asm-2 | gcc -march=native -mtune=native -O -fwrapv -fPIC -fPIE -gdwarf-4 -Wall (14.2.0) |
| T:sse2_x64asm-2 | gcc -march=native -mtune=native -Os -fwrapv -fPIC -fPIE -gdwarf-4 -Wall (14.2.0) |
| T:ssse3_x64asm | gcc -march=native -mtune=native -O2 -fwrapv -fPIC -fPIE -gdwarf-4 -Wall (14.2.0) |
| T:ssse3_x64asm | gcc -march=native -mtune=native -O3 -fwrapv -fPIC -fPIE -gdwarf-4 -Wall (14.2.0) |
| T:ssse3_x64asm | gcc -march=native -mtune=native -O -fwrapv -fPIC -fPIE -gdwarf-4 -Wall (14.2.0) |
| T:ssse3_x64asm | gcc -march=native -mtune=native -Os -fwrapv -fPIC -fPIE -gdwarf-4 -Wall (14.2.0) |
| T:ssse3_x64asm-2 | gcc -march=native -mtune=native -O2 -fwrapv -fPIC -fPIE -gdwarf-4 -Wall (14.2.0) |
| T:ssse3_x64asm-2 | gcc -march=native -mtune=native -O3 -fwrapv -fPIC -fPIE -gdwarf-4 -Wall (14.2.0) |
| T:ssse3_x64asm-2 | gcc -march=native -mtune=native -O -fwrapv -fPIC -fPIE -gdwarf-4 -Wall (14.2.0) |
| T:ssse3_x64asm-2 | gcc -march=native -mtune=native -Os -fwrapv -fPIC -fPIE -gdwarf-4 -Wall (14.2.0) |
Compiler output
try.c: /usr/bin/ld: libcrypto_hash_luffa512.a(luffa256_x64asm.o): relocation R_X86_64_32S against `.rodata' can not be used when making a PIE object; recompile with -fPIE
try.c: /usr/bin/ld: failed to set dynamic section sizes: bad value
try.c: collect2: error: ld returned 1 exit status
Number of similar (implementation,compiler) pairs: 8, namely:
| Implementation | Compiler |
| T:ssse3_x64asm-PS | gcc -march=native -mtune=native -O2 -fwrapv -fPIC -fPIE -gdwarf-4 -Wall (14.2.0) |
| T:ssse3_x64asm-PS | gcc -march=native -mtune=native -O3 -fwrapv -fPIC -fPIE -gdwarf-4 -Wall (14.2.0) |
| T:ssse3_x64asm-PS | gcc -march=native -mtune=native -O -fwrapv -fPIC -fPIE -gdwarf-4 -Wall (14.2.0) |
| T:ssse3_x64asm-PS | gcc -march=native -mtune=native -Os -fwrapv -fPIC -fPIE -gdwarf-4 -Wall (14.2.0) |
| T:ssse3_x64asm-PS-2 | gcc -march=native -mtune=native -O2 -fwrapv -fPIC -fPIE -gdwarf-4 -Wall (14.2.0) |
| T:ssse3_x64asm-PS-2 | gcc -march=native -mtune=native -O3 -fwrapv -fPIC -fPIE -gdwarf-4 -Wall (14.2.0) |
| T:ssse3_x64asm-PS-2 | gcc -march=native -mtune=native -O -fwrapv -fPIC -fPIE -gdwarf-4 -Wall (14.2.0) |
| T:ssse3_x64asm-PS-2 | gcc -march=native -mtune=native -Os -fwrapv -fPIC -fPIE -gdwarf-4 -Wall (14.2.0) |
Compiler output
luffa_512.s: luffa_512.s: Assembler messages:
luffa_512.s: luffa_512.s:331: Warning: mnemonic suffix used with `add'
luffa_512.s: luffa_512.s:331: Warning: NOTE: Such forms are deprecated and will be rejected by a future version of the assembler
luffa_512.s: luffa_512.s:337: Warning: mnemonic suffix used with `add'
luffa_512.s: luffa_512.s:413: Warning: mnemonic suffix used with `mov'
luffa_512.s: luffa_512.s:430: Warning: mnemonic suffix used with `mov'
try.c: /usr/bin/ld: libcrypto_hash_luffa512.a(luffa_512.o): relocation R_X86_64_32S against `.rodata' can not be used when making a PIE object; recompile with -fPIE
try.c: /usr/bin/ld: failed to set dynamic section sizes: bad value
try.c: collect2: error: ld returned 1 exit status
Number of similar (implementation,compiler) pairs: 4, namely:
| Implementation | Compiler |
| T:thomaz/asm-PS | gcc -march=native -mtune=native -O2 -fwrapv -fPIC -fPIE -gdwarf-4 -Wall (14.2.0) |
| T:thomaz/asm-PS | gcc -march=native -mtune=native -O3 -fwrapv -fPIC -fPIE -gdwarf-4 -Wall (14.2.0) |
| T:thomaz/asm-PS | gcc -march=native -mtune=native -O -fwrapv -fPIC -fPIE -gdwarf-4 -Wall (14.2.0) |
| T:thomaz/asm-PS | gcc -march=native -mtune=native -Os -fwrapv -fPIC -fPIE -gdwarf-4 -Wall (14.2.0) |
Compiler output
luffa_512.s: luffa_512.s: Assembler messages:
luffa_512.s: luffa_512.s:330: Warning: mnemonic suffix used with `add'
luffa_512.s: luffa_512.s:330: Warning: NOTE: Such forms are deprecated and will be rejected by a future version of the assembler
luffa_512.s: luffa_512.s:336: Warning: mnemonic suffix used with `add'
luffa_512.s: luffa_512.s:412: Warning: mnemonic suffix used with `mov'
luffa_512.s: luffa_512.s:429: Warning: mnemonic suffix used with `mov'
try.c: /usr/bin/ld: libcrypto_hash_luffa512.a(luffa_512.o): relocation R_X86_64_32S against `.rodata' can not be used when making a PIE object; recompile with -fPIE
try.c: /usr/bin/ld: failed to set dynamic section sizes: bad value
try.c: collect2: error: ld returned 1 exit status
Number of similar (implementation,compiler) pairs: 4, namely:
| Implementation | Compiler |
| T:thomaz/asm-PS-v2-FP | gcc -march=native -mtune=native -O2 -fwrapv -fPIC -fPIE -gdwarf-4 -Wall (14.2.0) |
| T:thomaz/asm-PS-v2-FP | gcc -march=native -mtune=native -O3 -fwrapv -fPIC -fPIE -gdwarf-4 -Wall (14.2.0) |
| T:thomaz/asm-PS-v2-FP | gcc -march=native -mtune=native -O -fwrapv -fPIC -fPIE -gdwarf-4 -Wall (14.2.0) |
| T:thomaz/asm-PS-v2-FP | gcc -march=native -mtune=native -Os -fwrapv -fPIC -fPIE -gdwarf-4 -Wall (14.2.0) |
Compiler output
luffa_512.s: luffa_512.s: Assembler messages:
luffa_512.s: luffa_512.s:333: Warning: mnemonic suffix used with `add'
luffa_512.s: luffa_512.s:333: Warning: NOTE: Such forms are deprecated and will be rejected by a future version of the assembler
luffa_512.s: luffa_512.s:339: Warning: mnemonic suffix used with `add'
luffa_512.s: luffa_512.s:415: Warning: mnemonic suffix used with `mov'
luffa_512.s: luffa_512.s:432: Warning: mnemonic suffix used with `mov'
try.c: /usr/bin/ld: libcrypto_hash_luffa512.a(luffa_512.o): relocation R_X86_64_32S against `.rodata' can not be used when making a PIE object; recompile with -fPIE
try.c: /usr/bin/ld: failed to set dynamic section sizes: bad value
try.c: collect2: error: ld returned 1 exit status
Number of similar (implementation,compiler) pairs: 4, namely:
| Implementation | Compiler |
| T:thomaz/asm-PS-v2-INT | gcc -march=native -mtune=native -O2 -fwrapv -fPIC -fPIE -gdwarf-4 -Wall (14.2.0) |
| T:thomaz/asm-PS-v2-INT | gcc -march=native -mtune=native -O3 -fwrapv -fPIC -fPIE -gdwarf-4 -Wall (14.2.0) |
| T:thomaz/asm-PS-v2-INT | gcc -march=native -mtune=native -O -fwrapv -fPIC -fPIE -gdwarf-4 -Wall (14.2.0) |
| T:thomaz/asm-PS-v2-INT | gcc -march=native -mtune=native -Os -fwrapv -fPIC -fPIE -gdwarf-4 -Wall (14.2.0) |
Compiler output
luffa512.s: luffa512.s: Assembler messages:
luffa512.s: luffa512.s:483: Warning: mnemonic suffix used with `add'
luffa512.s: luffa512.s:483: Warning: NOTE: Such forms are deprecated and will be rejected by a future version of the assembler
luffa512.s: luffa512.s:489: Warning: mnemonic suffix used with `add'
luffa512.s: luffa512.s:565: Warning: mnemonic suffix used with `mov'
luffa512.s: luffa512.s:582: Warning: mnemonic suffix used with `mov'
try.c: /usr/bin/ld: libcrypto_hash_luffa512.a(luffa512.o): relocation R_X86_64_32S against `.rodata' can not be used when making a PIE object; recompile with -fPIE
try.c: /usr/bin/ld: failed to set dynamic section sizes: bad value
try.c: collect2: error: ld returned 1 exit status
Number of similar (implementation,compiler) pairs: 8, namely:
| Implementation | Compiler |
| T:thomaz/asm-PSPar-v2-FP | gcc -march=native -mtune=native -O2 -fwrapv -fPIC -fPIE -gdwarf-4 -Wall (14.2.0) |
| T:thomaz/asm-PSPar-v2-FP | gcc -march=native -mtune=native -O3 -fwrapv -fPIC -fPIE -gdwarf-4 -Wall (14.2.0) |
| T:thomaz/asm-PSPar-v2-FP | gcc -march=native -mtune=native -O -fwrapv -fPIC -fPIE -gdwarf-4 -Wall (14.2.0) |
| T:thomaz/asm-PSPar-v2-FP | gcc -march=native -mtune=native -Os -fwrapv -fPIC -fPIE -gdwarf-4 -Wall (14.2.0) |
| T:thomaz/asm-PSPar-v2-INT | gcc -march=native -mtune=native -O2 -fwrapv -fPIC -fPIE -gdwarf-4 -Wall (14.2.0) |
| T:thomaz/asm-PSPar-v2-INT | gcc -march=native -mtune=native -O3 -fwrapv -fPIC -fPIE -gdwarf-4 -Wall (14.2.0) |
| T:thomaz/asm-PSPar-v2-INT | gcc -march=native -mtune=native -O -fwrapv -fPIC -fPIE -gdwarf-4 -Wall (14.2.0) |
| T:thomaz/asm-PSPar-v2-INT | gcc -march=native -mtune=native -Os -fwrapv -fPIC -fPIE -gdwarf-4 -Wall (14.2.0) |
Namespace violations
luffa_for_32.o CNS D
luffa_for_32.o Final T
luffa_for_32.o Hash T
luffa_for_32.o IV R
luffa_for_32.o Init T
luffa_for_32.o Update T
luffa_for_32.o Update256 T
luffa_for_32.o Update384 T
luffa_for_32.o Update512 T
luffa_for_32.o finalization224 T
luffa_for_32.o finalization256 T
luffa_for_32.o finalization384 T
luffa_for_32.o finalization512 T
luffa_for_32.o process_last_msgs256 T
luffa_for_32.o process_last_msgs384 T
luffa_for_32.o process_last_msgs512 T
luffa_for_32.o rnd256 T
luffa_for_32.o rnd384 T
luffa_for_32.o rnd512 T
Number of similar (implementation,compiler) pairs: 4, namely:
| Implementation | Compiler |
| T:opt32 | gcc -march=native -mtune=native -O2 -fwrapv -fPIC -fPIE -gdwarf-4 -Wall (14.2.0) |
| T:opt32 | gcc -march=native -mtune=native -O3 -fwrapv -fPIC -fPIE -gdwarf-4 -Wall (14.2.0) |
| T:opt32 | gcc -march=native -mtune=native -O -fwrapv -fPIC -fPIE -gdwarf-4 -Wall (14.2.0) |
| T:opt32 | gcc -march=native -mtune=native -Os -fwrapv -fPIC -fPIE -gdwarf-4 -Wall (14.2.0) |
Namespace violations
luffa.o sph_luffa224 T
luffa.o sph_luffa224_addbits_and_close T
luffa.o sph_luffa224_close T
luffa.o sph_luffa224_init T
luffa.o sph_luffa256 T
luffa.o sph_luffa256_addbits_and_close T
luffa.o sph_luffa256_close T
luffa.o sph_luffa256_init T
luffa.o sph_luffa384 T
luffa.o sph_luffa384_addbits_and_close T
luffa.o sph_luffa384_close T
luffa.o sph_luffa384_init T
luffa.o sph_luffa512 T
luffa.o sph_luffa512_addbits_and_close T
luffa.o sph_luffa512_close T
luffa.o sph_luffa512_init T
Number of similar (implementation,compiler) pairs: 4, namely:
| Implementation | Compiler |
| T:sphlib | gcc -march=native -mtune=native -O2 -fwrapv -fPIC -fPIE -gdwarf-4 -Wall (14.2.0) |
| T:sphlib | gcc -march=native -mtune=native -O3 -fwrapv -fPIC -fPIE -gdwarf-4 -Wall (14.2.0) |
| T:sphlib | gcc -march=native -mtune=native -O -fwrapv -fPIC -fPIE -gdwarf-4 -Wall (14.2.0) |
| T:sphlib | gcc -march=native -mtune=native -Os -fwrapv -fPIC -fPIE -gdwarf-4 -Wall (14.2.0) |
Namespace violations
luffa_for_sse2.o ALLONE B
luffa_for_sse2.o CNS128 B
luffa_for_sse2.o Final T
luffa_for_sse2.o Hash T
luffa_for_sse2.o Init T
luffa_for_sse2.o MASK B
luffa_for_sse2.o Update T
Number of similar (implementation,compiler) pairs: 4, namely:
| Implementation | Compiler |
| T:sse2 | gcc -march=native -mtune=native -O2 -fwrapv -fPIC -fPIE -gdwarf-4 -Wall (14.2.0) |
| T:sse2 | gcc -march=native -mtune=native -O3 -fwrapv -fPIC -fPIE -gdwarf-4 -Wall (14.2.0) |
| T:sse2 | gcc -march=native -mtune=native -O -fwrapv -fPIC -fPIE -gdwarf-4 -Wall (14.2.0) |
| T:sse2 | gcc -march=native -mtune=native -Os -fwrapv -fPIC -fPIE -gdwarf-4 -Wall (14.2.0) |