Test results for amd64, tripwire, crypto_hash/groestl512

[Page version: 20261004 16:18:08]

Measurements for amd64, tripwire, crypto_hash Test results for amd64, tripwire, crypto_hash Test results for crypto_hash/groestl512
Computer: tripwire
Microarchitecture: amd64; Zen 5 (b00f21)
Architecture: amd64
CPU ID: AuthenticAMD-00b00f21-178bfbff
SUPERCOP version: 20260831
Operation: crypto_hash
Primitive: groestl512
TimeObject sizeTest sizeImplementationCompilerBenchmark dateSUPERCOP version
144119970 0 123236278 1224 2904T:aesni-intrgcc -march=native -mtune=native -O3 -fwrapv -fPIC -fPIE -gdwarf-4 -Wall2026093020260831
144608562 0 123230382 1224 2904T:aesni-intrgcc -march=native -mtune=native -O2 -fwrapv -fPIC -fPIE -gdwarf-4 -Wall2026093020260831
147128500 0 123229965 1216 2840T:aesni-intrgcc -march=native -mtune=native -O -fwrapv -fPIC -fPIE -gdwarf-4 -Wall2026093020260831
153538882 0 166435142 1224 3320T:avx-intrgcc -march=native -mtune=native -O3 -fwrapv -fPIC -fPIE -gdwarf-4 -Wall2026093020260831
154467458 0 166429246 1224 3320T:avx-intrgcc -march=native -mtune=native -O2 -fwrapv -fPIC -fPIE -gdwarf-4 -Wall2026093020260831
155626730 0 166426817 1200 3224T:avx-intrgcc -march=native -mtune=native -Os -fwrapv -fPIC -fPIE -gdwarf-4 -Wall2026093020260831
156198075 0 123228201 1200 2808T:aesni-intrgcc -march=native -mtune=native -Os -fwrapv -fPIC -fPIE -gdwarf-4 -Wall2026093020260831
156937436 0 166428901 1216 3256T:avx-intrgcc -march=native -mtune=native -O -fwrapv -fPIC -fPIE -gdwarf-4 -Wall2026093020260831
2758218618 0 152044926 1224 3192T:vperm-intrgcc -march=native -mtune=native -O3 -fwrapv -fPIC -fPIE -gdwarf-4 -Wall2026093020260831
2763616954 0 152038774 1224 3192T:vperm-intrgcc -march=native -mtune=native -O2 -fwrapv -fPIC -fPIE -gdwarf-4 -Wall2026093020260831
2826616492 0 152036593 1200 3096T:vperm-intrgcc -march=native -mtune=native -Os -fwrapv -fPIC -fPIE -gdwarf-4 -Wall2026093020260831
2830316764 0 152038229 1216 3128T:vperm-intrgcc -march=native -mtune=native -O -fwrapv -fPIC -fPIE -gdwarf-4 -Wall2026093020260831
3316047946 0 074207 1216 1656T:sphlibgcc -march=native -mtune=native -O3 -fwrapv -fPIC -fPIE -gdwarf-4 -Wall2026093020260831
3330444188 0 064346 1192 1560T:sphlib-adaptedgcc -march=native -mtune=native -Os -fwrapv -fPIC -fPIE -gdwarf-4 -Wall2026093020260831
3429250650 0 076959 1216 1656T:sphlib-adaptedgcc -march=native -mtune=native -O3 -fwrapv -fPIC -fPIE -gdwarf-4 -Wall2026093020260831
3466170667 16384 090850 17632 1560T:opt64gcc -march=native -mtune=native -Os -fwrapv -fPIC -fPIE -gdwarf-4 -Wall2026093020260831
3485841323 0 061402 1192 1560T:sphlibgcc -march=native -mtune=native -Os -fwrapv -fPIC -fPIE -gdwarf-4 -Wall2026093020260831
3684249834 0 071575 1216 1656T:sphlib-adaptedgcc -march=native -mtune=native -O2 -fwrapv -fPIC -fPIE -gdwarf-4 -Wall2026093020260831
4185747258 0 069015 1216 1656T:sphlibgcc -march=native -mtune=native -O2 -fwrapv -fPIC -fPIE -gdwarf-4 -Wall2026093020260831
4707376052 16384 0102503 17656 1656T:opt64gcc -march=native -mtune=native -O3 -fwrapv -fPIC -fPIE -gdwarf-4 -Wall2026093020260831
4741176885 0 0103231 1232 1656T:mmxgcc -march=native -mtune=native -O3 -fwrapv -fPIC -fPIE -gdwarf-4 -Wall2026093020260831
4764174475 16384 096343 17656 1656T:opt64gcc -march=native -mtune=native -O2 -fwrapv -fPIC -fPIE -gdwarf-4 -Wall2026093020260831
4818466610 0 088166 1224 1592T:mmxgcc -march=native -mtune=native -O -fwrapv -fPIC -fPIE -gdwarf-4 -Wall2026093020260831
4828367541 0 089423 1232 1656T:mmxgcc -march=native -mtune=native -O2 -fwrapv -fPIC -fPIE -gdwarf-4 -Wall2026093020260831
4839064779 0 084970 1208 1560T:mmxgcc -march=native -mtune=native -Os -fwrapv -fPIC -fPIE -gdwarf-4 -Wall2026093020260831
5064922842 0 049183 1216 1656T:sphlib-smallgcc -march=native -mtune=native -O3 -fwrapv -fPIC -fPIE -gdwarf-4 -Wall2026093020260831
5283219738 0 041495 1216 1656T:sphlib-smallgcc -march=native -mtune=native -O2 -fwrapv -fPIC -fPIE -gdwarf-4 -Wall2026093020260831
5634276654 16384 098190 17648 1592T:opt64gcc -march=native -mtune=native -O -fwrapv -fPIC -fPIE -gdwarf-4 -Wall2026093020260831
5768517852 0 037978 1192 1560T:sphlib-smallgcc -march=native -mtune=native -Os -fwrapv -fPIC -fPIE -gdwarf-4 -Wall2026093020260831
5882419946 0 041511 1216 1592T:sphlib-smallgcc -march=native -mtune=native -O -fwrapv -fPIC -fPIE -gdwarf-4 -Wall2026093020260831
6780125298 0 051647 1232 1656T:opt32gcc -march=native -mtune=native -O3 -fwrapv -fPIC -fPIE -gdwarf-4 -Wall2026093020260831
6818720972 0 041226 1208 1560T:opt32gcc -march=native -mtune=native -Os -fwrapv -fPIC -fPIE -gdwarf-4 -Wall2026093020260831
6830223221 0 045095 1232 1656T:opt32gcc -march=native -mtune=native -O2 -fwrapv -fPIC -fPIE -gdwarf-4 -Wall2026093020260831
6832749890 0 071399 1216 1592T:sphlibgcc -march=native -mtune=native -O -fwrapv -fPIC -fPIE -gdwarf-4 -Wall2026093020260831
6876522674 0 044230 1224 1592T:opt32gcc -march=native -mtune=native -O -fwrapv -fPIC -fPIE -gdwarf-4 -Wall2026093020260831
6979754858 0 076391 1216 1592T:sphlib-adaptedgcc -march=native -mtune=native -O -fwrapv -fPIC -fPIE -gdwarf-4 -Wall2026093020260831
2619922567 0 024295 1216 1656T:32bit-bytesliced-c-smallgcc -march=native -mtune=native -O2 -fwrapv -fPIC -fPIE -gdwarf-4 -Wall2026093020260831
2622404740 0 030991 1216 1656T:32bit-bytesliced-c-smallgcc -march=native -mtune=native -O3 -fwrapv -fPIC -fPIE -gdwarf-4 -Wall2026093020260831
2850321814 0 021810 1192 1560T:32bit-bytesliced-c-smallgcc -march=native -mtune=native -Os -fwrapv -fPIC -fPIE -gdwarf-4 -Wall2026093020260831
4352512976 0 024358 1208 1592T:32bit-bytesliced-c-smallgcc -march=native -mtune=native -O -fwrapv -fPIC -fPIE -gdwarf-4 -Wall2026093020260831

Compiler output


hash.c: hash.c: In function 'Init':
hash.c: hash.c:104:21: warning: the comparison will always evaluate as 'false' for the address of 'chaining' will never be NULL [-Waddress]
hash.c:   104 |   if (ctx->chaining == NULL || ctx->buffer == NULL)
hash.c:       |                     ^~
hash.c: In file included from groestl-asm-aes.h:10,
hash.c:                  from hash.c:13:
hash.c: hash.h:83:38: note: 'chaining' declared here
hash.c:    83 |   __attribute__ ((aligned (32))) u64 chaining[SIZE/8];      /* actual state */
hash.c:       |                                      ^~~~~~~~
hash.c: hash.c:104:44: warning: the comparison will always evaluate as 'false' for the address of 'buffer' will never be NULL [-Waddress]
hash.c:   104 |   if (ctx->chaining == NULL || ctx->buffer == NULL)
hash.c:       |                                            ^~
hash.c: hash.h:84:46: note: 'buffer' declared here
hash.c:    84 |   __attribute__ ((aligned (32))) BitSequence buffer[SIZE];  /* data buffer */
hash.c:       |                                              ^~~~~~
try.c: /usr/bin/ld: libcrypto_hash_groestl512.a(hash.o): relocation R_X86_64_32S against symbol `TRANSP_MASK' can not be used when making a PIE object; recompile with -fPIE
try.c: /usr/bin/ld: failed to set dynamic section sizes: bad value
try.c: collect2: error: ld returned 1 exit status

Number of similar (implementation,compiler) pairs: 4, namely:
ImplementationCompiler
T:aesnigcc -march=native -mtune=native -O2 -fwrapv -fPIC -fPIE -gdwarf-4 -Wall (14.2.0)
T:aesnigcc -march=native -mtune=native -O3 -fwrapv -fPIC -fPIE -gdwarf-4 -Wall (14.2.0)
T:aesnigcc -march=native -mtune=native -O -fwrapv -fPIC -fPIE -gdwarf-4 -Wall (14.2.0)
T:aesnigcc -march=native -mtune=native -Os -fwrapv -fPIC -fPIE -gdwarf-4 -Wall (14.2.0)

Compiler output


hash.c: hash.c: In function 'Init':
hash.c: hash.c:104:21: warning: the comparison will always evaluate as 'false' for the address of 'chaining' will never be NULL [-Waddress]
hash.c:   104 |   if (ctx->chaining == NULL || ctx->buffer == NULL)
hash.c:       |                     ^~
hash.c: In file included from groestl-intr-aes.h:12,
hash.c:                  from hash.c:28:
hash.c: hash.h:83:38: note: 'chaining' declared here
hash.c:    83 |   __attribute__ ((aligned (32))) u64 chaining[SIZE/8];      /* actual state */
hash.c:       |                                      ^~~~~~~~
hash.c: hash.c:104:44: warning: the comparison will always evaluate as 'false' for the address of 'buffer' will never be NULL [-Waddress]
hash.c:   104 |   if (ctx->chaining == NULL || ctx->buffer == NULL)
hash.c:       |                                            ^~
hash.c: hash.h:84:46: note: 'buffer' declared here
hash.c:    84 |   __attribute__ ((aligned (32))) BitSequence buffer[SIZE];  /* data buffer */
hash.c:       |                                              ^~~~~~

Number of similar (implementation,compiler) pairs: 4, namely:
ImplementationCompiler
T:aesni-intrgcc -march=native -mtune=native -O2 -fwrapv -fPIC -fPIE -gdwarf-4 -Wall (14.2.0)
T:aesni-intrgcc -march=native -mtune=native -O3 -fwrapv -fPIC -fPIE -gdwarf-4 -Wall (14.2.0)
T:aesni-intrgcc -march=native -mtune=native -O -fwrapv -fPIC -fPIE -gdwarf-4 -Wall (14.2.0)
T:aesni-intrgcc -march=native -mtune=native -Os -fwrapv -fPIC -fPIE -gdwarf-4 -Wall (14.2.0)

Compiler output


hash.c: hash.c: In function 'Init':
hash.c: hash.c:104:21: warning: the comparison will always evaluate as 'false' for the address of 'chaining' will never be NULL [-Waddress]
hash.c:   104 |   if (ctx->chaining == NULL || ctx->buffer == NULL)
hash.c:       |                     ^~
hash.c: In file included from groestl-asm-avx.h:10,
hash.c:                  from hash.c:16:
hash.c: hash.h:83:38: note: 'chaining' declared here
hash.c:    83 |   __attribute__ ((aligned (32))) u64 chaining[SIZE/8];      /* actual state */
hash.c:       |                                      ^~~~~~~~
hash.c: hash.c:104:44: warning: the comparison will always evaluate as 'false' for the address of 'buffer' will never be NULL [-Waddress]
hash.c:   104 |   if (ctx->chaining == NULL || ctx->buffer == NULL)
hash.c:       |                                            ^~
hash.c: hash.h:84:46: note: 'buffer' declared here
hash.c:    84 |   __attribute__ ((aligned (32))) BitSequence buffer[SIZE];  /* data buffer */
hash.c:       |                                              ^~~~~~
try.c: /usr/bin/ld: libcrypto_hash_groestl512.a(hash.o): relocation R_X86_64_32S against symbol `TRANSP_MASK' can not be used when making a PIE object; recompile with -fPIE
try.c: /usr/bin/ld: failed to set dynamic section sizes: bad value
try.c: collect2: error: ld returned 1 exit status

Number of similar (implementation,compiler) pairs: 4, namely:
ImplementationCompiler
T:avxgcc -march=native -mtune=native -O2 -fwrapv -fPIC -fPIE -gdwarf-4 -Wall (14.2.0)
T:avxgcc -march=native -mtune=native -O3 -fwrapv -fPIC -fPIE -gdwarf-4 -Wall (14.2.0)
T:avxgcc -march=native -mtune=native -O -fwrapv -fPIC -fPIE -gdwarf-4 -Wall (14.2.0)
T:avxgcc -march=native -mtune=native -Os -fwrapv -fPIC -fPIE -gdwarf-4 -Wall (14.2.0)

Compiler output


hash.c: hash.c: In function 'Init':
hash.c: hash.c:104:21: warning: the comparison will always evaluate as 'false' for the address of 'chaining' will never be NULL [-Waddress]
hash.c:   104 |   if (ctx->chaining == NULL || ctx->buffer == NULL)
hash.c:       |                     ^~
hash.c: In file included from groestl-intr-avx.h:13,
hash.c:                  from hash.c:31:
hash.c: hash.h:83:38: note: 'chaining' declared here
hash.c:    83 |   __attribute__ ((aligned (32))) u64 chaining[SIZE/8];      /* actual state */
hash.c:       |                                      ^~~~~~~~
hash.c: hash.c:104:44: warning: the comparison will always evaluate as 'false' for the address of 'buffer' will never be NULL [-Waddress]
hash.c:   104 |   if (ctx->chaining == NULL || ctx->buffer == NULL)
hash.c:       |                                            ^~
hash.c: hash.h:84:46: note: 'buffer' declared here
hash.c:    84 |   __attribute__ ((aligned (32))) BitSequence buffer[SIZE];  /* data buffer */
hash.c:       |                                              ^~~~~~
hash.c: groestl-intr-avx.h:36:47: warning: 'ymm0' is used uninitialized [-Wuninitialized]
hash.c:    36 | #define insert_m128i_in_m256d(ymm, xmm, pos) (_mm256_castsi256_pd(_mm256_insertf128_si256(_mm256_castpd_si256(ymm), xmm, pos)))
hash.c:       |                                              ~^~~~~~~~~~~~~~~~~~~~~~~~~~~~~~~~~~~~~~~~~~~~~~~~~~~~~~~~~~~~~~~~~~~~~~~~~~~~~~~~~
hash.c: groestl-intr-avx.h:496:10: note: in expansion of macro 'insert_m128i_in_m256d'
hash.c:   496 |   ymm0 = insert_m128i_in_m256d(ymm0, xmm0, 0);\
hash.c:       |          ^~~~~~~~~~~~~~~~~~~~~
hash.c: hash.c:97:3: note: in expansion of macro 'SET_CONSTANTS'
hash.c:    97 |   SET_CONSTANTS();
hash.c:       |   ^~~~~~~~~~~~~
hash.c: groestl-intr-avx.h:493:11: note: 'ymm0' was declared here
hash.c: ...

Number of similar (implementation,compiler) pairs: 4, namely:
ImplementationCompiler
T:avx-intrgcc -march=native -mtune=native -O2 -fwrapv -fPIC -fPIE -gdwarf-4 -Wall (14.2.0)
T:avx-intrgcc -march=native -mtune=native -O3 -fwrapv -fPIC -fPIE -gdwarf-4 -Wall (14.2.0)
T:avx-intrgcc -march=native -mtune=native -O -fwrapv -fPIC -fPIE -gdwarf-4 -Wall (14.2.0)
T:avx-intrgcc -march=native -mtune=native -Os -fwrapv -fPIC -fPIE -gdwarf-4 -Wall (14.2.0)

Compiler output


try.c: /usr/bin/ld: libcrypto_hash_groestl512.a(hash.o): in function `Transform':
try.c: .../supercop-data/tripwire/amd64/try/c/gcc_-march=native_-mtune=native_-O2_-fwrapv_-fPIC_-fPIE_-gdwarf-4_-Wall/timingleaks/crypto_hash/groestl512/core2duo/work/hash.c:39:(.text+0x...): undefined reference to `Q1024ASM'
try.c: /usr/bin/ld: .../supercop-data/tripwire/amd64/try/c/gcc_-march=native_-mtune=native_-O2_-fwrapv_-fPIC_-fPIE_-gdwarf-4_-Wall/timingleaks/crypto_hash/groestl512/core2duo/work/hash.c:40:(.text+0x...): undefined reference to `P1024ASM'
try.c: /usr/bin/ld: libcrypto_hash_groestl512.a(hash.o): in function `OutputTransformation':
try.c: .../supercop-data/tripwire/amd64/try/c/gcc_-march=native_-mtune=native_-O2_-fwrapv_-fPIC_-fPIE_-gdwarf-4_-Wall/timingleaks/crypto_hash/groestl512/core2duo/work/hash.c:59:(.text+0x...): undefined reference to `P1024ASM'
try.c: collect2: error: ld returned 1 exit status

Number of similar (implementation,compiler) pairs: 1, namely:
ImplementationCompiler
T:core2duogcc -march=native -mtune=native -O2 -fwrapv -fPIC -fPIE -gdwarf-4 -Wall (14.2.0)

Compiler output


try.c: /usr/bin/ld: libcrypto_hash_groestl512.a(hash.o): in function `Transform':
try.c: .../supercop-data/tripwire/amd64/try/c/gcc_-march=native_-mtune=native_-O3_-fwrapv_-fPIC_-fPIE_-gdwarf-4_-Wall/timingleaks/crypto_hash/groestl512/core2duo/work/hash.c:39:(.text+0x...): undefined reference to `Q1024ASM'
try.c: /usr/bin/ld: .../supercop-data/tripwire/amd64/try/c/gcc_-march=native_-mtune=native_-O3_-fwrapv_-fPIC_-fPIE_-gdwarf-4_-Wall/timingleaks/crypto_hash/groestl512/core2duo/work/hash.c:40:(.text+0x...): undefined reference to `P1024ASM'
try.c: /usr/bin/ld: .../supercop-data/tripwire/amd64/try/c/gcc_-march=native_-mtune=native_-O3_-fwrapv_-fPIC_-fPIE_-gdwarf-4_-Wall/timingleaks/crypto_hash/groestl512/core2duo/work/hash.c:39:(.text+0x...): undefined reference to `Q1024ASM'
try.c: /usr/bin/ld: .../supercop-data/tripwire/amd64/try/c/gcc_-march=native_-mtune=native_-O3_-fwrapv_-fPIC_-fPIE_-gdwarf-4_-Wall/timingleaks/crypto_hash/groestl512/core2duo/work/hash.c:40:(.text+0x...): undefined reference to `P1024ASM'
try.c: /usr/bin/ld: libcrypto_hash_groestl512.a(hash.o): in function `OutputTransformation':
try.c: .../supercop-data/tripwire/amd64/try/c/gcc_-march=native_-mtune=native_-O3_-fwrapv_-fPIC_-fPIE_-gdwarf-4_-Wall/timingleaks/crypto_hash/groestl512/core2duo/work/hash.c:59:(.text+0x...): undefined reference to `P1024ASM'
try.c: /usr/bin/ld: .../supercop-data/tripwire/amd64/try/c/gcc_-march=native_-mtune=native_-O3_-fwrapv_-fPIC_-fPIE_-gdwarf-4_-Wall/timingleaks/crypto_hash/groestl512/core2duo/work/hash.c:59:(.text+0x...): undefined reference to `P1024ASM'
try.c: collect2: error: ld returned 1 exit status

Number of similar (implementation,compiler) pairs: 1, namely:
ImplementationCompiler
T:core2duogcc -march=native -mtune=native -O3 -fwrapv -fPIC -fPIE -gdwarf-4 -Wall (14.2.0)

Compiler output


try.c: /usr/bin/ld: libcrypto_hash_groestl512.a(hash.o): in function `Transform':
try.c: .../supercop-data/tripwire/amd64/try/c/gcc_-march=native_-mtune=native_-O_-fwrapv_-fPIC_-fPIE_-gdwarf-4_-Wall/timingleaks/crypto_hash/groestl512/core2duo/work/hash.c:39:(.text+0x...): undefined reference to `Q1024ASM'
try.c: /usr/bin/ld: .../supercop-data/tripwire/amd64/try/c/gcc_-march=native_-mtune=native_-O_-fwrapv_-fPIC_-fPIE_-gdwarf-4_-Wall/timingleaks/crypto_hash/groestl512/core2duo/work/hash.c:40:(.text+0x...): undefined reference to `P1024ASM'
try.c: /usr/bin/ld: libcrypto_hash_groestl512.a(hash.o): in function `OutputTransformation':
try.c: .../supercop-data/tripwire/amd64/try/c/gcc_-march=native_-mtune=native_-O_-fwrapv_-fPIC_-fPIE_-gdwarf-4_-Wall/timingleaks/crypto_hash/groestl512/core2duo/work/hash.c:59:(.text+0x...): undefined reference to `P1024ASM'
try.c: collect2: error: ld returned 1 exit status

Number of similar (implementation,compiler) pairs: 1, namely:
ImplementationCompiler
T:core2duogcc -march=native -mtune=native -O -fwrapv -fPIC -fPIE -gdwarf-4 -Wall (14.2.0)

Compiler output


try.c: /usr/bin/ld: libcrypto_hash_groestl512.a(hash.o): in function `Transform':
try.c: .../supercop-data/tripwire/amd64/try/c/gcc_-march=native_-mtune=native_-Os_-fwrapv_-fPIC_-fPIE_-gdwarf-4_-Wall/timingleaks/crypto_hash/groestl512/core2duo/work/hash.c:39:(.text+0x...): undefined reference to `Q1024ASM'
try.c: /usr/bin/ld: .../supercop-data/tripwire/amd64/try/c/gcc_-march=native_-mtune=native_-Os_-fwrapv_-fPIC_-fPIE_-gdwarf-4_-Wall/timingleaks/crypto_hash/groestl512/core2duo/work/hash.c:40:(.text+0x...): undefined reference to `P1024ASM'
try.c: /usr/bin/ld: libcrypto_hash_groestl512.a(hash.o): in function `OutputTransformation':
try.c: .../supercop-data/tripwire/amd64/try/c/gcc_-march=native_-mtune=native_-Os_-fwrapv_-fPIC_-fPIE_-gdwarf-4_-Wall/timingleaks/crypto_hash/groestl512/core2duo/work/hash.c:59:(.text+0x...): undefined reference to `P1024ASM'
try.c: collect2: error: ld returned 1 exit status

Number of similar (implementation,compiler) pairs: 1, namely:
ImplementationCompiler
T:core2duogcc -march=native -mtune=native -Os -fwrapv -fPIC -fPIE -gdwarf-4 -Wall (14.2.0)

Compiler output


hash.c: hash.c: In function 'Transform1024':
hash.c: hash.c:563:8: warning: unused variable 'mmm' [-Wunused-variable]
hash.c:   563 |   u64 *mmm = (u64*)tmp;
hash.c:       |        ^~~

Number of similar (implementation,compiler) pairs: 4, namely:
ImplementationCompiler
T:mmxgcc -march=native -mtune=native -O2 -fwrapv -fPIC -fPIE -gdwarf-4 -Wall (14.2.0)
T:mmxgcc -march=native -mtune=native -O3 -fwrapv -fPIC -fPIE -gdwarf-4 -Wall (14.2.0)
T:mmxgcc -march=native -mtune=native -O -fwrapv -fPIC -fPIE -gdwarf-4 -Wall (14.2.0)
T:mmxgcc -march=native -mtune=native -Os -fwrapv -fPIC -fPIE -gdwarf-4 -Wall (14.2.0)

Compiler output


hash.c: hash.c: In function 'F512':
hash.c: hash.c:182: warning: ignoring '#pragma vector aligned' [-Wunknown-pragmas]
hash.c:   182 | #pragma vector aligned
hash.c: hash.c: In function 'F1024':
hash.c: hash.c:219: warning: ignoring '#pragma vector aligned' [-Wunknown-pragmas]
hash.c:   219 | #pragma vector aligned

Number of similar (implementation,compiler) pairs: 4, namely:
ImplementationCompiler
T:opt64gcc -march=native -mtune=native -O2 -fwrapv -fPIC -fPIE -gdwarf-4 -Wall (14.2.0)
T:opt64gcc -march=native -mtune=native -O3 -fwrapv -fPIC -fPIE -gdwarf-4 -Wall (14.2.0)
T:opt64gcc -march=native -mtune=native -O -fwrapv -fPIC -fPIE -gdwarf-4 -Wall (14.2.0)
T:opt64gcc -march=native -mtune=native -Os -fwrapv -fPIC -fPIE -gdwarf-4 -Wall (14.2.0)

Compiler output


try.c: /usr/bin/ld: libcrypto_hash_groestl512.a(hash.o): in function `Transform':
try.c: .../supercop-data/tripwire/amd64/try/c/gcc_-march=native_-mtune=native_-O2_-fwrapv_-fPIC_-fPIE_-gdwarf-4_-Wall/timingleaks/crypto_hash/groestl512/opteron/work/hash.c:36:(.text+0x...): undefined reference to `Q1024ASM'
try.c: /usr/bin/ld: .../supercop-data/tripwire/amd64/try/c/gcc_-march=native_-mtune=native_-O2_-fwrapv_-fPIC_-fPIE_-gdwarf-4_-Wall/timingleaks/crypto_hash/groestl512/opteron/work/hash.c:37:(.text+0x...): undefined reference to `P1024ASM'
try.c: /usr/bin/ld: libcrypto_hash_groestl512.a(hash.o): in function `OutputTransformation':
try.c: .../supercop-data/tripwire/amd64/try/c/gcc_-march=native_-mtune=native_-O2_-fwrapv_-fPIC_-fPIE_-gdwarf-4_-Wall/timingleaks/crypto_hash/groestl512/opteron/work/hash.c:56:(.text+0x...): undefined reference to `P1024ASM'
try.c: collect2: error: ld returned 1 exit status

Number of similar (implementation,compiler) pairs: 1, namely:
ImplementationCompiler
T:opterongcc -march=native -mtune=native -O2 -fwrapv -fPIC -fPIE -gdwarf-4 -Wall (14.2.0)

Compiler output


try.c: /usr/bin/ld: libcrypto_hash_groestl512.a(hash.o): in function `Transform':
try.c: .../supercop-data/tripwire/amd64/try/c/gcc_-march=native_-mtune=native_-O3_-fwrapv_-fPIC_-fPIE_-gdwarf-4_-Wall/timingleaks/crypto_hash/groestl512/opteron/work/hash.c:36:(.text+0x...): undefined reference to `Q1024ASM'
try.c: /usr/bin/ld: .../supercop-data/tripwire/amd64/try/c/gcc_-march=native_-mtune=native_-O3_-fwrapv_-fPIC_-fPIE_-gdwarf-4_-Wall/timingleaks/crypto_hash/groestl512/opteron/work/hash.c:37:(.text+0x...): undefined reference to `P1024ASM'
try.c: /usr/bin/ld: .../supercop-data/tripwire/amd64/try/c/gcc_-march=native_-mtune=native_-O3_-fwrapv_-fPIC_-fPIE_-gdwarf-4_-Wall/timingleaks/crypto_hash/groestl512/opteron/work/hash.c:36:(.text+0x...): undefined reference to `Q1024ASM'
try.c: /usr/bin/ld: .../supercop-data/tripwire/amd64/try/c/gcc_-march=native_-mtune=native_-O3_-fwrapv_-fPIC_-fPIE_-gdwarf-4_-Wall/timingleaks/crypto_hash/groestl512/opteron/work/hash.c:37:(.text+0x...): undefined reference to `P1024ASM'
try.c: /usr/bin/ld: libcrypto_hash_groestl512.a(hash.o): in function `OutputTransformation':
try.c: .../supercop-data/tripwire/amd64/try/c/gcc_-march=native_-mtune=native_-O3_-fwrapv_-fPIC_-fPIE_-gdwarf-4_-Wall/timingleaks/crypto_hash/groestl512/opteron/work/hash.c:56:(.text+0x...): undefined reference to `P1024ASM'
try.c: /usr/bin/ld: .../supercop-data/tripwire/amd64/try/c/gcc_-march=native_-mtune=native_-O3_-fwrapv_-fPIC_-fPIE_-gdwarf-4_-Wall/timingleaks/crypto_hash/groestl512/opteron/work/hash.c:56:(.text+0x...): undefined reference to `P1024ASM'
try.c: collect2: error: ld returned 1 exit status

Number of similar (implementation,compiler) pairs: 1, namely:
ImplementationCompiler
T:opterongcc -march=native -mtune=native -O3 -fwrapv -fPIC -fPIE -gdwarf-4 -Wall (14.2.0)

Compiler output


try.c: /usr/bin/ld: libcrypto_hash_groestl512.a(hash.o): in function `Transform':
try.c: .../supercop-data/tripwire/amd64/try/c/gcc_-march=native_-mtune=native_-O_-fwrapv_-fPIC_-fPIE_-gdwarf-4_-Wall/timingleaks/crypto_hash/groestl512/opteron/work/hash.c:36:(.text+0x...): undefined reference to `Q1024ASM'
try.c: /usr/bin/ld: .../supercop-data/tripwire/amd64/try/c/gcc_-march=native_-mtune=native_-O_-fwrapv_-fPIC_-fPIE_-gdwarf-4_-Wall/timingleaks/crypto_hash/groestl512/opteron/work/hash.c:37:(.text+0x...): undefined reference to `P1024ASM'
try.c: /usr/bin/ld: libcrypto_hash_groestl512.a(hash.o): in function `OutputTransformation':
try.c: .../supercop-data/tripwire/amd64/try/c/gcc_-march=native_-mtune=native_-O_-fwrapv_-fPIC_-fPIE_-gdwarf-4_-Wall/timingleaks/crypto_hash/groestl512/opteron/work/hash.c:56:(.text+0x...): undefined reference to `P1024ASM'
try.c: collect2: error: ld returned 1 exit status

Number of similar (implementation,compiler) pairs: 1, namely:
ImplementationCompiler
T:opterongcc -march=native -mtune=native -O -fwrapv -fPIC -fPIE -gdwarf-4 -Wall (14.2.0)

Compiler output


try.c: /usr/bin/ld: libcrypto_hash_groestl512.a(hash.o): in function `Transform':
try.c: .../supercop-data/tripwire/amd64/try/c/gcc_-march=native_-mtune=native_-Os_-fwrapv_-fPIC_-fPIE_-gdwarf-4_-Wall/timingleaks/crypto_hash/groestl512/opteron/work/hash.c:36:(.text+0x...): undefined reference to `Q1024ASM'
try.c: /usr/bin/ld: .../supercop-data/tripwire/amd64/try/c/gcc_-march=native_-mtune=native_-Os_-fwrapv_-fPIC_-fPIE_-gdwarf-4_-Wall/timingleaks/crypto_hash/groestl512/opteron/work/hash.c:37:(.text+0x...): undefined reference to `P1024ASM'
try.c: /usr/bin/ld: libcrypto_hash_groestl512.a(hash.o): in function `OutputTransformation':
try.c: .../supercop-data/tripwire/amd64/try/c/gcc_-march=native_-mtune=native_-Os_-fwrapv_-fPIC_-fPIE_-gdwarf-4_-Wall/timingleaks/crypto_hash/groestl512/opteron/work/hash.c:56:(.text+0x...): undefined reference to `P1024ASM'
try.c: collect2: error: ld returned 1 exit status

Number of similar (implementation,compiler) pairs: 1, namely:
ImplementationCompiler
T:opterongcc -march=native -mtune=native -Os -fwrapv -fPIC -fPIE -gdwarf-4 -Wall (14.2.0)

Compiler output


groestl.c: groestl.c: In function 'groestl_small_close':
groestl.c: groestl.c:2812:24: warning: variable 'buf' set but not used [-Wunused-but-set-variable]
groestl.c:  2812 |         unsigned char *buf;
groestl.c:       |                        ^~~
groestl.c: groestl.c: In function 'groestl_big_close':
groestl.c: groestl.c:2948:24: warning: variable 'buf' set but not used [-Wunused-but-set-variable]
groestl.c:  2948 |         unsigned char *buf;
groestl.c:       |                        ^~~

Number of similar (implementation,compiler) pairs: 8, namely:
ImplementationCompiler
T:sphlibgcc -march=native -mtune=native -O2 -fwrapv -fPIC -fPIE -gdwarf-4 -Wall (14.2.0)
T:sphlibgcc -march=native -mtune=native -O3 -fwrapv -fPIC -fPIE -gdwarf-4 -Wall (14.2.0)
T:sphlibgcc -march=native -mtune=native -O -fwrapv -fPIC -fPIE -gdwarf-4 -Wall (14.2.0)
T:sphlibgcc -march=native -mtune=native -Os -fwrapv -fPIC -fPIE -gdwarf-4 -Wall (14.2.0)
T:sphlib-smallgcc -march=native -mtune=native -O2 -fwrapv -fPIC -fPIE -gdwarf-4 -Wall (14.2.0)
T:sphlib-smallgcc -march=native -mtune=native -O3 -fwrapv -fPIC -fPIE -gdwarf-4 -Wall (14.2.0)
T:sphlib-smallgcc -march=native -mtune=native -O -fwrapv -fPIC -fPIE -gdwarf-4 -Wall (14.2.0)
T:sphlib-smallgcc -march=native -mtune=native -Os -fwrapv -fPIC -fPIE -gdwarf-4 -Wall (14.2.0)

Compiler output


groestl.c: groestl.c: In function 'groestl_small_close':
groestl.c: groestl.c:2742:18: warning: variable 'buf' set but not used [-Wunused-but-set-variable]
groestl.c:  2742 |   unsigned char *buf;
groestl.c:       |                  ^~~
groestl.c: groestl.c: In function 'groestl_big_close':
groestl.c: groestl.c:2878:18: warning: variable 'buf' set but not used [-Wunused-but-set-variable]
groestl.c:  2878 |   unsigned char *buf;
groestl.c:       |                  ^~~

Number of similar (implementation,compiler) pairs: 4, namely:
ImplementationCompiler
T:sphlib-adaptedgcc -march=native -mtune=native -O2 -fwrapv -fPIC -fPIE -gdwarf-4 -Wall (14.2.0)
T:sphlib-adaptedgcc -march=native -mtune=native -O3 -fwrapv -fPIC -fPIE -gdwarf-4 -Wall (14.2.0)
T:sphlib-adaptedgcc -march=native -mtune=native -O -fwrapv -fPIC -fPIE -gdwarf-4 -Wall (14.2.0)
T:sphlib-adaptedgcc -march=native -mtune=native -Os -fwrapv -fPIC -fPIE -gdwarf-4 -Wall (14.2.0)

Compiler output


hash.c: hash.c: In function 'Init':
hash.c: hash.c:104:21: warning: the comparison will always evaluate as 'false' for the address of 'chaining' will never be NULL [-Waddress]
hash.c:   104 |   if (ctx->chaining == NULL || ctx->buffer == NULL)
hash.c:       |                     ^~
hash.c: In file included from groestl-asm-vperm.h:13,
hash.c:                  from hash.c:19:
hash.c: hash.h:83:38: note: 'chaining' declared here
hash.c:    83 |   __attribute__ ((aligned (32))) u64 chaining[SIZE/8];      /* actual state */
hash.c:       |                                      ^~~~~~~~
hash.c: hash.c:104:44: warning: the comparison will always evaluate as 'false' for the address of 'buffer' will never be NULL [-Waddress]
hash.c:   104 |   if (ctx->chaining == NULL || ctx->buffer == NULL)
hash.c:       |                                            ^~
hash.c: hash.h:84:46: note: 'buffer' declared here
hash.c:    84 |   __attribute__ ((aligned (32))) BitSequence buffer[SIZE];  /* data buffer */
hash.c:       |                                              ^~~~~~
try.c: /usr/bin/ld: libcrypto_hash_groestl512.a(hash.o): relocation R_X86_64_32S against symbol `ROUND_CONST_P' can not be used when making a PIE object; recompile with -fPIE
try.c: /usr/bin/ld: failed to set dynamic section sizes: bad value
try.c: collect2: error: ld returned 1 exit status

Number of similar (implementation,compiler) pairs: 4, namely:
ImplementationCompiler
T:vpermgcc -march=native -mtune=native -O2 -fwrapv -fPIC -fPIE -gdwarf-4 -Wall (14.2.0)
T:vpermgcc -march=native -mtune=native -O3 -fwrapv -fPIC -fPIE -gdwarf-4 -Wall (14.2.0)
T:vpermgcc -march=native -mtune=native -O -fwrapv -fPIC -fPIE -gdwarf-4 -Wall (14.2.0)
T:vpermgcc -march=native -mtune=native -Os -fwrapv -fPIC -fPIE -gdwarf-4 -Wall (14.2.0)

Compiler output


hash.c: hash.c: In function 'Init':
hash.c: hash.c:104:21: warning: the comparison will always evaluate as 'false' for the address of 'chaining' will never be NULL [-Waddress]
hash.c:   104 |   if (ctx->chaining == NULL || ctx->buffer == NULL)
hash.c:       |                     ^~
hash.c: In file included from groestl-intr-vperm.h:14,
hash.c:                  from hash.c:34:
hash.c: hash.h:83:38: note: 'chaining' declared here
hash.c:    83 |   __attribute__ ((aligned (32))) u64 chaining[SIZE/8];      /* actual state */
hash.c:       |                                      ^~~~~~~~
hash.c: hash.c:104:44: warning: the comparison will always evaluate as 'false' for the address of 'buffer' will never be NULL [-Waddress]
hash.c:   104 |   if (ctx->chaining == NULL || ctx->buffer == NULL)
hash.c:       |                                            ^~
hash.c: hash.h:84:46: note: 'buffer' declared here
hash.c:    84 |   __attribute__ ((aligned (32))) BitSequence buffer[SIZE];  /* data buffer */
hash.c:       |                                              ^~~~~~

Number of similar (implementation,compiler) pairs: 4, namely:
ImplementationCompiler
T:vperm-intrgcc -march=native -mtune=native -O2 -fwrapv -fPIC -fPIE -gdwarf-4 -Wall (14.2.0)
T:vperm-intrgcc -march=native -mtune=native -O3 -fwrapv -fPIC -fPIE -gdwarf-4 -Wall (14.2.0)
T:vperm-intrgcc -march=native -mtune=native -O -fwrapv -fPIC -fPIE -gdwarf-4 -Wall (14.2.0)
T:vperm-intrgcc -march=native -mtune=native -Os -fwrapv -fPIC -fPIE -gdwarf-4 -Wall (14.2.0)

Namespace violations


hash.o memxor T
hash.o mixbytes T
hash.o permutation T
hash.o setmessage T

Number of similar (implementation,compiler) pairs: 4, namely:
ImplementationCompiler
T:32bit-bytesliced-c-smallgcc -march=native -mtune=native -O2 -fwrapv -fPIC -fPIE -gdwarf-4 -Wall (14.2.0)
T:32bit-bytesliced-c-smallgcc -march=native -mtune=native -O3 -fwrapv -fPIC -fPIE -gdwarf-4 -Wall (14.2.0)
T:32bit-bytesliced-c-smallgcc -march=native -mtune=native -O -fwrapv -fPIC -fPIE -gdwarf-4 -Wall (14.2.0)
T:32bit-bytesliced-c-smallgcc -march=native -mtune=native -Os -fwrapv -fPIC -fPIE -gdwarf-4 -Wall (14.2.0)

Namespace violations


hash.o ALL_1B B
hash.o ALL_FF B
hash.o Final T
hash.o Hash T
hash.o INIT T
hash.o Init T
hash.o OF1024 T
hash.o OutputTransformation T
hash.o ROUND_CONST_L0 B
hash.o ROUND_CONST_L7 B
hash.o ROUND_CONST_Lx B
hash.o ROUND_CONST_P B
hash.o ROUND_CONST_Q B
hash.o SUBSH_MASK B
hash.o TF1024 T
hash.o TRANSP_MASK B
hash.o Transform T
hash.o Update T

Number of similar (implementation,compiler) pairs: 8, namely:
ImplementationCompiler
T:aesni-intrgcc -march=native -mtune=native -O2 -fwrapv -fPIC -fPIE -gdwarf-4 -Wall (14.2.0)
T:aesni-intrgcc -march=native -mtune=native -O3 -fwrapv -fPIC -fPIE -gdwarf-4 -Wall (14.2.0)
T:aesni-intrgcc -march=native -mtune=native -O -fwrapv -fPIC -fPIE -gdwarf-4 -Wall (14.2.0)
T:aesni-intrgcc -march=native -mtune=native -Os -fwrapv -fPIC -fPIE -gdwarf-4 -Wall (14.2.0)
T:avx-intrgcc -march=native -mtune=native -O2 -fwrapv -fPIC -fPIE -gdwarf-4 -Wall (14.2.0)
T:avx-intrgcc -march=native -mtune=native -O3 -fwrapv -fPIC -fPIE -gdwarf-4 -Wall (14.2.0)
T:avx-intrgcc -march=native -mtune=native -O -fwrapv -fPIC -fPIE -gdwarf-4 -Wall (14.2.0)
T:avx-intrgcc -march=native -mtune=native -Os -fwrapv -fPIC -fPIE -gdwarf-4 -Wall (14.2.0)

Namespace violations


hash.o Final T
hash.o Hash T
hash.o Init T
hash.o OutputTransformation T
hash.o OutputTransformation1024 T
hash.o OutputTransformation512 T
hash.o PrintHash T
hash.o ROUNDP1024 T
hash.o ROUNDQ1024 T
hash.o T R
hash.o Transform T
hash.o Transform1024 T
hash.o Transform512 T
hash.o Update T

Number of similar (implementation,compiler) pairs: 4, namely:
ImplementationCompiler
T:mmxgcc -march=native -mtune=native -O2 -fwrapv -fPIC -fPIE -gdwarf-4 -Wall (14.2.0)
T:mmxgcc -march=native -mtune=native -O3 -fwrapv -fPIC -fPIE -gdwarf-4 -Wall (14.2.0)
T:mmxgcc -march=native -mtune=native -O -fwrapv -fPIC -fPIE -gdwarf-4 -Wall (14.2.0)
T:mmxgcc -march=native -mtune=native -Os -fwrapv -fPIC -fPIE -gdwarf-4 -Wall (14.2.0)

Namespace violations


hash.o F1024 T
hash.o F512 T
hash.o Final T
hash.o Hash T
hash.o Init T
hash.o OutputTransformation T
hash.o PrintHash T
hash.o RND1024P T
hash.o RND1024Q T
hash.o RND512P T
hash.o RND512Q T
hash.o T R
hash.o Transform T
hash.o Update T

Number of similar (implementation,compiler) pairs: 4, namely:
ImplementationCompiler
T:opt32gcc -march=native -mtune=native -O2 -fwrapv -fPIC -fPIE -gdwarf-4 -Wall (14.2.0)
T:opt32gcc -march=native -mtune=native -O3 -fwrapv -fPIC -fPIE -gdwarf-4 -Wall (14.2.0)
T:opt32gcc -march=native -mtune=native -O -fwrapv -fPIC -fPIE -gdwarf-4 -Wall (14.2.0)
T:opt32gcc -march=native -mtune=native -Os -fwrapv -fPIC -fPIE -gdwarf-4 -Wall (14.2.0)

Namespace violations


hash.o Final T
hash.o Hash T
hash.o Init T
hash.o OutputTransformation T
hash.o PrintHash T
hash.o PrintState T
hash.o T D
hash.o Transform T
hash.o Update T

Number of similar (implementation,compiler) pairs: 4, namely:
ImplementationCompiler
T:opt64gcc -march=native -mtune=native -O2 -fwrapv -fPIC -fPIE -gdwarf-4 -Wall (14.2.0)
T:opt64gcc -march=native -mtune=native -O3 -fwrapv -fPIC -fPIE -gdwarf-4 -Wall (14.2.0)
T:opt64gcc -march=native -mtune=native -O -fwrapv -fPIC -fPIE -gdwarf-4 -Wall (14.2.0)
T:opt64gcc -march=native -mtune=native -Os -fwrapv -fPIC -fPIE -gdwarf-4 -Wall (14.2.0)

Namespace violations


groestl.o sph_groestl224 T
groestl.o sph_groestl224_addbits_and_close T
groestl.o sph_groestl224_close T
groestl.o sph_groestl224_init T
groestl.o sph_groestl256 T
groestl.o sph_groestl256_addbits_and_close T
groestl.o sph_groestl256_close T
groestl.o sph_groestl256_init T
groestl.o sph_groestl384 T
groestl.o sph_groestl384_addbits_and_close T
groestl.o sph_groestl384_close T
groestl.o sph_groestl384_init T
groestl.o sph_groestl512 T
groestl.o sph_groestl512_addbits_and_close T
groestl.o sph_groestl512_close T
groestl.o sph_groestl512_init T

Number of similar (implementation,compiler) pairs: 12, namely:
ImplementationCompiler
T:sphlibgcc -march=native -mtune=native -O2 -fwrapv -fPIC -fPIE -gdwarf-4 -Wall (14.2.0)
T:sphlibgcc -march=native -mtune=native -O3 -fwrapv -fPIC -fPIE -gdwarf-4 -Wall (14.2.0)
T:sphlibgcc -march=native -mtune=native -O -fwrapv -fPIC -fPIE -gdwarf-4 -Wall (14.2.0)
T:sphlibgcc -march=native -mtune=native -Os -fwrapv -fPIC -fPIE -gdwarf-4 -Wall (14.2.0)
T:sphlib-adaptedgcc -march=native -mtune=native -O2 -fwrapv -fPIC -fPIE -gdwarf-4 -Wall (14.2.0)
T:sphlib-adaptedgcc -march=native -mtune=native -O3 -fwrapv -fPIC -fPIE -gdwarf-4 -Wall (14.2.0)
T:sphlib-adaptedgcc -march=native -mtune=native -O -fwrapv -fPIC -fPIE -gdwarf-4 -Wall (14.2.0)
T:sphlib-adaptedgcc -march=native -mtune=native -Os -fwrapv -fPIC -fPIE -gdwarf-4 -Wall (14.2.0)
T:sphlib-smallgcc -march=native -mtune=native -O2 -fwrapv -fPIC -fPIE -gdwarf-4 -Wall (14.2.0)
T:sphlib-smallgcc -march=native -mtune=native -O3 -fwrapv -fPIC -fPIE -gdwarf-4 -Wall (14.2.0)
T:sphlib-smallgcc -march=native -mtune=native -O -fwrapv -fPIC -fPIE -gdwarf-4 -Wall (14.2.0)
T:sphlib-smallgcc -march=native -mtune=native -Os -fwrapv -fPIC -fPIE -gdwarf-4 -Wall (14.2.0)

Namespace violations


hash.o ALL_0F B
hash.o ALL_15 B
hash.o ALL_1B B
hash.o ALL_63 B
hash.o ALL_FF B
hash.o Final T
hash.o Hash T
hash.o INIT T
hash.o Init T
hash.o OF1024 T
hash.o OutputTransformation T
hash.o ROUND_CONST_L0 B
hash.o ROUND_CONST_L7 B
hash.o ROUND_CONST_Lx B
hash.o ROUND_CONST_P B
hash.o ROUND_CONST_Q B
hash.o SUBSH_MASK B
hash.o TF1024 T
hash.o TRANSP_MASK B
hash.o Transform T
hash.o Update T
hash.o VPERM_INV B
hash.o VPERM_IPT B
hash.o VPERM_OPT B
hash.o VPERM_SB1 B
hash.o VPERM_SB2 B
hash.o VPERM_SB4 B
hash.o VPERM_SBO B

Number of similar (implementation,compiler) pairs: 4, namely:
ImplementationCompiler
T:vperm-intrgcc -march=native -mtune=native -O2 -fwrapv -fPIC -fPIE -gdwarf-4 -Wall (14.2.0)
T:vperm-intrgcc -march=native -mtune=native -O3 -fwrapv -fPIC -fPIE -gdwarf-4 -Wall (14.2.0)
T:vperm-intrgcc -march=native -mtune=native -O -fwrapv -fPIC -fPIE -gdwarf-4 -Wall (14.2.0)
T:vperm-intrgcc -march=native -mtune=native -Os -fwrapv -fPIC -fPIE -gdwarf-4 -Wall (14.2.0)