[Page version: 20241027 17:25:10]
Measurements for amd64, trident, crypto_hash Test results for amd64, trident, crypto_hash Test results for crypto_hash/blake3Time | Object size | Test size | Implementation | Compiler | Benchmark date | SUPERCOP version |
---|---|---|---|---|---|---|
10131 | 9692 0 0 | 21800 788 952 | T:portable | gcc -march=native -mtune=native -O3 -fwrapv -fPIC -fPIE -gdwarf-4 -Wall | 20240629 | 20240625 |
10163 | 9226 0 0 | 20288 788 952 | T:portable | gcc -march=native -mtune=native -O2 -fwrapv -fPIC -fPIE -gdwarf-4 -Wall | 20240629 | 20240625 |
10221 | 10173 0 0 | 23260 820 888 | T:portable | clang -march=native -O3 -fwrapv -Qunused-arguments -fPIC -fPIE -gdwarf-4 -Wall | 20240629 | 20240625 |
10232 | 10157 0 0 | 22156 820 888 | T:portable | clang -march=native -O2 -fwrapv -Qunused-arguments -fPIC -fPIE -gdwarf-4 -Wall | 20240629 | 20240625 |
10273 | 9074 0 0 | 19218 812 888 | T:portable | clang -march=native -Os -fwrapv -Qunused-arguments -fPIC -fPIE -gdwarf-4 -Wall | 20240629 | 20240625 |
10275 | 10075 0 0 | 22892 820 888 | T:portable | clang -mcpu=native -O3 -fwrapv -Qunused-arguments -fPIC -fPIE -gdwarf-4 -Wall | 20240629 | 20240625 |
10325 | 9387 0 0 | 20066 812 888 | T:portable | clang -march=native -O -fwrapv -Qunused-arguments -fPIC -fPIE -gdwarf-4 -Wall | 20240629 | 20240625 |
10746 | 8488 0 0 | 18091 764 920 | T:portable | gcc -march=native -mtune=native -Os -fwrapv -fPIC -fPIE -gdwarf-4 -Wall | 20240629 | 20240625 |
11940 | 10915 0 0 | 21503 780 952 | T:portable | gcc -march=native -mtune=native -O -fwrapv -fPIC -fPIE -gdwarf-4 -Wall | 20240629 | 20240625 |
error 111
Implementation | Compiler |
T:avx2 | clang -march=native -O2 -fwrapv -Qunused-arguments -fPIC -fPIE -gdwarf-4 -Wall (Debian_Clang_11.0.1) |
T:avx2 | clang -march=native -O3 -fwrapv -Qunused-arguments -fPIC -fPIE -gdwarf-4 -Wall (Debian_Clang_11.0.1) |
T:avx2 | clang -march=native -O -fwrapv -Qunused-arguments -fPIC -fPIE -gdwarf-4 -Wall (Debian_Clang_11.0.1) |
T:avx2 | clang -march=native -Os -fwrapv -Qunused-arguments -fPIC -fPIE -gdwarf-4 -Wall (Debian_Clang_11.0.1) |
T:avx2 | clang -mcpu=native -O3 -fwrapv -Qunused-arguments -fPIC -fPIE -gdwarf-4 -Wall (Debian_Clang_11.0.1) |
T:avx2 | gcc -march=native -mtune=native -O2 -fwrapv -fPIC -fPIE -gdwarf-4 -Wall (10.2.1_20210110) |
T:avx2 | gcc -march=native -mtune=native -O3 -fwrapv -fPIC -fPIE -gdwarf-4 -Wall (10.2.1_20210110) |
T:avx2 | gcc -march=native -mtune=native -O -fwrapv -fPIC -fPIE -gdwarf-4 -Wall (10.2.1_20210110) |
T:avx2 | gcc -march=native -mtune=native -Os -fwrapv -fPIC -fPIE -gdwarf-4 -Wall (10.2.1_20210110) |
T:avx512 | clang -march=native -O2 -fwrapv -Qunused-arguments -fPIC -fPIE -gdwarf-4 -Wall (Debian_Clang_11.0.1) |
T:avx512 | clang -march=native -O3 -fwrapv -Qunused-arguments -fPIC -fPIE -gdwarf-4 -Wall (Debian_Clang_11.0.1) |
T:avx512 | clang -march=native -O -fwrapv -Qunused-arguments -fPIC -fPIE -gdwarf-4 -Wall (Debian_Clang_11.0.1) |
T:avx512 | clang -march=native -Os -fwrapv -Qunused-arguments -fPIC -fPIE -gdwarf-4 -Wall (Debian_Clang_11.0.1) |
T:avx512 | clang -mcpu=native -O3 -fwrapv -Qunused-arguments -fPIC -fPIE -gdwarf-4 -Wall (Debian_Clang_11.0.1) |
T:avx512 | gcc -march=native -mtune=native -O2 -fwrapv -fPIC -fPIE -gdwarf-4 -Wall (10.2.1_20210110) |
T:avx512 | gcc -march=native -mtune=native -O3 -fwrapv -fPIC -fPIE -gdwarf-4 -Wall (10.2.1_20210110) |
T:avx512 | gcc -march=native -mtune=native -O -fwrapv -fPIC -fPIE -gdwarf-4 -Wall (10.2.1_20210110) |
T:avx512 | gcc -march=native -mtune=native -Os -fwrapv -fPIC -fPIE -gdwarf-4 -Wall (10.2.1_20210110) |
T:sse41 | clang -march=native -O2 -fwrapv -Qunused-arguments -fPIC -fPIE -gdwarf-4 -Wall (Debian_Clang_11.0.1) |
T:sse41 | clang -march=native -O3 -fwrapv -Qunused-arguments -fPIC -fPIE -gdwarf-4 -Wall (Debian_Clang_11.0.1) |
T:sse41 | clang -march=native -O -fwrapv -Qunused-arguments -fPIC -fPIE -gdwarf-4 -Wall (Debian_Clang_11.0.1) |
T:sse41 | clang -march=native -Os -fwrapv -Qunused-arguments -fPIC -fPIE -gdwarf-4 -Wall (Debian_Clang_11.0.1) |
T:sse41 | clang -mcpu=native -O3 -fwrapv -Qunused-arguments -fPIC -fPIE -gdwarf-4 -Wall (Debian_Clang_11.0.1) |
T:sse41 | gcc -march=native -mtune=native -O2 -fwrapv -fPIC -fPIE -gdwarf-4 -Wall (10.2.1_20210110) |
T:sse41 | gcc -march=native -mtune=native -O3 -fwrapv -fPIC -fPIE -gdwarf-4 -Wall (10.2.1_20210110) |
T:sse41 | gcc -march=native -mtune=native -O -fwrapv -fPIC -fPIE -gdwarf-4 -Wall (10.2.1_20210110) |
T:sse41 | gcc -march=native -mtune=native -Os -fwrapv -fPIC -fPIE -gdwarf-4 -Wall (10.2.1_20210110) |
blake3_neon.c: In file included from blake3_neon.c:3: blake3_neon.c: /usr/lib/llvm-11/lib/clang/11.0.1/include/arm_neon.h:28:2: error: "NEON intrinsics not available with the soft-float ABI. Please use -mfloat-abi=softfp or -mfloat-abi=hard" blake3_neon.c: #error "NEON intrinsics not available with the soft-float ABI. Please use -mfloat-abi=softfp or -mfloat-abi=hard" blake3_neon.c: ^ blake3_neon.c: blake3_neon.c:11:8: error: unknown type name 'uint32x4_t'; did you mean 'uint32_t'? blake3_neon.c: INLINE uint32x4_t loadu_128(const uint8_t src[16]) { blake3_neon.c: ^~~~~~~~~~ blake3_neon.c: uint32_t blake3_neon.c: /usr/include/x86_64-linux-gnu/bits/stdint-uintn.h:26:20: note: 'uint32_t' declared here blake3_neon.c: typedef __uint32_t uint32_t; blake3_neon.c: ^ blake3_neon.c: blake3_neon.c:13:3: error: unknown type name 'uint32x4_t'; did you mean 'uint32_t'? blake3_neon.c: uint32x4_t x; blake3_neon.c: ^~~~~~~~~~ blake3_neon.c: uint32_t blake3_neon.c: /usr/include/x86_64-linux-gnu/bits/stdint-uintn.h:26:20: note: 'uint32_t' declared here blake3_neon.c: typedef __uint32_t uint32_t; blake3_neon.c: ^ blake3_neon.c: blake3_neon.c:14:3: warning: 'memcpy' will always overflow; destination buffer has size 4, but size argument is 16 [-Wfortify-source] blake3_neon.c: memcpy(&x, src, 16); blake3_neon.c: ^ blake3_neon.c: blake3_neon.c:18:24: error: unknown type name 'uint32x4_t'; did you mean 'uint32_t'? blake3_neon.c: INLINE void storeu_128(uint32x4_t src, uint8_t dest[16]) { blake3_neon.c: ^~~~~~~~~~ blake3_neon.c: uint32_t blake3_neon.c: ...
Implementation | Compiler |
T:neon | clang -march=native -O2 -fwrapv -Qunused-arguments -fPIC -fPIE -gdwarf-4 -Wall (Debian_Clang_11.0.1) |
T:neon | clang -march=native -O3 -fwrapv -Qunused-arguments -fPIC -fPIE -gdwarf-4 -Wall (Debian_Clang_11.0.1) |
T:neon | clang -march=native -O -fwrapv -Qunused-arguments -fPIC -fPIE -gdwarf-4 -Wall (Debian_Clang_11.0.1) |
T:neon | clang -march=native -Os -fwrapv -Qunused-arguments -fPIC -fPIE -gdwarf-4 -Wall (Debian_Clang_11.0.1) |
T:neon | clang -mcpu=native -O3 -fwrapv -Qunused-arguments -fPIC -fPIE -gdwarf-4 -Wall (Debian_Clang_11.0.1) |
blake3_neon.c: blake3_neon.c:3:10: fatal error: arm_neon.h: No such file or directory blake3_neon.c: 3 | #include <arm_neon.h> blake3_neon.c: | ^~~~~~~~~~~~ blake3_neon.c: compilation terminated.
Implementation | Compiler |
T:neon | gcc -march=native -mtune=native -O2 -fwrapv -fPIC -fPIE -gdwarf-4 -Wall (10.2.1_20210110) |
T:neon | gcc -march=native -mtune=native -O3 -fwrapv -fPIC -fPIE -gdwarf-4 -Wall (10.2.1_20210110) |
T:neon | gcc -march=native -mtune=native -O -fwrapv -fPIC -fPIE -gdwarf-4 -Wall (10.2.1_20210110) |
T:neon | gcc -march=native -mtune=native -Os -fwrapv -fPIC -fPIE -gdwarf-4 -Wall (10.2.1_20210110) |