Test results for amd64, speed2supercop, crypto_aead/omdsha256k128n96tau96v1

[Page version: 20250318 22:34:28]

Measurements for amd64, speed2supercop, crypto_aead Test results for amd64, speed2supercop, crypto_aead Test results for crypto_aead/omdsha256k128n96tau96v1
Computer: speed2supercop
Microarchitecture: amd64; Haswell+AES (306c3)
Architecture: amd64
CPU ID: GenuineIntel-000306c3-1fc9cbf5
SUPERCOP version: 20250307
Operation: crypto_aead
Primitive: omdsha256k128n96tau96v1
TimeObject sizeTest sizeImplementationCompilerBenchmark dateSUPERCOP version
15689211752 0 034037 752 928T:refgcc -march=native -mtune=native -O3 -fwrapv -fPIC -fPIE -gdwarf-4 -Wall2025031120250307
1757325754 0 026165 752 928T:refgcc -march=native -mtune=native -O2 -fwrapv -fPIC -fPIE -gdwarf-4 -Wall2025031120250307
1761369568 0 033590 792 920T:refclang -march=native -O3 -fwrapv -Qunused-arguments -fPIC -fPIE -gdwarf-4 -Wall2025031120250307
17707610327 0 034390 792 920T:refclang -march=native -O2 -fwrapv -Qunused-arguments -fPIC -fPIE -gdwarf-4 -Wall2025031120250307
1917084788 0 025191 784 920T:refclang -march=native -Os -fwrapv -Qunused-arguments -fPIC -fPIE -gdwarf-4 -Wall2025031120250307
1976249950 0 035734 792 856T:refclang -mcpu=native -O3 -fwrapv -Qunused-arguments -fPIC -fPIE -gdwarf-4 -Wall2025031120250307
2022965572 0 025548 744 928T:refgcc -march=native -mtune=native -O -fwrapv -fPIC -fPIE -gdwarf-4 -Wall2025031120250307
2044925703 0 025062 792 856T:refclang -march=native -O -fwrapv -Qunused-arguments -fPIC -fPIE -gdwarf-4 -Wall2025031120250307
2342123920 0 022064 728 896T:refgcc -march=native -mtune=native -Os -fwrapv -fPIC -fPIE -gdwarf-4 -Wall2025031120250307

Compiler output


try.c: /usr/bin/ld: libcrypto_aead_omdsha256k128n96tau96v1.a(omdsha256.o):.../supercop-data/speed2supercop/amd64/try/c/clang_-march=native_-O2_-fwrapv_-Qunused-arguments_-fPIC_-fPIE_-gdwarf-4_-Wall/timingleaks/crypto_aead/omdsha256k128n96tau96v1/avx1/work/./omdsha256.h:137: multiple definition of `Hash'; libcrypto_aead_omdsha256k128n96tau96v1.a(encrypt.o):.../supercop-data/speed2supercop/amd64/try/c/clang_-march=native_-O2_-fwrapv_-Qunused-arguments_-fPIC_-fPIE_-gdwarf-4_-Wall/timingleaks/crypto_aead/omdsha256k128n96tau96v1/avx1/work/./omdsha256.h:137: first defined here
try.c: clang: error: linker command failed with exit code 1 (use -v to see invocation)

Number of similar (implementation,compiler) pairs: 1, namely:
ImplementationCompiler
T:avx1clang -march=native -O2 -fwrapv -Qunused-arguments -fPIC -fPIE -gdwarf-4 -Wall (Debian_Clang_19.1.7_(1+b1))

Compiler output


try.c: /usr/bin/ld: libcrypto_aead_omdsha256k128n96tau96v1.a(omdsha256.o):.../supercop-data/speed2supercop/amd64/try/c/clang_-march=native_-O3_-fwrapv_-Qunused-arguments_-fPIC_-fPIE_-gdwarf-4_-Wall/timingleaks/crypto_aead/omdsha256k128n96tau96v1/avx1/work/./omdsha256.h:137: multiple definition of `Hash'; libcrypto_aead_omdsha256k128n96tau96v1.a(encrypt.o):.../supercop-data/speed2supercop/amd64/try/c/clang_-march=native_-O3_-fwrapv_-Qunused-arguments_-fPIC_-fPIE_-gdwarf-4_-Wall/timingleaks/crypto_aead/omdsha256k128n96tau96v1/avx1/work/./omdsha256.h:137: first defined here
try.c: clang: error: linker command failed with exit code 1 (use -v to see invocation)

Number of similar (implementation,compiler) pairs: 1, namely:
ImplementationCompiler
T:avx1clang -march=native -O3 -fwrapv -Qunused-arguments -fPIC -fPIE -gdwarf-4 -Wall (Debian_Clang_19.1.7_(1+b1))

Compiler output


try.c: /usr/bin/ld: libcrypto_aead_omdsha256k128n96tau96v1.a(omdsha256.o):.../supercop-data/speed2supercop/amd64/try/c/clang_-march=native_-O_-fwrapv_-Qunused-arguments_-fPIC_-fPIE_-gdwarf-4_-Wall/timingleaks/crypto_aead/omdsha256k128n96tau96v1/avx1/work/./omdsha256.h:137: multiple definition of `Hash'; libcrypto_aead_omdsha256k128n96tau96v1.a(encrypt.o):.../supercop-data/speed2supercop/amd64/try/c/clang_-march=native_-O_-fwrapv_-Qunused-arguments_-fPIC_-fPIE_-gdwarf-4_-Wall/timingleaks/crypto_aead/omdsha256k128n96tau96v1/avx1/work/./omdsha256.h:137: first defined here
try.c: clang: error: linker command failed with exit code 1 (use -v to see invocation)

Number of similar (implementation,compiler) pairs: 1, namely:
ImplementationCompiler
T:avx1clang -march=native -O -fwrapv -Qunused-arguments -fPIC -fPIE -gdwarf-4 -Wall (Debian_Clang_19.1.7_(1+b1))

Compiler output


try.c: /usr/bin/ld: libcrypto_aead_omdsha256k128n96tau96v1.a(omdsha256.o):.../supercop-data/speed2supercop/amd64/try/c/clang_-march=native_-Os_-fwrapv_-Qunused-arguments_-fPIC_-fPIE_-gdwarf-4_-Wall/timingleaks/crypto_aead/omdsha256k128n96tau96v1/avx1/work/./omdsha256.h:137: multiple definition of `Hash'; libcrypto_aead_omdsha256k128n96tau96v1.a(encrypt.o):.../supercop-data/speed2supercop/amd64/try/c/clang_-march=native_-Os_-fwrapv_-Qunused-arguments_-fPIC_-fPIE_-gdwarf-4_-Wall/timingleaks/crypto_aead/omdsha256k128n96tau96v1/avx1/work/./omdsha256.h:137: first defined here
try.c: clang: error: linker command failed with exit code 1 (use -v to see invocation)

Number of similar (implementation,compiler) pairs: 1, namely:
ImplementationCompiler
T:avx1clang -march=native -Os -fwrapv -Qunused-arguments -fPIC -fPIE -gdwarf-4 -Wall (Debian_Clang_19.1.7_(1+b1))

Compiler output


try.c: /usr/bin/ld: libcrypto_aead_omdsha256k128n96tau96v1.a(omdsha256.o):.../supercop-data/speed2supercop/amd64/try/c/clang_-mcpu=native_-O3_-fwrapv_-Qunused-arguments_-fPIC_-fPIE_-gdwarf-4_-Wall/timingleaks/crypto_aead/omdsha256k128n96tau96v1/avx1/work/./omdsha256.h:137: multiple definition of `Hash'; libcrypto_aead_omdsha256k128n96tau96v1.a(encrypt.o):.../supercop-data/speed2supercop/amd64/try/c/clang_-mcpu=native_-O3_-fwrapv_-Qunused-arguments_-fPIC_-fPIE_-gdwarf-4_-Wall/timingleaks/crypto_aead/omdsha256k128n96tau96v1/avx1/work/./omdsha256.h:137: first defined here
try.c: clang: error: linker command failed with exit code 1 (use -v to see invocation)

Number of similar (implementation,compiler) pairs: 1, namely:
ImplementationCompiler
T:avx1clang -mcpu=native -O3 -fwrapv -Qunused-arguments -fPIC -fPIE -gdwarf-4 -Wall (Debian_Clang_19.1.7_(1+b1))

Compiler output


encrypt.c: /tmp/ccEMeZjk.s: Assembler messages:
encrypt.c: /tmp/ccEMeZjk.s:922: Warning: dwarf line number information for .data ignored
encrypt.c: /tmp/ccEMeZjk.s:924: Warning: dwarf line number information for .data ignored
encrypt.c: /tmp/ccEMeZjk.s:925: Warning: dwarf line number information for .data ignored
encrypt.c: /tmp/ccEMeZjk.s:926: Warning: dwarf line number information for .data ignored
encrypt.c: /tmp/ccEMeZjk.s:937: Warning: dwarf line number information for .data ignored
encrypt.c: /tmp/ccEMeZjk.s:944: Warning: dwarf line number information for .data ignored
encrypt.c: /tmp/ccEMeZjk.s:947: Warning: dwarf line number information for .data ignored
encrypt.c: /tmp/ccEMeZjk.s:948: Warning: dwarf line number information for .data ignored
encrypt.c: /tmp/ccEMeZjk.s:955: Warning: dwarf line number information for .data ignored
encrypt.c: /tmp/ccEMeZjk.s:956: Warning: dwarf line number information for .data ignored
encrypt.c: /tmp/ccEMeZjk.s:959: Warning: dwarf line number information for .data ignored
encrypt.c: /tmp/ccEMeZjk.s:961: Warning: dwarf line number information for .data ignored
encrypt.c: /tmp/ccEMeZjk.s:964: Warning: dwarf line number information for .data ignored
encrypt.c: /tmp/ccEMeZjk.s:972: Warning: dwarf line number information for .data ignored
encrypt.c: /tmp/ccEMeZjk.s:983: Warning: dwarf line number information for .data ignored
encrypt.c: /tmp/ccEMeZjk.s:985: Warning: dwarf line number information for .data ignored
encrypt.c: /tmp/ccEMeZjk.s:986: Warning: dwarf line number information for .data ignored
encrypt.c: /tmp/ccEMeZjk.s:987: Warning: dwarf line number information for .data ignored
encrypt.c: /tmp/ccEMeZjk.s:994: Warning: dwarf line number information for .data ignored
encrypt.c: /tmp/ccEMeZjk.s:1001: Warning: dwarf line number information for .data ignored
encrypt.c: /tmp/ccEMeZjk.s:1004: Warning: dwarf line number information for .data ignored
encrypt.c: /tmp/ccEMeZjk.s:1007: Warning: dwarf line number information for .data ignored
encrypt.c: /tmp/ccEMeZjk.s:1014: Warning: dwarf line number information for .data ignored
encrypt.c: /tmp/ccEMeZjk.s:1017: Warning: dwarf line number information for .data ignored
encrypt.c: ...

Number of similar (implementation,compiler) pairs: 1, namely:
ImplementationCompiler
T:avx1gcc -march=native -mtune=native -O2 -fwrapv -fPIC -fPIE -gdwarf-4 -Wall (14.2.0)

Compiler output


encrypt.c: /tmp/cczRy8PD.s: Assembler messages:
encrypt.c: /tmp/cczRy8PD.s:922: Warning: dwarf line number information for .data ignored
encrypt.c: /tmp/cczRy8PD.s:924: Warning: dwarf line number information for .data ignored
encrypt.c: /tmp/cczRy8PD.s:925: Warning: dwarf line number information for .data ignored
encrypt.c: /tmp/cczRy8PD.s:926: Warning: dwarf line number information for .data ignored
encrypt.c: /tmp/cczRy8PD.s:937: Warning: dwarf line number information for .data ignored
encrypt.c: /tmp/cczRy8PD.s:944: Warning: dwarf line number information for .data ignored
encrypt.c: /tmp/cczRy8PD.s:947: Warning: dwarf line number information for .data ignored
encrypt.c: /tmp/cczRy8PD.s:948: Warning: dwarf line number information for .data ignored
encrypt.c: /tmp/cczRy8PD.s:955: Warning: dwarf line number information for .data ignored
encrypt.c: /tmp/cczRy8PD.s:956: Warning: dwarf line number information for .data ignored
encrypt.c: /tmp/cczRy8PD.s:959: Warning: dwarf line number information for .data ignored
encrypt.c: /tmp/cczRy8PD.s:961: Warning: dwarf line number information for .data ignored
encrypt.c: /tmp/cczRy8PD.s:964: Warning: dwarf line number information for .data ignored
encrypt.c: /tmp/cczRy8PD.s:972: Warning: dwarf line number information for .data ignored
encrypt.c: /tmp/cczRy8PD.s:983: Warning: dwarf line number information for .data ignored
encrypt.c: /tmp/cczRy8PD.s:985: Warning: dwarf line number information for .data ignored
encrypt.c: /tmp/cczRy8PD.s:986: Warning: dwarf line number information for .data ignored
encrypt.c: /tmp/cczRy8PD.s:987: Warning: dwarf line number information for .data ignored
encrypt.c: /tmp/cczRy8PD.s:994: Warning: dwarf line number information for .data ignored
encrypt.c: /tmp/cczRy8PD.s:1001: Warning: dwarf line number information for .data ignored
encrypt.c: /tmp/cczRy8PD.s:1004: Warning: dwarf line number information for .data ignored
encrypt.c: /tmp/cczRy8PD.s:1007: Warning: dwarf line number information for .data ignored
encrypt.c: /tmp/cczRy8PD.s:1014: Warning: dwarf line number information for .data ignored
encrypt.c: /tmp/cczRy8PD.s:1017: Warning: dwarf line number information for .data ignored
encrypt.c: ...

Number of similar (implementation,compiler) pairs: 1, namely:
ImplementationCompiler
T:avx1gcc -march=native -mtune=native -O3 -fwrapv -fPIC -fPIE -gdwarf-4 -Wall (14.2.0)

Compiler output


encrypt.c: /tmp/cc4hzTUG.s: Assembler messages:
encrypt.c: /tmp/cc4hzTUG.s:921: Warning: dwarf line number information for .data ignored
encrypt.c: /tmp/cc4hzTUG.s:923: Warning: dwarf line number information for .data ignored
encrypt.c: /tmp/cc4hzTUG.s:934: Warning: dwarf line number information for .data ignored
encrypt.c: /tmp/cc4hzTUG.s:935: Warning: dwarf line number information for .data ignored
encrypt.c: /tmp/cc4hzTUG.s:936: Warning: dwarf line number information for .data ignored
encrypt.c: /tmp/cc4hzTUG.s:943: Warning: dwarf line number information for .data ignored
encrypt.c: /tmp/cc4hzTUG.s:946: Warning: dwarf line number information for .data ignored
encrypt.c: /tmp/cc4hzTUG.s:947: Warning: dwarf line number information for .data ignored
encrypt.c: /tmp/cc4hzTUG.s:952: Warning: dwarf line number information for .data ignored
encrypt.c: /tmp/cc4hzTUG.s:953: Warning: dwarf line number information for .data ignored
encrypt.c: /tmp/cc4hzTUG.s:956: Warning: dwarf line number information for .data ignored
encrypt.c: /tmp/cc4hzTUG.s:958: Warning: dwarf line number information for .data ignored
encrypt.c: /tmp/cc4hzTUG.s:961: Warning: dwarf line number information for .data ignored
encrypt.c: /tmp/cc4hzTUG.s:969: Warning: dwarf line number information for .data ignored
encrypt.c: /tmp/cc4hzTUG.s:979: Warning: dwarf line number information for .data ignored
encrypt.c: /tmp/cc4hzTUG.s:981: Warning: dwarf line number information for .data ignored
encrypt.c: /tmp/cc4hzTUG.s:993: Warning: dwarf line number information for .data ignored
encrypt.c: /tmp/cc4hzTUG.s:997: Warning: dwarf line number information for .data ignored
encrypt.c: /tmp/cc4hzTUG.s:998: Warning: dwarf line number information for .data ignored
encrypt.c: /tmp/cc4hzTUG.s:999: Warning: dwarf line number information for .data ignored
encrypt.c: /tmp/cc4hzTUG.s:1006: Warning: dwarf line number information for .data ignored
encrypt.c: /tmp/cc4hzTUG.s:1009: Warning: dwarf line number information for .data ignored
encrypt.c: /tmp/cc4hzTUG.s:1012: Warning: dwarf line number information for .data ignored
encrypt.c: /tmp/cc4hzTUG.s:1015: Warning: dwarf line number information for .data ignored
encrypt.c: ...

Number of similar (implementation,compiler) pairs: 1, namely:
ImplementationCompiler
T:avx1gcc -march=native -mtune=native -O -fwrapv -fPIC -fPIE -gdwarf-4 -Wall (14.2.0)

Compiler output


encrypt.c: /tmp/cckf2GuK.s: Assembler messages:
encrypt.c: /tmp/cckf2GuK.s:921: Warning: dwarf line number information for .data ignored
encrypt.c: /tmp/cckf2GuK.s:923: Warning: dwarf line number information for .data ignored
encrypt.c: /tmp/cckf2GuK.s:924: Warning: dwarf line number information for .data ignored
encrypt.c: /tmp/cckf2GuK.s:925: Warning: dwarf line number information for .data ignored
encrypt.c: /tmp/cckf2GuK.s:936: Warning: dwarf line number information for .data ignored
encrypt.c: /tmp/cckf2GuK.s:943: Warning: dwarf line number information for .data ignored
encrypt.c: /tmp/cckf2GuK.s:946: Warning: dwarf line number information for .data ignored
encrypt.c: /tmp/cckf2GuK.s:947: Warning: dwarf line number information for .data ignored
encrypt.c: /tmp/cckf2GuK.s:954: Warning: dwarf line number information for .data ignored
encrypt.c: /tmp/cckf2GuK.s:955: Warning: dwarf line number information for .data ignored
encrypt.c: /tmp/cckf2GuK.s:958: Warning: dwarf line number information for .data ignored
encrypt.c: /tmp/cckf2GuK.s:960: Warning: dwarf line number information for .data ignored
encrypt.c: /tmp/cckf2GuK.s:963: Warning: dwarf line number information for .data ignored
encrypt.c: /tmp/cckf2GuK.s:971: Warning: dwarf line number information for .data ignored
encrypt.c: /tmp/cckf2GuK.s:981: Warning: dwarf line number information for .data ignored
encrypt.c: /tmp/cckf2GuK.s:983: Warning: dwarf line number information for .data ignored
encrypt.c: /tmp/cckf2GuK.s:984: Warning: dwarf line number information for .data ignored
encrypt.c: /tmp/cckf2GuK.s:985: Warning: dwarf line number information for .data ignored
encrypt.c: /tmp/cckf2GuK.s:992: Warning: dwarf line number information for .data ignored
encrypt.c: /tmp/cckf2GuK.s:999: Warning: dwarf line number information for .data ignored
encrypt.c: /tmp/cckf2GuK.s:1002: Warning: dwarf line number information for .data ignored
encrypt.c: /tmp/cckf2GuK.s:1005: Warning: dwarf line number information for .data ignored
encrypt.c: /tmp/cckf2GuK.s:1012: Warning: dwarf line number information for .data ignored
encrypt.c: /tmp/cckf2GuK.s:1015: Warning: dwarf line number information for .data ignored
encrypt.c: ...

Number of similar (implementation,compiler) pairs: 1, namely:
ImplementationCompiler
T:avx1gcc -march=native -mtune=native -Os -fwrapv -fPIC -fPIE -gdwarf-4 -Wall (14.2.0)

Compiler output


try.c: /usr/bin/ld: libcrypto_aead_omdsha256k128n96tau96v1.a(omdsha256.o):.../supercop-data/speed2supercop/amd64/try/c/clang_-march=native_-O2_-fwrapv_-Qunused-arguments_-fPIC_-fPIE_-gdwarf-4_-Wall/timingleaks/crypto_aead/omdsha256k128n96tau96v1/sse4/work/./omdsha256.h:137: multiple definition of `Hash'; libcrypto_aead_omdsha256k128n96tau96v1.a(encrypt.o):.../supercop-data/speed2supercop/amd64/try/c/clang_-march=native_-O2_-fwrapv_-Qunused-arguments_-fPIC_-fPIE_-gdwarf-4_-Wall/timingleaks/crypto_aead/omdsha256k128n96tau96v1/sse4/work/./omdsha256.h:137: first defined here
try.c: clang: error: linker command failed with exit code 1 (use -v to see invocation)

Number of similar (implementation,compiler) pairs: 1, namely:
ImplementationCompiler
T:sse4clang -march=native -O2 -fwrapv -Qunused-arguments -fPIC -fPIE -gdwarf-4 -Wall (Debian_Clang_19.1.7_(1+b1))

Compiler output


try.c: /usr/bin/ld: libcrypto_aead_omdsha256k128n96tau96v1.a(omdsha256.o):.../supercop-data/speed2supercop/amd64/try/c/clang_-march=native_-O3_-fwrapv_-Qunused-arguments_-fPIC_-fPIE_-gdwarf-4_-Wall/timingleaks/crypto_aead/omdsha256k128n96tau96v1/sse4/work/./omdsha256.h:137: multiple definition of `Hash'; libcrypto_aead_omdsha256k128n96tau96v1.a(encrypt.o):.../supercop-data/speed2supercop/amd64/try/c/clang_-march=native_-O3_-fwrapv_-Qunused-arguments_-fPIC_-fPIE_-gdwarf-4_-Wall/timingleaks/crypto_aead/omdsha256k128n96tau96v1/sse4/work/./omdsha256.h:137: first defined here
try.c: clang: error: linker command failed with exit code 1 (use -v to see invocation)

Number of similar (implementation,compiler) pairs: 1, namely:
ImplementationCompiler
T:sse4clang -march=native -O3 -fwrapv -Qunused-arguments -fPIC -fPIE -gdwarf-4 -Wall (Debian_Clang_19.1.7_(1+b1))

Compiler output


try.c: /usr/bin/ld: libcrypto_aead_omdsha256k128n96tau96v1.a(omdsha256.o):.../supercop-data/speed2supercop/amd64/try/c/clang_-march=native_-O_-fwrapv_-Qunused-arguments_-fPIC_-fPIE_-gdwarf-4_-Wall/timingleaks/crypto_aead/omdsha256k128n96tau96v1/sse4/work/./omdsha256.h:137: multiple definition of `Hash'; libcrypto_aead_omdsha256k128n96tau96v1.a(encrypt.o):.../supercop-data/speed2supercop/amd64/try/c/clang_-march=native_-O_-fwrapv_-Qunused-arguments_-fPIC_-fPIE_-gdwarf-4_-Wall/timingleaks/crypto_aead/omdsha256k128n96tau96v1/sse4/work/./omdsha256.h:137: first defined here
try.c: clang: error: linker command failed with exit code 1 (use -v to see invocation)

Number of similar (implementation,compiler) pairs: 1, namely:
ImplementationCompiler
T:sse4clang -march=native -O -fwrapv -Qunused-arguments -fPIC -fPIE -gdwarf-4 -Wall (Debian_Clang_19.1.7_(1+b1))

Compiler output


try.c: /usr/bin/ld: libcrypto_aead_omdsha256k128n96tau96v1.a(omdsha256.o):.../supercop-data/speed2supercop/amd64/try/c/clang_-march=native_-Os_-fwrapv_-Qunused-arguments_-fPIC_-fPIE_-gdwarf-4_-Wall/timingleaks/crypto_aead/omdsha256k128n96tau96v1/sse4/work/./omdsha256.h:137: multiple definition of `Hash'; libcrypto_aead_omdsha256k128n96tau96v1.a(encrypt.o):.../supercop-data/speed2supercop/amd64/try/c/clang_-march=native_-Os_-fwrapv_-Qunused-arguments_-fPIC_-fPIE_-gdwarf-4_-Wall/timingleaks/crypto_aead/omdsha256k128n96tau96v1/sse4/work/./omdsha256.h:137: first defined here
try.c: clang: error: linker command failed with exit code 1 (use -v to see invocation)

Number of similar (implementation,compiler) pairs: 1, namely:
ImplementationCompiler
T:sse4clang -march=native -Os -fwrapv -Qunused-arguments -fPIC -fPIE -gdwarf-4 -Wall (Debian_Clang_19.1.7_(1+b1))

Compiler output


try.c: /usr/bin/ld: libcrypto_aead_omdsha256k128n96tau96v1.a(omdsha256.o):.../supercop-data/speed2supercop/amd64/try/c/clang_-mcpu=native_-O3_-fwrapv_-Qunused-arguments_-fPIC_-fPIE_-gdwarf-4_-Wall/timingleaks/crypto_aead/omdsha256k128n96tau96v1/sse4/work/./omdsha256.h:137: multiple definition of `Hash'; libcrypto_aead_omdsha256k128n96tau96v1.a(encrypt.o):.../supercop-data/speed2supercop/amd64/try/c/clang_-mcpu=native_-O3_-fwrapv_-Qunused-arguments_-fPIC_-fPIE_-gdwarf-4_-Wall/timingleaks/crypto_aead/omdsha256k128n96tau96v1/sse4/work/./omdsha256.h:137: first defined here
try.c: clang: error: linker command failed with exit code 1 (use -v to see invocation)

Number of similar (implementation,compiler) pairs: 1, namely:
ImplementationCompiler
T:sse4clang -mcpu=native -O3 -fwrapv -Qunused-arguments -fPIC -fPIE -gdwarf-4 -Wall (Debian_Clang_19.1.7_(1+b1))

Compiler output


encrypt.c: /tmp/cc0GeCY4.s: Assembler messages:
encrypt.c: /tmp/cc0GeCY4.s:961: Warning: dwarf line number information for .data ignored
encrypt.c: /tmp/cc0GeCY4.s:963: Warning: dwarf line number information for .data ignored
encrypt.c: /tmp/cc0GeCY4.s:964: Warning: dwarf line number information for .data ignored
encrypt.c: /tmp/cc0GeCY4.s:965: Warning: dwarf line number information for .data ignored
encrypt.c: /tmp/cc0GeCY4.s:976: Warning: dwarf line number information for .data ignored
encrypt.c: /tmp/cc0GeCY4.s:983: Warning: dwarf line number information for .data ignored
encrypt.c: /tmp/cc0GeCY4.s:986: Warning: dwarf line number information for .data ignored
encrypt.c: /tmp/cc0GeCY4.s:987: Warning: dwarf line number information for .data ignored
encrypt.c: /tmp/cc0GeCY4.s:994: Warning: dwarf line number information for .data ignored
encrypt.c: /tmp/cc0GeCY4.s:995: Warning: dwarf line number information for .data ignored
encrypt.c: /tmp/cc0GeCY4.s:998: Warning: dwarf line number information for .data ignored
encrypt.c: /tmp/cc0GeCY4.s:1000: Warning: dwarf line number information for .data ignored
encrypt.c: /tmp/cc0GeCY4.s:1003: Warning: dwarf line number information for .data ignored
encrypt.c: /tmp/cc0GeCY4.s:1011: Warning: dwarf line number information for .data ignored
encrypt.c: /tmp/cc0GeCY4.s:1022: Warning: dwarf line number information for .data ignored
encrypt.c: /tmp/cc0GeCY4.s:1024: Warning: dwarf line number information for .data ignored
encrypt.c: /tmp/cc0GeCY4.s:1025: Warning: dwarf line number information for .data ignored
encrypt.c: /tmp/cc0GeCY4.s:1026: Warning: dwarf line number information for .data ignored
encrypt.c: /tmp/cc0GeCY4.s:1033: Warning: dwarf line number information for .data ignored
encrypt.c: /tmp/cc0GeCY4.s:1040: Warning: dwarf line number information for .data ignored
encrypt.c: /tmp/cc0GeCY4.s:1043: Warning: dwarf line number information for .data ignored
encrypt.c: /tmp/cc0GeCY4.s:1046: Warning: dwarf line number information for .data ignored
encrypt.c: /tmp/cc0GeCY4.s:1053: Warning: dwarf line number information for .data ignored
encrypt.c: /tmp/cc0GeCY4.s:1056: Warning: dwarf line number information for .data ignored
encrypt.c: ...

Number of similar (implementation,compiler) pairs: 1, namely:
ImplementationCompiler
T:sse4gcc -march=native -mtune=native -O2 -fwrapv -fPIC -fPIE -gdwarf-4 -Wall (14.2.0)

Compiler output


encrypt.c: /tmp/ccx5U2eT.s: Assembler messages:
encrypt.c: /tmp/ccx5U2eT.s:961: Warning: dwarf line number information for .data ignored
encrypt.c: /tmp/ccx5U2eT.s:963: Warning: dwarf line number information for .data ignored
encrypt.c: /tmp/ccx5U2eT.s:964: Warning: dwarf line number information for .data ignored
encrypt.c: /tmp/ccx5U2eT.s:965: Warning: dwarf line number information for .data ignored
encrypt.c: /tmp/ccx5U2eT.s:976: Warning: dwarf line number information for .data ignored
encrypt.c: /tmp/ccx5U2eT.s:983: Warning: dwarf line number information for .data ignored
encrypt.c: /tmp/ccx5U2eT.s:986: Warning: dwarf line number information for .data ignored
encrypt.c: /tmp/ccx5U2eT.s:987: Warning: dwarf line number information for .data ignored
encrypt.c: /tmp/ccx5U2eT.s:994: Warning: dwarf line number information for .data ignored
encrypt.c: /tmp/ccx5U2eT.s:995: Warning: dwarf line number information for .data ignored
encrypt.c: /tmp/ccx5U2eT.s:998: Warning: dwarf line number information for .data ignored
encrypt.c: /tmp/ccx5U2eT.s:1000: Warning: dwarf line number information for .data ignored
encrypt.c: /tmp/ccx5U2eT.s:1003: Warning: dwarf line number information for .data ignored
encrypt.c: /tmp/ccx5U2eT.s:1011: Warning: dwarf line number information for .data ignored
encrypt.c: /tmp/ccx5U2eT.s:1022: Warning: dwarf line number information for .data ignored
encrypt.c: /tmp/ccx5U2eT.s:1024: Warning: dwarf line number information for .data ignored
encrypt.c: /tmp/ccx5U2eT.s:1025: Warning: dwarf line number information for .data ignored
encrypt.c: /tmp/ccx5U2eT.s:1026: Warning: dwarf line number information for .data ignored
encrypt.c: /tmp/ccx5U2eT.s:1033: Warning: dwarf line number information for .data ignored
encrypt.c: /tmp/ccx5U2eT.s:1040: Warning: dwarf line number information for .data ignored
encrypt.c: /tmp/ccx5U2eT.s:1043: Warning: dwarf line number information for .data ignored
encrypt.c: /tmp/ccx5U2eT.s:1046: Warning: dwarf line number information for .data ignored
encrypt.c: /tmp/ccx5U2eT.s:1053: Warning: dwarf line number information for .data ignored
encrypt.c: /tmp/ccx5U2eT.s:1056: Warning: dwarf line number information for .data ignored
encrypt.c: ...

Number of similar (implementation,compiler) pairs: 1, namely:
ImplementationCompiler
T:sse4gcc -march=native -mtune=native -O3 -fwrapv -fPIC -fPIE -gdwarf-4 -Wall (14.2.0)

Compiler output


encrypt.c: /tmp/ccAj8Xrh.s: Assembler messages:
encrypt.c: /tmp/ccAj8Xrh.s:960: Warning: dwarf line number information for .data ignored
encrypt.c: /tmp/ccAj8Xrh.s:962: Warning: dwarf line number information for .data ignored
encrypt.c: /tmp/ccAj8Xrh.s:973: Warning: dwarf line number information for .data ignored
encrypt.c: /tmp/ccAj8Xrh.s:974: Warning: dwarf line number information for .data ignored
encrypt.c: /tmp/ccAj8Xrh.s:975: Warning: dwarf line number information for .data ignored
encrypt.c: /tmp/ccAj8Xrh.s:982: Warning: dwarf line number information for .data ignored
encrypt.c: /tmp/ccAj8Xrh.s:985: Warning: dwarf line number information for .data ignored
encrypt.c: /tmp/ccAj8Xrh.s:986: Warning: dwarf line number information for .data ignored
encrypt.c: /tmp/ccAj8Xrh.s:991: Warning: dwarf line number information for .data ignored
encrypt.c: /tmp/ccAj8Xrh.s:992: Warning: dwarf line number information for .data ignored
encrypt.c: /tmp/ccAj8Xrh.s:995: Warning: dwarf line number information for .data ignored
encrypt.c: /tmp/ccAj8Xrh.s:997: Warning: dwarf line number information for .data ignored
encrypt.c: /tmp/ccAj8Xrh.s:1000: Warning: dwarf line number information for .data ignored
encrypt.c: /tmp/ccAj8Xrh.s:1008: Warning: dwarf line number information for .data ignored
encrypt.c: /tmp/ccAj8Xrh.s:1018: Warning: dwarf line number information for .data ignored
encrypt.c: /tmp/ccAj8Xrh.s:1020: Warning: dwarf line number information for .data ignored
encrypt.c: /tmp/ccAj8Xrh.s:1032: Warning: dwarf line number information for .data ignored
encrypt.c: /tmp/ccAj8Xrh.s:1036: Warning: dwarf line number information for .data ignored
encrypt.c: /tmp/ccAj8Xrh.s:1037: Warning: dwarf line number information for .data ignored
encrypt.c: /tmp/ccAj8Xrh.s:1038: Warning: dwarf line number information for .data ignored
encrypt.c: /tmp/ccAj8Xrh.s:1045: Warning: dwarf line number information for .data ignored
encrypt.c: /tmp/ccAj8Xrh.s:1048: Warning: dwarf line number information for .data ignored
encrypt.c: /tmp/ccAj8Xrh.s:1051: Warning: dwarf line number information for .data ignored
encrypt.c: /tmp/ccAj8Xrh.s:1054: Warning: dwarf line number information for .data ignored
encrypt.c: ...

Number of similar (implementation,compiler) pairs: 1, namely:
ImplementationCompiler
T:sse4gcc -march=native -mtune=native -O -fwrapv -fPIC -fPIE -gdwarf-4 -Wall (14.2.0)

Compiler output


encrypt.c: /tmp/cc5nHlzh.s: Assembler messages:
encrypt.c: /tmp/cc5nHlzh.s:960: Warning: dwarf line number information for .data ignored
encrypt.c: /tmp/cc5nHlzh.s:962: Warning: dwarf line number information for .data ignored
encrypt.c: /tmp/cc5nHlzh.s:963: Warning: dwarf line number information for .data ignored
encrypt.c: /tmp/cc5nHlzh.s:964: Warning: dwarf line number information for .data ignored
encrypt.c: /tmp/cc5nHlzh.s:975: Warning: dwarf line number information for .data ignored
encrypt.c: /tmp/cc5nHlzh.s:982: Warning: dwarf line number information for .data ignored
encrypt.c: /tmp/cc5nHlzh.s:985: Warning: dwarf line number information for .data ignored
encrypt.c: /tmp/cc5nHlzh.s:986: Warning: dwarf line number information for .data ignored
encrypt.c: /tmp/cc5nHlzh.s:993: Warning: dwarf line number information for .data ignored
encrypt.c: /tmp/cc5nHlzh.s:994: Warning: dwarf line number information for .data ignored
encrypt.c: /tmp/cc5nHlzh.s:997: Warning: dwarf line number information for .data ignored
encrypt.c: /tmp/cc5nHlzh.s:999: Warning: dwarf line number information for .data ignored
encrypt.c: /tmp/cc5nHlzh.s:1002: Warning: dwarf line number information for .data ignored
encrypt.c: /tmp/cc5nHlzh.s:1010: Warning: dwarf line number information for .data ignored
encrypt.c: /tmp/cc5nHlzh.s:1020: Warning: dwarf line number information for .data ignored
encrypt.c: /tmp/cc5nHlzh.s:1022: Warning: dwarf line number information for .data ignored
encrypt.c: /tmp/cc5nHlzh.s:1023: Warning: dwarf line number information for .data ignored
encrypt.c: /tmp/cc5nHlzh.s:1024: Warning: dwarf line number information for .data ignored
encrypt.c: /tmp/cc5nHlzh.s:1031: Warning: dwarf line number information for .data ignored
encrypt.c: /tmp/cc5nHlzh.s:1038: Warning: dwarf line number information for .data ignored
encrypt.c: /tmp/cc5nHlzh.s:1041: Warning: dwarf line number information for .data ignored
encrypt.c: /tmp/cc5nHlzh.s:1044: Warning: dwarf line number information for .data ignored
encrypt.c: /tmp/cc5nHlzh.s:1051: Warning: dwarf line number information for .data ignored
encrypt.c: /tmp/cc5nHlzh.s:1054: Warning: dwarf line number information for .data ignored
encrypt.c: ...

Number of similar (implementation,compiler) pairs: 1, namely:
ImplementationCompiler
T:sse4gcc -march=native -mtune=native -Os -fwrapv -fPIC -fPIE -gdwarf-4 -Wall (14.2.0)

Namespace violations


omdsha256.o calc_L_i T
omdsha256.o double_block T
omdsha256.o final_masking_associated_data T
omdsha256.o final_masking_message T
omdsha256.o hash T
omdsha256.o increment_masking_associated_data T
omdsha256.o increment_masking_message T
omdsha256.o key_func T
omdsha256.o l2b T
omdsha256.o ntz T
omdsha256.o omdsha256_process T
omdsha256.o triple_block T
omdsha256.o xor_block T
sha256.o sha256_comp T

Number of similar (implementation,compiler) pairs: 9, namely:
ImplementationCompiler
T:refclang -march=native -O2 -fwrapv -Qunused-arguments -fPIC -fPIE -gdwarf-4 -Wall (Debian_Clang_19.1.7_(1+b1))
T:refclang -march=native -O3 -fwrapv -Qunused-arguments -fPIC -fPIE -gdwarf-4 -Wall (Debian_Clang_19.1.7_(1+b1))
T:refclang -march=native -O -fwrapv -Qunused-arguments -fPIC -fPIE -gdwarf-4 -Wall (Debian_Clang_19.1.7_(1+b1))
T:refclang -march=native -Os -fwrapv -Qunused-arguments -fPIC -fPIE -gdwarf-4 -Wall (Debian_Clang_19.1.7_(1+b1))
T:refclang -mcpu=native -O3 -fwrapv -Qunused-arguments -fPIC -fPIE -gdwarf-4 -Wall (Debian_Clang_19.1.7_(1+b1))
T:refgcc -march=native -mtune=native -O2 -fwrapv -fPIC -fPIE -gdwarf-4 -Wall (14.2.0)
T:refgcc -march=native -mtune=native -O3 -fwrapv -fPIC -fPIE -gdwarf-4 -Wall (14.2.0)
T:refgcc -march=native -mtune=native -O -fwrapv -fPIC -fPIE -gdwarf-4 -Wall (14.2.0)
T:refgcc -march=native -mtune=native -Os -fwrapv -fPIC -fPIE -gdwarf-4 -Wall (14.2.0)