Test results for amd64, speed2supercop, crypto_aead/morus1280128v1
[Page version: 20250318 22:34:28]
Measurements for amd64, speed2supercop, crypto_aead
Test results for amd64, speed2supercop, crypto_aead
Test results for crypto_aead/morus1280128v1
Computer: speed2supercop
Microarchitecture: amd64; Haswell+AES (306c3)
Architecture: amd64
CPU ID: GenuineIntel-000306c3-1fc9cbf5
SUPERCOP version: 20250307
Operation: crypto_aead
Primitive: morus1280128v1
Time | Object size | Test size | Implementation | Compiler | Benchmark date | SUPERCOP version |
4912 | 5695 0 0 | 23934 792 920 | T:avx2 | clang -march=native -O2 -fwrapv -Qunused-arguments -fPIC -fPIE -gdwarf-4 -Wall | 20250311 | 20250307 |
4916 | 5695 0 0 | 23894 792 920 | T:avx2 | clang -march=native -O3 -fwrapv -Qunused-arguments -fPIC -fPIE -gdwarf-4 -Wall | 20250311 | 20250307 |
5028 | 6541 0 0 | 19886 792 856 | T:avx2 | clang -march=native -O -fwrapv -Qunused-arguments -fPIC -fPIE -gdwarf-4 -Wall | 20250311 | 20250307 |
5108 | 4462 0 0 | 18879 784 920 | T:avx2 | clang -march=native -Os -fwrapv -Qunused-arguments -fPIC -fPIE -gdwarf-4 -Wall | 20250311 | 20250307 |
5248 | 6322 0 0 | 22061 752 928 | T:avx2 | gcc -march=native -mtune=native -O3 -fwrapv -fPIC -fPIE -gdwarf-4 -Wall | 20250311 | 20250307 |
5512 | 3634 0 0 | 17437 752 928 | T:avx2 | gcc -march=native -mtune=native -O -fwrapv -fPIC -fPIE -gdwarf-4 -Wall | 20250311 | 20250307 |
5660 | 3914 0 0 | 17781 752 928 | T:avx2 | gcc -march=native -mtune=native -O2 -fwrapv -fPIC -fPIE -gdwarf-4 -Wall | 20250311 | 20250307 |
6704 | 6278 0 0 | 20655 784 920 | T:sse2 | clang -march=native -Os -fwrapv -Qunused-arguments -fPIC -fPIE -gdwarf-4 -Wall | 20250311 | 20250307 |
6924 | 10209 0 0 | 28422 792 920 | T:sse2 | clang -march=native -O2 -fwrapv -Qunused-arguments -fPIC -fPIE -gdwarf-4 -Wall | 20250311 | 20250307 |
6948 | 10209 0 0 | 28358 792 920 | T:sse2 | clang -march=native -O3 -fwrapv -Qunused-arguments -fPIC -fPIE -gdwarf-4 -Wall | 20250311 | 20250307 |
7956 | 9176 0 0 | 24909 752 928 | T:sse2 | gcc -march=native -mtune=native -O3 -fwrapv -fPIC -fPIE -gdwarf-4 -Wall | 20250311 | 20250307 |
8148 | 11487 0 0 | 24806 792 856 | T:sse2 | clang -march=native -O -fwrapv -Qunused-arguments -fPIC -fPIE -gdwarf-4 -Wall | 20250311 | 20250307 |
8196 | 12413 0 0 | 32310 792 856 | T:sse2 | clang -mcpu=native -O3 -fwrapv -Qunused-arguments -fPIC -fPIE -gdwarf-4 -Wall | 20250311 | 20250307 |
12836 | 9759 0 0 | 28022 792 920 | T:ref | clang -march=native -O3 -fwrapv -Qunused-arguments -fPIC -fPIE -gdwarf-4 -Wall | 20250311 | 20250307 |
12984 | 6820 0 0 | 21231 784 920 | T:ref | clang -march=native -Os -fwrapv -Qunused-arguments -fPIC -fPIE -gdwarf-4 -Wall | 20250311 | 20250307 |
13036 | 9711 0 0 | 28014 792 920 | T:ref | clang -march=native -O2 -fwrapv -Qunused-arguments -fPIC -fPIE -gdwarf-4 -Wall | 20250311 | 20250307 |
13484 | 14585 0 0 | 30317 752 928 | T:ref | gcc -march=native -mtune=native -O3 -fwrapv -fPIC -fPIE -gdwarf-4 -Wall | 20250311 | 20250307 |
13536 | 18217 0 0 | 31630 792 856 | T:ref | clang -march=native -O -fwrapv -Qunused-arguments -fPIC -fPIE -gdwarf-4 -Wall | 20250311 | 20250307 |
13976 | 19330 0 0 | 35077 752 928 | T:ref64 | gcc -march=native -mtune=native -O3 -fwrapv -fPIC -fPIE -gdwarf-4 -Wall | 20250311 | 20250307 |
14744 | 13523 0 0 | 33518 792 856 | T:ref | clang -mcpu=native -O3 -fwrapv -Qunused-arguments -fPIC -fPIE -gdwarf-4 -Wall | 20250311 | 20250307 |
16724 | 9857 0 0 | 23733 752 928 | T:ref | gcc -march=native -mtune=native -O2 -fwrapv -fPIC -fPIE -gdwarf-4 -Wall | 20250311 | 20250307 |
18524 | 11349 0 0 | 25076 744 928 | T:ref | gcc -march=native -mtune=native -O -fwrapv -fPIC -fPIE -gdwarf-4 -Wall | 20250311 | 20250307 |
19148 | 3168 0 0 | 15424 728 896 | T:ref | gcc -march=native -mtune=native -Os -fwrapv -fPIC -fPIE -gdwarf-4 -Wall | 20250311 | 20250307 |
19344 | 5045 0 0 | 17320 728 896 | T:ref64 | gcc -march=native -mtune=native -Os -fwrapv -fPIC -fPIE -gdwarf-4 -Wall | 20250311 | 20250307 |
19352 | 5452 0 0 | 19188 744 928 | T:ref64 | gcc -march=native -mtune=native -O -fwrapv -fPIC -fPIE -gdwarf-4 -Wall | 20250311 | 20250307 |
19996 | 5550 0 0 | 19429 752 928 | T:ref64 | gcc -march=native -mtune=native -O2 -fwrapv -fPIC -fPIE -gdwarf-4 -Wall | 20250311 | 20250307 |
20432 | 6623 0 0 | 26638 792 856 | T:ref64 | clang -mcpu=native -O3 -fwrapv -Qunused-arguments -fPIC -fPIE -gdwarf-4 -Wall | 20250311 | 20250307 |
21420 | 5262 0 0 | 19687 784 920 | T:ref64 | clang -march=native -Os -fwrapv -Qunused-arguments -fPIC -fPIE -gdwarf-4 -Wall | 20250311 | 20250307 |
21536 | 6023 0 0 | 24310 792 920 | T:ref64 | clang -march=native -O3 -fwrapv -Qunused-arguments -fPIC -fPIE -gdwarf-4 -Wall | 20250311 | 20250307 |
21544 | 6023 0 0 | 24350 792 920 | T:ref64 | clang -march=native -O2 -fwrapv -Qunused-arguments -fPIC -fPIE -gdwarf-4 -Wall | 20250311 | 20250307 |
23816 | 7494 0 0 | 20926 792 856 | T:ref64 | clang -march=native -O -fwrapv -Qunused-arguments -fPIC -fPIE -gdwarf-4 -Wall | 20250311 | 20250307 |
Compiler output
morus1280128v1avx2.c: morus1280128v1avx2.c:306:23: warning: unused variable 'j' [-Wunused-variable]
morus1280128v1avx2.c: 306 | unsigned long long i,j;
morus1280128v1avx2.c: | ^
morus1280128v1avx2.c: morus1280128v1avx2.c:354:23: warning: unused variable 'j' [-Wunused-variable]
morus1280128v1avx2.c: 354 | unsigned long long i,j;
morus1280128v1avx2.c: | ^
morus1280128v1avx2.c: morus1280128v1avx2.c:356:16: warning: unused variable 'tag' [-Wunused-variable]
morus1280128v1avx2.c: 356 | unsigned char tag[16];
morus1280128v1avx2.c: | ^~~
morus1280128v1avx2.c: morus1280128v1avx2.c:357:16: warning: unused variable 'check' [-Wunused-variable]
morus1280128v1avx2.c: 357 | unsigned char check = 0;
morus1280128v1avx2.c: | ^~~~~
morus1280128v1avx2.c: 4 warnings generated.
Number of similar (implementation,compiler) pairs: 4, namely:
Implementation | Compiler |
T:avx2 | clang -march=native -O2 -fwrapv -Qunused-arguments -fPIC -fPIE -gdwarf-4 -Wall (Debian_Clang_19.1.7_(1+b1)) |
T:avx2 | clang -march=native -O3 -fwrapv -Qunused-arguments -fPIC -fPIE -gdwarf-4 -Wall (Debian_Clang_19.1.7_(1+b1)) |
T:avx2 | clang -march=native -O -fwrapv -Qunused-arguments -fPIC -fPIE -gdwarf-4 -Wall (Debian_Clang_19.1.7_(1+b1)) |
T:avx2 | clang -march=native -Os -fwrapv -Qunused-arguments -fPIC -fPIE -gdwarf-4 -Wall (Debian_Clang_19.1.7_(1+b1)) |
Compiler output
morus1280128v1avx2.c: morus1280128v1avx2.c:55:13: error: always_inline function '_mm256_xor_si256' requires target feature 'avx2', but would be inlined into function 'morus_stateupdate' that is compiled without support for 'avx2'
morus1280128v1avx2.c: 55 | state[0] = XOR256(state[0], state[3]);
morus1280128v1avx2.c: | ^
morus1280128v1avx2.c: morus1280128v1avx2.c:25:27: note: expanded from macro 'XOR256'
morus1280128v1avx2.c: 25 | #define XOR256(x,y) _mm256_xor_si256((x),(y)) /*XOR256(x,y) = x ^ y, where x and y are two 256-bit word*/
morus1280128v1avx2.c: | ^
morus1280128v1avx2.c: morus1280128v1avx2.c:55:13: error: AVX vector argument of type '__m256i' (vector of 4 'long long' values) without 'avx' enabled changes the ABI
morus1280128v1avx2.c: morus1280128v1avx2.c:25:27: note: expanded from macro 'XOR256'
morus1280128v1avx2.c: 25 | #define XOR256(x,y) _mm256_xor_si256((x),(y)) /*XOR256(x,y) = x ^ y, where x and y are two 256-bit word*/
morus1280128v1avx2.c: | ^
morus1280128v1avx2.c: morus1280128v1avx2.c:56:30: error: always_inline function '_mm256_and_si256' requires target feature 'avx2', but would be inlined into function 'morus_stateupdate' that is compiled without support for 'avx2'
morus1280128v1avx2.c: 56 | state[0] = XOR256(state[0], AND256(state[1], state[2]));
morus1280128v1avx2.c: | ^
morus1280128v1avx2.c: morus1280128v1avx2.c:26:27: note: expanded from macro 'AND256'
morus1280128v1avx2.c: 26 | #define AND256(x,y) _mm256_and_si256((x),(y)) /*AND(x,y) = x & y, where x and y are two 256-bit word*/
morus1280128v1avx2.c: | ^
morus1280128v1avx2.c: morus1280128v1avx2.c:56:30: error: AVX vector argument of type '__m256i' (vector of 4 'long long' values) without 'avx' enabled changes the ABI
morus1280128v1avx2.c: morus1280128v1avx2.c:26:27: note: expanded from macro 'AND256'
morus1280128v1avx2.c: 26 | #define AND256(x,y) _mm256_and_si256((x),(y)) /*AND(x,y) = x & y, where x and y are two 256-bit word*/
morus1280128v1avx2.c: | ^
morus1280128v1avx2.c: morus1280128v1avx2.c:56:13: error: always_inline function '_mm256_xor_si256' requires target feature 'avx2', but would be inlined into function 'morus_stateupdate' that is compiled without support for 'avx2'
morus1280128v1avx2.c: 56 | state[0] = XOR256(state[0], AND256(state[1], state[2]));
morus1280128v1avx2.c: | ^
morus1280128v1avx2.c: morus1280128v1avx2.c:25:27: note: expanded from macro 'XOR256'
morus1280128v1avx2.c: 25 | #define XOR256(x,y) _mm256_xor_si256((x),(y)) /*XOR256(x,y) = x ^ y, where x and y are two 256-bit word*/
morus1280128v1avx2.c: ...
Number of similar (implementation,compiler) pairs: 1, namely:
Implementation | Compiler |
T:avx2 | clang -mcpu=native -O3 -fwrapv -Qunused-arguments -fPIC -fPIE -gdwarf-4 -Wall (Debian_Clang_19.1.7_(1+b1)) |
Compiler output
morus1280128v1avx2.c: morus1280128v1avx2.c: In function 'crypto_aead_morus1280128v1_avx2_timingleaks_encrypt':
morus1280128v1avx2.c: morus1280128v1avx2.c:306:30: warning: unused variable 'j' [-Wunused-variable]
morus1280128v1avx2.c: 306 | unsigned long long i,j;
morus1280128v1avx2.c: | ^
morus1280128v1avx2.c: morus1280128v1avx2.c: In function 'crypto_aead_morus1280128v1_avx2_timingleaks_decrypt':
morus1280128v1avx2.c: morus1280128v1avx2.c:357:23: warning: unused variable 'check' [-Wunused-variable]
morus1280128v1avx2.c: 357 | unsigned char check = 0;
morus1280128v1avx2.c: | ^~~~~
morus1280128v1avx2.c: morus1280128v1avx2.c:356:23: warning: unused variable 'tag' [-Wunused-variable]
morus1280128v1avx2.c: 356 | unsigned char tag[16];
morus1280128v1avx2.c: | ^~~
morus1280128v1avx2.c: morus1280128v1avx2.c:354:30: warning: unused variable 'j' [-Wunused-variable]
morus1280128v1avx2.c: 354 | unsigned long long i,j;
morus1280128v1avx2.c: | ^
Number of similar (implementation,compiler) pairs: 3, namely:
Implementation | Compiler |
T:avx2 | gcc -march=native -mtune=native -O2 -fwrapv -fPIC -fPIE -gdwarf-4 -Wall (14.2.0) |
T:avx2 | gcc -march=native -mtune=native -O3 -fwrapv -fPIC -fPIE -gdwarf-4 -Wall (14.2.0) |
T:avx2 | gcc -march=native -mtune=native -O -fwrapv -fPIC -fPIE -gdwarf-4 -Wall (14.2.0) |
Compiler output
morus1280128v1avx2.c: morus1280128v1avx2.c: In function 'crypto_aead_morus1280128v1_avx2_timingleaks_encrypt':
morus1280128v1avx2.c: morus1280128v1avx2.c:306:30: warning: unused variable 'j' [-Wunused-variable]
morus1280128v1avx2.c: 306 | unsigned long long i,j;
morus1280128v1avx2.c: | ^
morus1280128v1avx2.c: morus1280128v1avx2.c: In function 'crypto_aead_morus1280128v1_avx2_timingleaks_decrypt':
morus1280128v1avx2.c: morus1280128v1avx2.c:357:23: warning: unused variable 'check' [-Wunused-variable]
morus1280128v1avx2.c: 357 | unsigned char check = 0;
morus1280128v1avx2.c: | ^~~~~
morus1280128v1avx2.c: morus1280128v1avx2.c:356:23: warning: unused variable 'tag' [-Wunused-variable]
morus1280128v1avx2.c: 356 | unsigned char tag[16];
morus1280128v1avx2.c: | ^~~
morus1280128v1avx2.c: morus1280128v1avx2.c:354:30: warning: unused variable 'j' [-Wunused-variable]
morus1280128v1avx2.c: 354 | unsigned long long i,j;
morus1280128v1avx2.c: | ^
try.c: /usr/bin/ld: libcrypto_aead_morus1280128v1.a(morus1280128v1avx2.o): in function `crypto_aead_morus1280128v1_avx2_timingleaks_encrypt':
try.c: .../supercop-data/speed2supercop/amd64/try/c/gcc_-march=native_-mtune=native_-Os_-fwrapv_-fPIC_-fPIE_-gdwarf-4_-Wall/timingleaks/crypto_aead/morus1280128v1/avx2/work/morus1280128v1avx2.c:317:(.text+0x...): undefined reference to `morus_enc_aut_step'
try.c: /usr/bin/ld: .../supercop-data/speed2supercop/amd64/try/c/gcc_-march=native_-mtune=native_-Os_-fwrapv_-fPIC_-fPIE_-gdwarf-4_-Wall/timingleaks/crypto_aead/morus1280128v1/avx2/work/morus1280128v1avx2.c:329:(.text+0x...): undefined reference to `morus_enc_aut_step'
try.c: /usr/bin/ld: libcrypto_aead_morus1280128v1.a(morus1280128v1avx2.o): in function `crypto_aead_morus1280128v1_avx2_timingleaks_decrypt':
try.c: .../supercop-data/speed2supercop/amd64/try/c/gcc_-march=native_-mtune=native_-Os_-fwrapv_-fPIC_-fPIE_-gdwarf-4_-Wall/timingleaks/crypto_aead/morus1280128v1/avx2/work/morus1280128v1avx2.c:364:(.text+0x...): undefined reference to `morus_enc_aut_step'
try.c: /usr/bin/ld: .../supercop-data/speed2supercop/amd64/try/c/gcc_-march=native_-mtune=native_-Os_-fwrapv_-fPIC_-fPIE_-gdwarf-4_-Wall/timingleaks/crypto_aead/morus1280128v1/avx2/work/morus1280128v1avx2.c:376:(.text+0x...): undefined reference to `morus_dec_aut_step'
try.c: collect2: error: ld returned 1 exit status
Number of similar (implementation,compiler) pairs: 1, namely:
Implementation | Compiler |
T:avx2 | gcc -march=native -mtune=native -Os -fwrapv -fPIC -fPIE -gdwarf-4 -Wall (14.2.0) |
Compiler output
encrypt.c: encrypt.c:224:17: warning: unused variable 'plaintextblock' [-Wunused-variable]
encrypt.c: 224 | uint8_t plaintextblock[32], ciphertextblock[32];
encrypt.c: | ^~~~~~~~~~~~~~
encrypt.c: encrypt.c:268:25: warning: unused variable 'j' [-Wunused-variable]
encrypt.c: 268 | unsigned long i,j;
encrypt.c: | ^
encrypt.c: encrypt.c:269:17: warning: unused variable 'plaintextblock' [-Wunused-variable]
encrypt.c: 269 | uint8_t plaintextblock[32], ciphertextblock[32];
encrypt.c: | ^~~~~~~~~~~~~~
encrypt.c: encrypt.c:270:17: warning: unused variable 'tag' [-Wunused-variable]
encrypt.c: 270 | uint8_t tag[16];
encrypt.c: | ^~~
encrypt.c: encrypt.c:271:17: warning: unused variable 'check' [-Wunused-variable]
encrypt.c: 271 | uint8_t check = 0;
encrypt.c: | ^~~~~
encrypt.c: 5 warnings generated.
Number of similar (implementation,compiler) pairs: 5, namely:
Implementation | Compiler |
T:ref | clang -march=native -O2 -fwrapv -Qunused-arguments -fPIC -fPIE -gdwarf-4 -Wall (Debian_Clang_19.1.7_(1+b1)) |
T:ref | clang -march=native -O3 -fwrapv -Qunused-arguments -fPIC -fPIE -gdwarf-4 -Wall (Debian_Clang_19.1.7_(1+b1)) |
T:ref | clang -march=native -O -fwrapv -Qunused-arguments -fPIC -fPIE -gdwarf-4 -Wall (Debian_Clang_19.1.7_(1+b1)) |
T:ref | clang -march=native -Os -fwrapv -Qunused-arguments -fPIC -fPIE -gdwarf-4 -Wall (Debian_Clang_19.1.7_(1+b1)) |
T:ref | clang -mcpu=native -O3 -fwrapv -Qunused-arguments -fPIC -fPIE -gdwarf-4 -Wall (Debian_Clang_19.1.7_(1+b1)) |
Compiler output
encrypt.c: encrypt.c: In function 'crypto_aead_morus1280128v1_ref_timingleaks_encrypt':
encrypt.c: encrypt.c:224:17: warning: unused variable 'plaintextblock' [-Wunused-variable]
encrypt.c: 224 | uint8_t plaintextblock[32], ciphertextblock[32];
encrypt.c: | ^~~~~~~~~~~~~~
encrypt.c: encrypt.c: In function 'crypto_aead_morus1280128v1_ref_timingleaks_decrypt':
encrypt.c: encrypt.c:271:17: warning: unused variable 'check' [-Wunused-variable]
encrypt.c: 271 | uint8_t check = 0;
encrypt.c: | ^~~~~
encrypt.c: encrypt.c:270:17: warning: unused variable 'tag' [-Wunused-variable]
encrypt.c: 270 | uint8_t tag[16];
encrypt.c: | ^~~
encrypt.c: encrypt.c:269:17: warning: unused variable 'plaintextblock' [-Wunused-variable]
encrypt.c: 269 | uint8_t plaintextblock[32], ciphertextblock[32];
encrypt.c: | ^~~~~~~~~~~~~~
encrypt.c: encrypt.c:268:25: warning: unused variable 'j' [-Wunused-variable]
encrypt.c: 268 | unsigned long i,j;
encrypt.c: | ^
Number of similar (implementation,compiler) pairs: 4, namely:
Implementation | Compiler |
T:ref | gcc -march=native -mtune=native -O2 -fwrapv -fPIC -fPIE -gdwarf-4 -Wall (14.2.0) |
T:ref | gcc -march=native -mtune=native -O3 -fwrapv -fPIC -fPIE -gdwarf-4 -Wall (14.2.0) |
T:ref | gcc -march=native -mtune=native -O -fwrapv -fPIC -fPIE -gdwarf-4 -Wall (14.2.0) |
T:ref | gcc -march=native -mtune=native -Os -fwrapv -fPIC -fPIE -gdwarf-4 -Wall (14.2.0) |
Compiler output
morus1280128v1opt64.c: morus1280128v1opt64.c:286:17: warning: unused variable 'plaintextblock' [-Wunused-variable]
morus1280128v1opt64.c: 286 | uint8_t plaintextblock[32], ciphertextblock[32];
morus1280128v1opt64.c: | ^~~~~~~~~~~~~~
morus1280128v1opt64.c: morus1280128v1opt64.c:331:25: warning: unused variable 'j' [-Wunused-variable]
morus1280128v1opt64.c: 331 | unsigned long i,j;
morus1280128v1opt64.c: | ^
morus1280128v1opt64.c: morus1280128v1opt64.c:332:17: warning: unused variable 'plaintextblock' [-Wunused-variable]
morus1280128v1opt64.c: 332 | uint8_t plaintextblock[32], ciphertextblock[32];
morus1280128v1opt64.c: | ^~~~~~~~~~~~~~
morus1280128v1opt64.c: morus1280128v1opt64.c:333:17: warning: unused variable 'tag' [-Wunused-variable]
morus1280128v1opt64.c: 333 | uint8_t tag[16];
morus1280128v1opt64.c: | ^~~
morus1280128v1opt64.c: morus1280128v1opt64.c:334:17: warning: unused variable 'check' [-Wunused-variable]
morus1280128v1opt64.c: 334 | uint8_t check = 0;
morus1280128v1opt64.c: | ^~~~~
morus1280128v1opt64.c: 5 warnings generated.
Number of similar (implementation,compiler) pairs: 5, namely:
Implementation | Compiler |
T:ref64 | clang -march=native -O2 -fwrapv -Qunused-arguments -fPIC -fPIE -gdwarf-4 -Wall (Debian_Clang_19.1.7_(1+b1)) |
T:ref64 | clang -march=native -O3 -fwrapv -Qunused-arguments -fPIC -fPIE -gdwarf-4 -Wall (Debian_Clang_19.1.7_(1+b1)) |
T:ref64 | clang -march=native -O -fwrapv -Qunused-arguments -fPIC -fPIE -gdwarf-4 -Wall (Debian_Clang_19.1.7_(1+b1)) |
T:ref64 | clang -march=native -Os -fwrapv -Qunused-arguments -fPIC -fPIE -gdwarf-4 -Wall (Debian_Clang_19.1.7_(1+b1)) |
T:ref64 | clang -mcpu=native -O3 -fwrapv -Qunused-arguments -fPIC -fPIE -gdwarf-4 -Wall (Debian_Clang_19.1.7_(1+b1)) |
Compiler output
morus1280128v1opt64.c: morus1280128v1opt64.c: In function 'crypto_aead_morus1280128v1_ref64_timingleaks_encrypt':
morus1280128v1opt64.c: morus1280128v1opt64.c:286:17: warning: unused variable 'plaintextblock' [-Wunused-variable]
morus1280128v1opt64.c: 286 | uint8_t plaintextblock[32], ciphertextblock[32];
morus1280128v1opt64.c: | ^~~~~~~~~~~~~~
morus1280128v1opt64.c: morus1280128v1opt64.c: In function 'crypto_aead_morus1280128v1_ref64_timingleaks_decrypt':
morus1280128v1opt64.c: morus1280128v1opt64.c:334:17: warning: unused variable 'check' [-Wunused-variable]
morus1280128v1opt64.c: 334 | uint8_t check = 0;
morus1280128v1opt64.c: | ^~~~~
morus1280128v1opt64.c: morus1280128v1opt64.c:333:17: warning: unused variable 'tag' [-Wunused-variable]
morus1280128v1opt64.c: 333 | uint8_t tag[16];
morus1280128v1opt64.c: | ^~~
morus1280128v1opt64.c: morus1280128v1opt64.c:332:17: warning: unused variable 'plaintextblock' [-Wunused-variable]
morus1280128v1opt64.c: 332 | uint8_t plaintextblock[32], ciphertextblock[32];
morus1280128v1opt64.c: | ^~~~~~~~~~~~~~
morus1280128v1opt64.c: morus1280128v1opt64.c:331:25: warning: unused variable 'j' [-Wunused-variable]
morus1280128v1opt64.c: 331 | unsigned long i,j;
morus1280128v1opt64.c: | ^
Number of similar (implementation,compiler) pairs: 4, namely:
Implementation | Compiler |
T:ref64 | gcc -march=native -mtune=native -O2 -fwrapv -fPIC -fPIE -gdwarf-4 -Wall (14.2.0) |
T:ref64 | gcc -march=native -mtune=native -O3 -fwrapv -fPIC -fPIE -gdwarf-4 -Wall (14.2.0) |
T:ref64 | gcc -march=native -mtune=native -O -fwrapv -fPIC -fPIE -gdwarf-4 -Wall (14.2.0) |
T:ref64 | gcc -march=native -mtune=native -Os -fwrapv -fPIC -fPIE -gdwarf-4 -Wall (14.2.0) |
Compiler output
morus1280128v1sse2.c: morus1280128v1sse2.c:196:13: warning: unused variable 't' [-Wunused-variable]
morus1280128v1sse2.c: 196 | __m128i t;
morus1280128v1sse2.c: | ^
morus1280128v1sse2.c: morus1280128v1sse2.c:197:13: warning: unused variable 'tt' [-Wunused-variable]
morus1280128v1sse2.c: 197 | __m128i tt, t1, t2;
morus1280128v1sse2.c: | ^~
morus1280128v1sse2.c: morus1280128v1sse2.c:197:17: warning: unused variable 't1' [-Wunused-variable]
morus1280128v1sse2.c: 197 | __m128i tt, t1, t2;
morus1280128v1sse2.c: | ^~
morus1280128v1sse2.c: morus1280128v1sse2.c:197:21: warning: unused variable 't2' [-Wunused-variable]
morus1280128v1sse2.c: 197 | __m128i tt, t1, t2;
morus1280128v1sse2.c: | ^~
morus1280128v1sse2.c: morus1280128v1sse2.c:222:13: warning: unused variable 't' [-Wunused-variable]
morus1280128v1sse2.c: 222 | __m128i t;
morus1280128v1sse2.c: | ^
morus1280128v1sse2.c: morus1280128v1sse2.c:314:13: warning: unused variable 'plaintextblock' [-Wunused-variable]
morus1280128v1sse2.c: 314 | uint8_t plaintextblock[32], ciphertextblock[32];
morus1280128v1sse2.c: | ^~~~~~~~~~~~~~
morus1280128v1sse2.c: morus1280128v1sse2.c:359:16: warning: unused variable 'j' [-Wunused-variable]
morus1280128v1sse2.c: 359 | uint64_t i,j;
morus1280128v1sse2.c: | ^
morus1280128v1sse2.c: morus1280128v1sse2.c:360:13: warning: unused variable 'plaintextblock' [-Wunused-variable]
morus1280128v1sse2.c: 360 | uint8_t plaintextblock[32], ciphertextblock[32];
morus1280128v1sse2.c: | ^~~~~~~~~~~~~~
morus1280128v1sse2.c: morus1280128v1sse2.c:361:13: warning: unused variable 'tag' [-Wunused-variable]
morus1280128v1sse2.c: ...
Number of similar (implementation,compiler) pairs: 5, namely:
Implementation | Compiler |
T:sse2 | clang -march=native -O2 -fwrapv -Qunused-arguments -fPIC -fPIE -gdwarf-4 -Wall (Debian_Clang_19.1.7_(1+b1)) |
T:sse2 | clang -march=native -O3 -fwrapv -Qunused-arguments -fPIC -fPIE -gdwarf-4 -Wall (Debian_Clang_19.1.7_(1+b1)) |
T:sse2 | clang -march=native -O -fwrapv -Qunused-arguments -fPIC -fPIE -gdwarf-4 -Wall (Debian_Clang_19.1.7_(1+b1)) |
T:sse2 | clang -march=native -Os -fwrapv -Qunused-arguments -fPIC -fPIE -gdwarf-4 -Wall (Debian_Clang_19.1.7_(1+b1)) |
T:sse2 | clang -mcpu=native -O3 -fwrapv -Qunused-arguments -fPIC -fPIE -gdwarf-4 -Wall (Debian_Clang_19.1.7_(1+b1)) |
Compiler output
morus1280128v1sse2.c: morus1280128v1sse2.c: In function 'morus_enc_aut_step':
morus1280128v1sse2.c: morus1280128v1sse2.c:197:21: warning: unused variable 't2' [-Wunused-variable]
morus1280128v1sse2.c: 197 | __m128i tt, t1, t2;
morus1280128v1sse2.c: | ^~
morus1280128v1sse2.c: morus1280128v1sse2.c:197:17: warning: unused variable 't1' [-Wunused-variable]
morus1280128v1sse2.c: 197 | __m128i tt, t1, t2;
morus1280128v1sse2.c: | ^~
morus1280128v1sse2.c: morus1280128v1sse2.c:197:13: warning: unused variable 'tt' [-Wunused-variable]
morus1280128v1sse2.c: 197 | __m128i tt, t1, t2;
morus1280128v1sse2.c: | ^~
morus1280128v1sse2.c: morus1280128v1sse2.c:196:13: warning: unused variable 't' [-Wunused-variable]
morus1280128v1sse2.c: 196 | __m128i t;
morus1280128v1sse2.c: | ^
morus1280128v1sse2.c: morus1280128v1sse2.c: In function 'morus_dec_aut_step':
morus1280128v1sse2.c: morus1280128v1sse2.c:222:13: warning: unused variable 't' [-Wunused-variable]
morus1280128v1sse2.c: 222 | __m128i t;
morus1280128v1sse2.c: | ^
morus1280128v1sse2.c: morus1280128v1sse2.c: In function 'crypto_aead_morus1280128v1_sse2_timingleaks_encrypt':
morus1280128v1sse2.c: morus1280128v1sse2.c:314:13: warning: unused variable 'plaintextblock' [-Wunused-variable]
morus1280128v1sse2.c: 314 | uint8_t plaintextblock[32], ciphertextblock[32];
morus1280128v1sse2.c: | ^~~~~~~~~~~~~~
morus1280128v1sse2.c: morus1280128v1sse2.c: In function 'crypto_aead_morus1280128v1_sse2_timingleaks_decrypt':
morus1280128v1sse2.c: morus1280128v1sse2.c:362:13: warning: unused variable 'check' [-Wunused-variable]
morus1280128v1sse2.c: 362 | uint8_t check = 0;
morus1280128v1sse2.c: | ^~~~~
morus1280128v1sse2.c: ...
try.c: /usr/bin/ld: libcrypto_aead_morus1280128v1.a(morus1280128v1sse2.o): in function `morus_initialization':
try.c: .../supercop-data/speed2supercop/amd64/try/c/gcc_-march=native_-mtune=native_-O2_-fwrapv_-fPIC_-fPIE_-gdwarf-4_-Wall/timingleaks/crypto_aead/morus1280128v1/sse2/work/morus1280128v1sse2.c:98:(.text+0x...): undefined reference to `morus_stateupdate'
try.c: /usr/bin/ld: libcrypto_aead_morus1280128v1.a(morus1280128v1sse2.o): in function `morus_initialization_key_256':
try.c: .../supercop-data/speed2supercop/amd64/try/c/gcc_-march=native_-mtune=native_-O2_-fwrapv_-fPIC_-fPIE_-gdwarf-4_-Wall/timingleaks/crypto_aead/morus1280128v1/sse2/work/morus1280128v1sse2.c:118:(.text+0x...): undefined reference to `morus_stateupdate'
try.c: /usr/bin/ld: libcrypto_aead_morus1280128v1.a(morus1280128v1sse2.o): in function `morus_tag_generation':
try.c: .../supercop-data/speed2supercop/amd64/try/c/gcc_-march=native_-mtune=native_-O2_-fwrapv_-fPIC_-fPIE_-gdwarf-4_-Wall/timingleaks/crypto_aead/morus1280128v1/sse2/work/morus1280128v1sse2.c:143:(.text+0x...): undefined reference to `morus_stateupdate'
try.c: /usr/bin/ld: libcrypto_aead_morus1280128v1.a(morus1280128v1sse2.o): in function `morus_tag_verification':
try.c: .../supercop-data/speed2supercop/amd64/try/c/gcc_-march=native_-mtune=native_-O2_-fwrapv_-fPIC_-fPIE_-gdwarf-4_-Wall/timingleaks/crypto_aead/morus1280128v1/sse2/work/morus1280128v1sse2.c:174:(.text+0x...): undefined reference to `morus_stateupdate'
try.c: /usr/bin/ld: libcrypto_aead_morus1280128v1.a(morus1280128v1sse2.o): in function `morus_enc_aut_partialblock':
try.c: .../supercop-data/speed2supercop/amd64/try/c/gcc_-march=native_-mtune=native_-O2_-fwrapv_-fPIC_-fPIE_-gdwarf-4_-Wall/timingleaks/crypto_aead/morus1280128v1/sse2/work/morus1280128v1sse2.c:266:(.text+0x...): undefined reference to `morus_stateupdate'
try.c: /usr/bin/ld: libcrypto_aead_morus1280128v1.a(morus1280128v1sse2.o):.../supercop-data/speed2supercop/amd64/try/c/gcc_-march=native_-mtune=native_-O2_-fwrapv_-fPIC_-fPIE_-gdwarf-4_-Wall/timingleaks/crypto_aead/morus1280128v1/sse2/work/morus1280128v1sse2.c:298: more undefined references to `morus_stateupdate' follow
try.c: collect2: error: ld returned 1 exit status
Number of similar (implementation,compiler) pairs: 1, namely:
Implementation | Compiler |
T:sse2 | gcc -march=native -mtune=native -O2 -fwrapv -fPIC -fPIE -gdwarf-4 -Wall (14.2.0) |
Compiler output
morus1280128v1sse2.c: morus1280128v1sse2.c: In function 'morus_enc_aut_step':
morus1280128v1sse2.c: morus1280128v1sse2.c:197:21: warning: unused variable 't2' [-Wunused-variable]
morus1280128v1sse2.c: 197 | __m128i tt, t1, t2;
morus1280128v1sse2.c: | ^~
morus1280128v1sse2.c: morus1280128v1sse2.c:197:17: warning: unused variable 't1' [-Wunused-variable]
morus1280128v1sse2.c: 197 | __m128i tt, t1, t2;
morus1280128v1sse2.c: | ^~
morus1280128v1sse2.c: morus1280128v1sse2.c:197:13: warning: unused variable 'tt' [-Wunused-variable]
morus1280128v1sse2.c: 197 | __m128i tt, t1, t2;
morus1280128v1sse2.c: | ^~
morus1280128v1sse2.c: morus1280128v1sse2.c:196:13: warning: unused variable 't' [-Wunused-variable]
morus1280128v1sse2.c: 196 | __m128i t;
morus1280128v1sse2.c: | ^
morus1280128v1sse2.c: morus1280128v1sse2.c: In function 'morus_dec_aut_step':
morus1280128v1sse2.c: morus1280128v1sse2.c:222:13: warning: unused variable 't' [-Wunused-variable]
morus1280128v1sse2.c: 222 | __m128i t;
morus1280128v1sse2.c: | ^
morus1280128v1sse2.c: morus1280128v1sse2.c: In function 'crypto_aead_morus1280128v1_sse2_timingleaks_encrypt':
morus1280128v1sse2.c: morus1280128v1sse2.c:314:13: warning: unused variable 'plaintextblock' [-Wunused-variable]
morus1280128v1sse2.c: 314 | uint8_t plaintextblock[32], ciphertextblock[32];
morus1280128v1sse2.c: | ^~~~~~~~~~~~~~
morus1280128v1sse2.c: morus1280128v1sse2.c: In function 'crypto_aead_morus1280128v1_sse2_timingleaks_decrypt':
morus1280128v1sse2.c: morus1280128v1sse2.c:362:13: warning: unused variable 'check' [-Wunused-variable]
morus1280128v1sse2.c: 362 | uint8_t check = 0;
morus1280128v1sse2.c: | ^~~~~
morus1280128v1sse2.c: ...
Number of similar (implementation,compiler) pairs: 1, namely:
Implementation | Compiler |
T:sse2 | gcc -march=native -mtune=native -O3 -fwrapv -fPIC -fPIE -gdwarf-4 -Wall (14.2.0) |
Compiler output
morus1280128v1sse2.c: morus1280128v1sse2.c: In function 'morus_enc_aut_step':
morus1280128v1sse2.c: morus1280128v1sse2.c:197:21: warning: unused variable 't2' [-Wunused-variable]
morus1280128v1sse2.c: 197 | __m128i tt, t1, t2;
morus1280128v1sse2.c: | ^~
morus1280128v1sse2.c: morus1280128v1sse2.c:197:17: warning: unused variable 't1' [-Wunused-variable]
morus1280128v1sse2.c: 197 | __m128i tt, t1, t2;
morus1280128v1sse2.c: | ^~
morus1280128v1sse2.c: morus1280128v1sse2.c:197:13: warning: unused variable 'tt' [-Wunused-variable]
morus1280128v1sse2.c: 197 | __m128i tt, t1, t2;
morus1280128v1sse2.c: | ^~
morus1280128v1sse2.c: morus1280128v1sse2.c:196:13: warning: unused variable 't' [-Wunused-variable]
morus1280128v1sse2.c: 196 | __m128i t;
morus1280128v1sse2.c: | ^
morus1280128v1sse2.c: morus1280128v1sse2.c: In function 'morus_dec_aut_step':
morus1280128v1sse2.c: morus1280128v1sse2.c:222:13: warning: unused variable 't' [-Wunused-variable]
morus1280128v1sse2.c: 222 | __m128i t;
morus1280128v1sse2.c: | ^
morus1280128v1sse2.c: morus1280128v1sse2.c: In function 'crypto_aead_morus1280128v1_sse2_timingleaks_encrypt':
morus1280128v1sse2.c: morus1280128v1sse2.c:314:13: warning: unused variable 'plaintextblock' [-Wunused-variable]
morus1280128v1sse2.c: 314 | uint8_t plaintextblock[32], ciphertextblock[32];
morus1280128v1sse2.c: | ^~~~~~~~~~~~~~
morus1280128v1sse2.c: morus1280128v1sse2.c: In function 'crypto_aead_morus1280128v1_sse2_timingleaks_decrypt':
morus1280128v1sse2.c: morus1280128v1sse2.c:362:13: warning: unused variable 'check' [-Wunused-variable]
morus1280128v1sse2.c: 362 | uint8_t check = 0;
morus1280128v1sse2.c: | ^~~~~
morus1280128v1sse2.c: ...
try.c: /usr/bin/ld: libcrypto_aead_morus1280128v1.a(morus1280128v1sse2.o): in function `morus_initialization':
try.c: .../supercop-data/speed2supercop/amd64/try/c/gcc_-march=native_-mtune=native_-O_-fwrapv_-fPIC_-fPIE_-gdwarf-4_-Wall/timingleaks/crypto_aead/morus1280128v1/sse2/work/morus1280128v1sse2.c:98:(.text+0x...): undefined reference to `morus_stateupdate'
try.c: /usr/bin/ld: libcrypto_aead_morus1280128v1.a(morus1280128v1sse2.o): in function `morus_initialization_key_256':
try.c: .../supercop-data/speed2supercop/amd64/try/c/gcc_-march=native_-mtune=native_-O_-fwrapv_-fPIC_-fPIE_-gdwarf-4_-Wall/timingleaks/crypto_aead/morus1280128v1/sse2/work/morus1280128v1sse2.c:118:(.text+0x...): undefined reference to `morus_stateupdate'
try.c: /usr/bin/ld: libcrypto_aead_morus1280128v1.a(morus1280128v1sse2.o): in function `morus_tag_generation':
try.c: .../supercop-data/speed2supercop/amd64/try/c/gcc_-march=native_-mtune=native_-O_-fwrapv_-fPIC_-fPIE_-gdwarf-4_-Wall/timingleaks/crypto_aead/morus1280128v1/sse2/work/morus1280128v1sse2.c:143:(.text+0x...): undefined reference to `morus_stateupdate'
try.c: /usr/bin/ld: libcrypto_aead_morus1280128v1.a(morus1280128v1sse2.o): in function `morus_tag_verification':
try.c: .../supercop-data/speed2supercop/amd64/try/c/gcc_-march=native_-mtune=native_-O_-fwrapv_-fPIC_-fPIE_-gdwarf-4_-Wall/timingleaks/crypto_aead/morus1280128v1/sse2/work/morus1280128v1sse2.c:174:(.text+0x...): undefined reference to `morus_stateupdate'
try.c: /usr/bin/ld: libcrypto_aead_morus1280128v1.a(morus1280128v1sse2.o): in function `morus_enc_aut_partialblock':
try.c: .../supercop-data/speed2supercop/amd64/try/c/gcc_-march=native_-mtune=native_-O_-fwrapv_-fPIC_-fPIE_-gdwarf-4_-Wall/timingleaks/crypto_aead/morus1280128v1/sse2/work/morus1280128v1sse2.c:266:(.text+0x...): undefined reference to `morus_stateupdate'
try.c: /usr/bin/ld: libcrypto_aead_morus1280128v1.a(morus1280128v1sse2.o):.../supercop-data/speed2supercop/amd64/try/c/gcc_-march=native_-mtune=native_-O_-fwrapv_-fPIC_-fPIE_-gdwarf-4_-Wall/timingleaks/crypto_aead/morus1280128v1/sse2/work/morus1280128v1sse2.c:298: more undefined references to `morus_stateupdate' follow
try.c: collect2: error: ld returned 1 exit status
Number of similar (implementation,compiler) pairs: 1, namely:
Implementation | Compiler |
T:sse2 | gcc -march=native -mtune=native -O -fwrapv -fPIC -fPIE -gdwarf-4 -Wall (14.2.0) |
Compiler output
morus1280128v1sse2.c: morus1280128v1sse2.c: In function 'morus_enc_aut_step':
morus1280128v1sse2.c: morus1280128v1sse2.c:197:21: warning: unused variable 't2' [-Wunused-variable]
morus1280128v1sse2.c: 197 | __m128i tt, t1, t2;
morus1280128v1sse2.c: | ^~
morus1280128v1sse2.c: morus1280128v1sse2.c:197:17: warning: unused variable 't1' [-Wunused-variable]
morus1280128v1sse2.c: 197 | __m128i tt, t1, t2;
morus1280128v1sse2.c: | ^~
morus1280128v1sse2.c: morus1280128v1sse2.c:197:13: warning: unused variable 'tt' [-Wunused-variable]
morus1280128v1sse2.c: 197 | __m128i tt, t1, t2;
morus1280128v1sse2.c: | ^~
morus1280128v1sse2.c: morus1280128v1sse2.c:196:13: warning: unused variable 't' [-Wunused-variable]
morus1280128v1sse2.c: 196 | __m128i t;
morus1280128v1sse2.c: | ^
morus1280128v1sse2.c: morus1280128v1sse2.c: In function 'morus_dec_aut_step':
morus1280128v1sse2.c: morus1280128v1sse2.c:222:13: warning: unused variable 't' [-Wunused-variable]
morus1280128v1sse2.c: 222 | __m128i t;
morus1280128v1sse2.c: | ^
morus1280128v1sse2.c: morus1280128v1sse2.c: In function 'crypto_aead_morus1280128v1_sse2_timingleaks_encrypt':
morus1280128v1sse2.c: morus1280128v1sse2.c:314:13: warning: unused variable 'plaintextblock' [-Wunused-variable]
morus1280128v1sse2.c: 314 | uint8_t plaintextblock[32], ciphertextblock[32];
morus1280128v1sse2.c: | ^~~~~~~~~~~~~~
morus1280128v1sse2.c: morus1280128v1sse2.c: In function 'crypto_aead_morus1280128v1_sse2_timingleaks_decrypt':
morus1280128v1sse2.c: morus1280128v1sse2.c:362:13: warning: unused variable 'check' [-Wunused-variable]
morus1280128v1sse2.c: 362 | uint8_t check = 0;
morus1280128v1sse2.c: | ^~~~~
morus1280128v1sse2.c: ...
try.c: /usr/bin/ld: libcrypto_aead_morus1280128v1.a(morus1280128v1sse2.o): in function `morus_initialization':
try.c: .../supercop-data/speed2supercop/amd64/try/c/gcc_-march=native_-mtune=native_-Os_-fwrapv_-fPIC_-fPIE_-gdwarf-4_-Wall/timingleaks/crypto_aead/morus1280128v1/sse2/work/morus1280128v1sse2.c:98:(.text+0x...): undefined reference to `morus_stateupdate'
try.c: /usr/bin/ld: libcrypto_aead_morus1280128v1.a(morus1280128v1sse2.o): in function `morus_initialization_key_256':
try.c: .../supercop-data/speed2supercop/amd64/try/c/gcc_-march=native_-mtune=native_-Os_-fwrapv_-fPIC_-fPIE_-gdwarf-4_-Wall/timingleaks/crypto_aead/morus1280128v1/sse2/work/morus1280128v1sse2.c:118:(.text+0x...): undefined reference to `morus_stateupdate'
try.c: /usr/bin/ld: libcrypto_aead_morus1280128v1.a(morus1280128v1sse2.o): in function `morus_tag_generation':
try.c: .../supercop-data/speed2supercop/amd64/try/c/gcc_-march=native_-mtune=native_-Os_-fwrapv_-fPIC_-fPIE_-gdwarf-4_-Wall/timingleaks/crypto_aead/morus1280128v1/sse2/work/morus1280128v1sse2.c:143:(.text+0x...): undefined reference to `morus_stateupdate'
try.c: /usr/bin/ld: libcrypto_aead_morus1280128v1.a(morus1280128v1sse2.o): in function `morus_tag_verification':
try.c: .../supercop-data/speed2supercop/amd64/try/c/gcc_-march=native_-mtune=native_-Os_-fwrapv_-fPIC_-fPIE_-gdwarf-4_-Wall/timingleaks/crypto_aead/morus1280128v1/sse2/work/morus1280128v1sse2.c:174:(.text+0x...): undefined reference to `morus_stateupdate'
try.c: /usr/bin/ld: libcrypto_aead_morus1280128v1.a(morus1280128v1sse2.o): in function `morus_enc_aut_partialblock':
try.c: .../supercop-data/speed2supercop/amd64/try/c/gcc_-march=native_-mtune=native_-Os_-fwrapv_-fPIC_-fPIE_-gdwarf-4_-Wall/timingleaks/crypto_aead/morus1280128v1/sse2/work/morus1280128v1sse2.c:266:(.text+0x...): undefined reference to `morus_stateupdate'
try.c: /usr/bin/ld: libcrypto_aead_morus1280128v1.a(morus1280128v1sse2.o):.../supercop-data/speed2supercop/amd64/try/c/gcc_-march=native_-mtune=native_-Os_-fwrapv_-fPIC_-fPIE_-gdwarf-4_-Wall/timingleaks/crypto_aead/morus1280128v1/sse2/work/morus1280128v1sse2.c:298: more undefined references to `morus_stateupdate' follow
try.c: /usr/bin/ld: libcrypto_aead_morus1280128v1.a(morus1280128v1sse2.o): in function `crypto_aead_morus1280128v1_sse2_timingleaks_encrypt':
try.c: .../supercop-data/speed2supercop/amd64/try/c/gcc_-march=native_-mtune=native_-Os_-fwrapv_-fPIC_-fPIE_-gdwarf-4_-Wall/timingleaks/crypto_aead/morus1280128v1/sse2/work/morus1280128v1sse2.c:323:(.text+0x...): undefined reference to `morus_enc_aut_step'
try.c: /usr/bin/ld: .../supercop-data/speed2supercop/amd64/try/c/gcc_-march=native_-mtune=native_-Os_-fwrapv_-fPIC_-fPIE_-gdwarf-4_-Wall/timingleaks/crypto_aead/morus1280128v1/sse2/work/morus1280128v1sse2.c:334:(.text+0x...): undefined reference to `morus_enc_aut_step'
try.c: /usr/bin/ld: libcrypto_aead_morus1280128v1.a(morus1280128v1sse2.o): in function `crypto_aead_morus1280128v1_sse2_timingleaks_decrypt':
try.c: .../supercop-data/speed2supercop/amd64/try/c/gcc_-march=native_-mtune=native_-Os_-fwrapv_-fPIC_-fPIE_-gdwarf-4_-Wall/timingleaks/crypto_aead/morus1280128v1/sse2/work/morus1280128v1sse2.c:369:(.text+0x...): undefined reference to `morus_enc_aut_step'
try.c: /usr/bin/ld: .../supercop-data/speed2supercop/amd64/try/c/gcc_-march=native_-mtune=native_-Os_-fwrapv_-fPIC_-fPIE_-gdwarf-4_-Wall/timingleaks/crypto_aead/morus1280128v1/sse2/work/morus1280128v1sse2.c:381:(.text+0x...): undefined reference to `morus_dec_aut_step'
try.c: collect2: error: ld returned 1 exit status
Number of similar (implementation,compiler) pairs: 1, namely:
Implementation | Compiler |
T:sse2 | gcc -march=native -mtune=native -Os -fwrapv -fPIC -fPIE -gdwarf-4 -Wall (14.2.0) |
Namespace violations
morus1280128v1avx2.o morus_dec_aut_partialblock T
morus1280128v1avx2.o morus_enc_aut_partialblock T
morus1280128v1avx2.o morus_initialization T
morus1280128v1avx2.o morus_stateupdate T
morus1280128v1avx2.o morus_tag_generation T
morus1280128v1avx2.o morus_tag_verification T
Number of similar (implementation,compiler) pairs: 7, namely:
Implementation | Compiler |
T:avx2 | clang -march=native -O2 -fwrapv -Qunused-arguments -fPIC -fPIE -gdwarf-4 -Wall (Debian_Clang_19.1.7_(1+b1)) |
T:avx2 | clang -march=native -O3 -fwrapv -Qunused-arguments -fPIC -fPIE -gdwarf-4 -Wall (Debian_Clang_19.1.7_(1+b1)) |
T:avx2 | clang -march=native -O -fwrapv -Qunused-arguments -fPIC -fPIE -gdwarf-4 -Wall (Debian_Clang_19.1.7_(1+b1)) |
T:avx2 | clang -march=native -Os -fwrapv -Qunused-arguments -fPIC -fPIE -gdwarf-4 -Wall (Debian_Clang_19.1.7_(1+b1)) |
T:avx2 | gcc -march=native -mtune=native -O2 -fwrapv -fPIC -fPIE -gdwarf-4 -Wall (14.2.0) |
T:avx2 | gcc -march=native -mtune=native -O3 -fwrapv -fPIC -fPIE -gdwarf-4 -Wall (14.2.0) |
T:avx2 | gcc -march=native -mtune=native -O -fwrapv -fPIC -fPIE -gdwarf-4 -Wall (14.2.0) |
Namespace violations
encrypt.o morus_dec_aut_partialblock T
encrypt.o morus_enc_aut_partialblock T
encrypt.o morus_initialization T
encrypt.o morus_tag_generation T
encrypt.o morus_tag_verification T
Number of similar (implementation,compiler) pairs: 9, namely:
Implementation | Compiler |
T:ref | clang -march=native -O2 -fwrapv -Qunused-arguments -fPIC -fPIE -gdwarf-4 -Wall (Debian_Clang_19.1.7_(1+b1)) |
T:ref | clang -march=native -O3 -fwrapv -Qunused-arguments -fPIC -fPIE -gdwarf-4 -Wall (Debian_Clang_19.1.7_(1+b1)) |
T:ref | clang -march=native -O -fwrapv -Qunused-arguments -fPIC -fPIE -gdwarf-4 -Wall (Debian_Clang_19.1.7_(1+b1)) |
T:ref | clang -march=native -Os -fwrapv -Qunused-arguments -fPIC -fPIE -gdwarf-4 -Wall (Debian_Clang_19.1.7_(1+b1)) |
T:ref | clang -mcpu=native -O3 -fwrapv -Qunused-arguments -fPIC -fPIE -gdwarf-4 -Wall (Debian_Clang_19.1.7_(1+b1)) |
T:ref | gcc -march=native -mtune=native -O2 -fwrapv -fPIC -fPIE -gdwarf-4 -Wall (14.2.0) |
T:ref | gcc -march=native -mtune=native -O3 -fwrapv -fPIC -fPIE -gdwarf-4 -Wall (14.2.0) |
T:ref | gcc -march=native -mtune=native -O -fwrapv -fPIC -fPIE -gdwarf-4 -Wall (14.2.0) |
T:ref | gcc -march=native -mtune=native -Os -fwrapv -fPIC -fPIE -gdwarf-4 -Wall (14.2.0) |
Namespace violations
morus1280128v1opt64.o morus_dec_aut_partialblock T
morus1280128v1opt64.o morus_dec_aut_step T
morus1280128v1opt64.o morus_enc_aut_partialblock T
morus1280128v1opt64.o morus_enc_aut_step T
morus1280128v1opt64.o morus_initialization T
morus1280128v1opt64.o morus_stateupdate T
morus1280128v1opt64.o morus_tag_generation T
morus1280128v1opt64.o morus_tag_verification T
Number of similar (implementation,compiler) pairs: 9, namely:
Implementation | Compiler |
T:ref64 | clang -march=native -O2 -fwrapv -Qunused-arguments -fPIC -fPIE -gdwarf-4 -Wall (Debian_Clang_19.1.7_(1+b1)) |
T:ref64 | clang -march=native -O3 -fwrapv -Qunused-arguments -fPIC -fPIE -gdwarf-4 -Wall (Debian_Clang_19.1.7_(1+b1)) |
T:ref64 | clang -march=native -O -fwrapv -Qunused-arguments -fPIC -fPIE -gdwarf-4 -Wall (Debian_Clang_19.1.7_(1+b1)) |
T:ref64 | clang -march=native -Os -fwrapv -Qunused-arguments -fPIC -fPIE -gdwarf-4 -Wall (Debian_Clang_19.1.7_(1+b1)) |
T:ref64 | clang -mcpu=native -O3 -fwrapv -Qunused-arguments -fPIC -fPIE -gdwarf-4 -Wall (Debian_Clang_19.1.7_(1+b1)) |
T:ref64 | gcc -march=native -mtune=native -O2 -fwrapv -fPIC -fPIE -gdwarf-4 -Wall (14.2.0) |
T:ref64 | gcc -march=native -mtune=native -O3 -fwrapv -fPIC -fPIE -gdwarf-4 -Wall (14.2.0) |
T:ref64 | gcc -march=native -mtune=native -O -fwrapv -fPIC -fPIE -gdwarf-4 -Wall (14.2.0) |
T:ref64 | gcc -march=native -mtune=native -Os -fwrapv -fPIC -fPIE -gdwarf-4 -Wall (14.2.0) |
Namespace violations
morus1280128v1sse2.o morus_dec_aut_partialblock T
morus1280128v1sse2.o morus_enc_aut_partialblock T
morus1280128v1sse2.o morus_initialization T
morus1280128v1sse2.o morus_initialization_key_256 T
morus1280128v1sse2.o morus_tag_generation T
morus1280128v1sse2.o morus_tag_verification T
Number of similar (implementation,compiler) pairs: 6, namely:
Implementation | Compiler |
T:sse2 | clang -march=native -O2 -fwrapv -Qunused-arguments -fPIC -fPIE -gdwarf-4 -Wall (Debian_Clang_19.1.7_(1+b1)) |
T:sse2 | clang -march=native -O3 -fwrapv -Qunused-arguments -fPIC -fPIE -gdwarf-4 -Wall (Debian_Clang_19.1.7_(1+b1)) |
T:sse2 | clang -march=native -O -fwrapv -Qunused-arguments -fPIC -fPIE -gdwarf-4 -Wall (Debian_Clang_19.1.7_(1+b1)) |
T:sse2 | clang -march=native -Os -fwrapv -Qunused-arguments -fPIC -fPIE -gdwarf-4 -Wall (Debian_Clang_19.1.7_(1+b1)) |
T:sse2 | clang -mcpu=native -O3 -fwrapv -Qunused-arguments -fPIC -fPIE -gdwarf-4 -Wall (Debian_Clang_19.1.7_(1+b1)) |
T:sse2 | gcc -march=native -mtune=native -O3 -fwrapv -fPIC -fPIE -gdwarf-4 -Wall (14.2.0) |