Test results for amd64, panther, crypto_aead/omdsha512k128n128tau128v2
[Page version: 20250315 02:02:15]
Measurements for amd64, panther, crypto_aead
Test results for amd64, panther, crypto_aead
Test results for crypto_aead/omdsha512k128n128tau128v2
Computer: panther
Microarchitecture: amd64; Tiger Lake (806c1)
Architecture: amd64
CPU ID: GenuineIntel-000806c1-00-bfebfbff
SUPERCOP version: 20250307
Operation: crypto_aead
Primitive: omdsha512k128n128tau128v2
Time | Object size | Test size | Implementation | Compiler | Benchmark date | SUPERCOP version |
110981 | 18060 0 0 | 40864 780 1080 | T:ref | gcc -march=native -mtune=native -O3 -fwrapv -fPIC -fPIE -gdwarf-4 -Wall | 20250309 | 20250307 |
118327 | 17297 0 0 | 39661 828 1048 | T:ref | clang -march=native -O3 -fwrapv -Qunused-arguments -fPIC -fPIE -gdwarf-4 -Wall | 20250309 | 20250307 |
119100 | 11495 0 0 | 33853 828 1048 | T:ref | clang -march=native -O2 -fwrapv -Qunused-arguments -fPIC -fPIE -gdwarf-4 -Wall | 20250309 | 20250307 |
133782 | 15514 0 0 | 37541 828 1016 | T:ref | clang -mcpu=native -O3 -fwrapv -Qunused-arguments -fPIC -fPIE -gdwarf-4 -Wall | 20250309 | 20250307 |
134985 | 6020 0 0 | 25515 820 1016 | T:ref | clang -march=native -Os -fwrapv -Qunused-arguments -fPIC -fPIE -gdwarf-4 -Wall | 20250309 | 20250307 |
143350 | 8989 0 0 | 29744 780 1080 | T:ref | gcc -march=native -mtune=native -O2 -fwrapv -fPIC -fPIE -gdwarf-4 -Wall | 20250309 | 20250307 |
145147 | 5001 0 0 | 24587 820 1016 | T:ref | clang -march=native -O -fwrapv -Qunused-arguments -fPIC -fPIE -gdwarf-4 -Wall | 20250309 | 20250307 |
154790 | 7492 0 0 | 27663 772 1080 | T:ref | gcc -march=native -mtune=native -O -fwrapv -fPIC -fPIE -gdwarf-4 -Wall | 20250309 | 20250307 |
173497 | 4571 0 0 | 23179 756 1048 | T:ref | gcc -march=native -mtune=native -Os -fwrapv -fPIC -fPIE -gdwarf-4 -Wall | 20250309 | 20250307 |
Compiler output
try.c: /usr/bin/ld: libcrypto_aead_omdsha512k128n128tau128v2.a(omdsha512.o):.../supercop-data/panther/amd64/try/c/clang_-march=native_-O2_-fwrapv_-Qunused-arguments_-fPIC_-fPIE_-gdwarf-4_-Wall/timingleaks/crypto_aead/omdsha512k128n128tau128v2/avx1/work/./omdsha512.h:146: multiple definition of `Hash'; libcrypto_aead_omdsha512k128n128tau128v2.a(encrypt.o):.../supercop-data/panther/amd64/try/c/clang_-march=native_-O2_-fwrapv_-Qunused-arguments_-fPIC_-fPIE_-gdwarf-4_-Wall/timingleaks/crypto_aead/omdsha512k128n128tau128v2/avx1/work/./omdsha512.h:146: first defined here
try.c: clang: error: linker command failed with exit code 1 (use -v to see invocation)
Number of similar (implementation,compiler) pairs: 1, namely:
Implementation | Compiler |
T:avx1 | clang -march=native -O2 -fwrapv -Qunused-arguments -fPIC -fPIE -gdwarf-4 -Wall (Debian_Clang_11.0.1) |
Compiler output
try.c: /usr/bin/ld: libcrypto_aead_omdsha512k128n128tau128v2.a(omdsha512.o):.../supercop-data/panther/amd64/try/c/clang_-march=native_-O3_-fwrapv_-Qunused-arguments_-fPIC_-fPIE_-gdwarf-4_-Wall/timingleaks/crypto_aead/omdsha512k128n128tau128v2/avx1/work/./omdsha512.h:146: multiple definition of `Hash'; libcrypto_aead_omdsha512k128n128tau128v2.a(encrypt.o):.../supercop-data/panther/amd64/try/c/clang_-march=native_-O3_-fwrapv_-Qunused-arguments_-fPIC_-fPIE_-gdwarf-4_-Wall/timingleaks/crypto_aead/omdsha512k128n128tau128v2/avx1/work/./omdsha512.h:146: first defined here
try.c: clang: error: linker command failed with exit code 1 (use -v to see invocation)
Number of similar (implementation,compiler) pairs: 1, namely:
Implementation | Compiler |
T:avx1 | clang -march=native -O3 -fwrapv -Qunused-arguments -fPIC -fPIE -gdwarf-4 -Wall (Debian_Clang_11.0.1) |
Compiler output
try.c: /usr/bin/ld: libcrypto_aead_omdsha512k128n128tau128v2.a(omdsha512.o):.../supercop-data/panther/amd64/try/c/clang_-march=native_-O_-fwrapv_-Qunused-arguments_-fPIC_-fPIE_-gdwarf-4_-Wall/timingleaks/crypto_aead/omdsha512k128n128tau128v2/avx1/work/./omdsha512.h:146: multiple definition of `Hash'; libcrypto_aead_omdsha512k128n128tau128v2.a(encrypt.o):.../supercop-data/panther/amd64/try/c/clang_-march=native_-O_-fwrapv_-Qunused-arguments_-fPIC_-fPIE_-gdwarf-4_-Wall/timingleaks/crypto_aead/omdsha512k128n128tau128v2/avx1/work/./omdsha512.h:146: first defined here
try.c: clang: error: linker command failed with exit code 1 (use -v to see invocation)
Number of similar (implementation,compiler) pairs: 1, namely:
Implementation | Compiler |
T:avx1 | clang -march=native -O -fwrapv -Qunused-arguments -fPIC -fPIE -gdwarf-4 -Wall (Debian_Clang_11.0.1) |
Compiler output
try.c: /usr/bin/ld: libcrypto_aead_omdsha512k128n128tau128v2.a(omdsha512.o):.../supercop-data/panther/amd64/try/c/clang_-march=native_-Os_-fwrapv_-Qunused-arguments_-fPIC_-fPIE_-gdwarf-4_-Wall/timingleaks/crypto_aead/omdsha512k128n128tau128v2/avx1/work/./omdsha512.h:146: multiple definition of `Hash'; libcrypto_aead_omdsha512k128n128tau128v2.a(encrypt.o):.../supercop-data/panther/amd64/try/c/clang_-march=native_-Os_-fwrapv_-Qunused-arguments_-fPIC_-fPIE_-gdwarf-4_-Wall/timingleaks/crypto_aead/omdsha512k128n128tau128v2/avx1/work/./omdsha512.h:146: first defined here
try.c: clang: error: linker command failed with exit code 1 (use -v to see invocation)
Number of similar (implementation,compiler) pairs: 1, namely:
Implementation | Compiler |
T:avx1 | clang -march=native -Os -fwrapv -Qunused-arguments -fPIC -fPIE -gdwarf-4 -Wall (Debian_Clang_11.0.1) |
Compiler output
try.c: /usr/bin/ld: libcrypto_aead_omdsha512k128n128tau128v2.a(omdsha512.o):.../supercop-data/panther/amd64/try/c/clang_-mcpu=native_-O3_-fwrapv_-Qunused-arguments_-fPIC_-fPIE_-gdwarf-4_-Wall/timingleaks/crypto_aead/omdsha512k128n128tau128v2/avx1/work/./omdsha512.h:146: multiple definition of `Hash'; libcrypto_aead_omdsha512k128n128tau128v2.a(encrypt.o):.../supercop-data/panther/amd64/try/c/clang_-mcpu=native_-O3_-fwrapv_-Qunused-arguments_-fPIC_-fPIE_-gdwarf-4_-Wall/timingleaks/crypto_aead/omdsha512k128n128tau128v2/avx1/work/./omdsha512.h:146: first defined here
try.c: clang: error: linker command failed with exit code 1 (use -v to see invocation)
Number of similar (implementation,compiler) pairs: 1, namely:
Implementation | Compiler |
T:avx1 | clang -mcpu=native -O3 -fwrapv -Qunused-arguments -fPIC -fPIE -gdwarf-4 -Wall (Debian_Clang_11.0.1) |
Compiler output
try.c: /usr/bin/ld: libcrypto_aead_omdsha512k128n128tau128v2.a(omdsha512.o):.../supercop-data/panther/amd64/try/c/gcc_-march=native_-mtune=native_-O2_-fwrapv_-fPIC_-fPIE_-gdwarf-4_-Wall/timingleaks/crypto_aead/omdsha512k128n128tau128v2/avx1/work/omdsha512.h:146: multiple definition of `Hash'; libcrypto_aead_omdsha512k128n128tau128v2.a(encrypt.o):.../supercop-data/panther/amd64/try/c/gcc_-march=native_-mtune=native_-O2_-fwrapv_-fPIC_-fPIE_-gdwarf-4_-Wall/timingleaks/crypto_aead/omdsha512k128n128tau128v2/avx1/work/omdsha512.h:146: first defined here
try.c: collect2: error: ld returned 1 exit status
Number of similar (implementation,compiler) pairs: 1, namely:
Implementation | Compiler |
T:avx1 | gcc -march=native -mtune=native -O2 -fwrapv -fPIC -fPIE -gdwarf-4 -Wall (10.2.1_20210110) |
Compiler output
try.c: /usr/bin/ld: libcrypto_aead_omdsha512k128n128tau128v2.a(omdsha512.o):.../supercop-data/panther/amd64/try/c/gcc_-march=native_-mtune=native_-O3_-fwrapv_-fPIC_-fPIE_-gdwarf-4_-Wall/timingleaks/crypto_aead/omdsha512k128n128tau128v2/avx1/work/omdsha512.h:146: multiple definition of `Hash'; libcrypto_aead_omdsha512k128n128tau128v2.a(encrypt.o):.../supercop-data/panther/amd64/try/c/gcc_-march=native_-mtune=native_-O3_-fwrapv_-fPIC_-fPIE_-gdwarf-4_-Wall/timingleaks/crypto_aead/omdsha512k128n128tau128v2/avx1/work/omdsha512.h:146: first defined here
try.c: collect2: error: ld returned 1 exit status
Number of similar (implementation,compiler) pairs: 1, namely:
Implementation | Compiler |
T:avx1 | gcc -march=native -mtune=native -O3 -fwrapv -fPIC -fPIE -gdwarf-4 -Wall (10.2.1_20210110) |
Compiler output
try.c: /usr/bin/ld: libcrypto_aead_omdsha512k128n128tau128v2.a(omdsha512.o):.../supercop-data/panther/amd64/try/c/gcc_-march=native_-mtune=native_-O_-fwrapv_-fPIC_-fPIE_-gdwarf-4_-Wall/timingleaks/crypto_aead/omdsha512k128n128tau128v2/avx1/work/omdsha512.h:146: multiple definition of `Hash'; libcrypto_aead_omdsha512k128n128tau128v2.a(encrypt.o):.../supercop-data/panther/amd64/try/c/gcc_-march=native_-mtune=native_-O_-fwrapv_-fPIC_-fPIE_-gdwarf-4_-Wall/timingleaks/crypto_aead/omdsha512k128n128tau128v2/avx1/work/omdsha512.h:146: first defined here
try.c: collect2: error: ld returned 1 exit status
Number of similar (implementation,compiler) pairs: 1, namely:
Implementation | Compiler |
T:avx1 | gcc -march=native -mtune=native -O -fwrapv -fPIC -fPIE -gdwarf-4 -Wall (10.2.1_20210110) |
Compiler output
try.c: /usr/bin/ld: libcrypto_aead_omdsha512k128n128tau128v2.a(omdsha512.o):.../supercop-data/panther/amd64/try/c/gcc_-march=native_-mtune=native_-Os_-fwrapv_-fPIC_-fPIE_-gdwarf-4_-Wall/timingleaks/crypto_aead/omdsha512k128n128tau128v2/avx1/work/omdsha512.h:146: multiple definition of `Hash'; libcrypto_aead_omdsha512k128n128tau128v2.a(encrypt.o):.../supercop-data/panther/amd64/try/c/gcc_-march=native_-mtune=native_-Os_-fwrapv_-fPIC_-fPIE_-gdwarf-4_-Wall/timingleaks/crypto_aead/omdsha512k128n128tau128v2/avx1/work/omdsha512.h:146: first defined here
try.c: collect2: error: ld returned 1 exit status
Number of similar (implementation,compiler) pairs: 1, namely:
Implementation | Compiler |
T:avx1 | gcc -march=native -mtune=native -Os -fwrapv -fPIC -fPIE -gdwarf-4 -Wall (10.2.1_20210110) |
Compiler output
sha512.c: sha512.c:206:18: warning: incompatible pointer types initializing 'const uint64_t *' (aka 'const unsigned long *') with an expression of type 'const unsigned char *' [-Wincompatible-pointer-types]
sha512.c: const uint64_t *W=in;
sha512.c: ^ ~~
sha512.c: 1 warning generated.
Number of similar (implementation,compiler) pairs: 5, namely:
Implementation | Compiler |
T:ref | clang -march=native -O2 -fwrapv -Qunused-arguments -fPIC -fPIE -gdwarf-4 -Wall (Debian_Clang_11.0.1) |
T:ref | clang -march=native -O3 -fwrapv -Qunused-arguments -fPIC -fPIE -gdwarf-4 -Wall (Debian_Clang_11.0.1) |
T:ref | clang -march=native -O -fwrapv -Qunused-arguments -fPIC -fPIE -gdwarf-4 -Wall (Debian_Clang_11.0.1) |
T:ref | clang -march=native -Os -fwrapv -Qunused-arguments -fPIC -fPIE -gdwarf-4 -Wall (Debian_Clang_11.0.1) |
T:ref | clang -mcpu=native -O3 -fwrapv -Qunused-arguments -fPIC -fPIE -gdwarf-4 -Wall (Debian_Clang_11.0.1) |
Compiler output
sha512.c: sha512.c: In function 'sha512_comp':
sha512.c: sha512.c:206:20: warning: initialization of 'const uint64_t *' {aka 'const long unsigned int *'} from incompatible pointer type 'const unsigned char *' [-Wincompatible-pointer-types]
sha512.c: 206 | const uint64_t *W=in;
sha512.c: | ^~
Number of similar (implementation,compiler) pairs: 4, namely:
Implementation | Compiler |
T:ref | gcc -march=native -mtune=native -O2 -fwrapv -fPIC -fPIE -gdwarf-4 -Wall (10.2.1_20210110) |
T:ref | gcc -march=native -mtune=native -O3 -fwrapv -fPIC -fPIE -gdwarf-4 -Wall (10.2.1_20210110) |
T:ref | gcc -march=native -mtune=native -O -fwrapv -fPIC -fPIE -gdwarf-4 -Wall (10.2.1_20210110) |
T:ref | gcc -march=native -mtune=native -Os -fwrapv -fPIC -fPIE -gdwarf-4 -Wall (10.2.1_20210110) |
Compiler output
try.c: /usr/bin/ld: libcrypto_aead_omdsha512k128n128tau128v2.a(omdsha512.o):.../supercop-data/panther/amd64/try/c/clang_-march=native_-O2_-fwrapv_-Qunused-arguments_-fPIC_-fPIE_-gdwarf-4_-Wall/timingleaks/crypto_aead/omdsha512k128n128tau128v2/sse4/work/./omdsha512.h:146: multiple definition of `Hash'; libcrypto_aead_omdsha512k128n128tau128v2.a(encrypt.o):.../supercop-data/panther/amd64/try/c/clang_-march=native_-O2_-fwrapv_-Qunused-arguments_-fPIC_-fPIE_-gdwarf-4_-Wall/timingleaks/crypto_aead/omdsha512k128n128tau128v2/sse4/work/./omdsha512.h:146: first defined here
try.c: clang: error: linker command failed with exit code 1 (use -v to see invocation)
Number of similar (implementation,compiler) pairs: 1, namely:
Implementation | Compiler |
T:sse4 | clang -march=native -O2 -fwrapv -Qunused-arguments -fPIC -fPIE -gdwarf-4 -Wall (Debian_Clang_11.0.1) |
Compiler output
try.c: /usr/bin/ld: libcrypto_aead_omdsha512k128n128tau128v2.a(omdsha512.o):.../supercop-data/panther/amd64/try/c/clang_-march=native_-O3_-fwrapv_-Qunused-arguments_-fPIC_-fPIE_-gdwarf-4_-Wall/timingleaks/crypto_aead/omdsha512k128n128tau128v2/sse4/work/./omdsha512.h:146: multiple definition of `Hash'; libcrypto_aead_omdsha512k128n128tau128v2.a(encrypt.o):.../supercop-data/panther/amd64/try/c/clang_-march=native_-O3_-fwrapv_-Qunused-arguments_-fPIC_-fPIE_-gdwarf-4_-Wall/timingleaks/crypto_aead/omdsha512k128n128tau128v2/sse4/work/./omdsha512.h:146: first defined here
try.c: clang: error: linker command failed with exit code 1 (use -v to see invocation)
Number of similar (implementation,compiler) pairs: 1, namely:
Implementation | Compiler |
T:sse4 | clang -march=native -O3 -fwrapv -Qunused-arguments -fPIC -fPIE -gdwarf-4 -Wall (Debian_Clang_11.0.1) |
Compiler output
try.c: /usr/bin/ld: libcrypto_aead_omdsha512k128n128tau128v2.a(omdsha512.o):.../supercop-data/panther/amd64/try/c/clang_-march=native_-O_-fwrapv_-Qunused-arguments_-fPIC_-fPIE_-gdwarf-4_-Wall/timingleaks/crypto_aead/omdsha512k128n128tau128v2/sse4/work/./omdsha512.h:146: multiple definition of `Hash'; libcrypto_aead_omdsha512k128n128tau128v2.a(encrypt.o):.../supercop-data/panther/amd64/try/c/clang_-march=native_-O_-fwrapv_-Qunused-arguments_-fPIC_-fPIE_-gdwarf-4_-Wall/timingleaks/crypto_aead/omdsha512k128n128tau128v2/sse4/work/./omdsha512.h:146: first defined here
try.c: clang: error: linker command failed with exit code 1 (use -v to see invocation)
Number of similar (implementation,compiler) pairs: 1, namely:
Implementation | Compiler |
T:sse4 | clang -march=native -O -fwrapv -Qunused-arguments -fPIC -fPIE -gdwarf-4 -Wall (Debian_Clang_11.0.1) |
Compiler output
try.c: /usr/bin/ld: libcrypto_aead_omdsha512k128n128tau128v2.a(omdsha512.o):.../supercop-data/panther/amd64/try/c/clang_-march=native_-Os_-fwrapv_-Qunused-arguments_-fPIC_-fPIE_-gdwarf-4_-Wall/timingleaks/crypto_aead/omdsha512k128n128tau128v2/sse4/work/./omdsha512.h:146: multiple definition of `Hash'; libcrypto_aead_omdsha512k128n128tau128v2.a(encrypt.o):.../supercop-data/panther/amd64/try/c/clang_-march=native_-Os_-fwrapv_-Qunused-arguments_-fPIC_-fPIE_-gdwarf-4_-Wall/timingleaks/crypto_aead/omdsha512k128n128tau128v2/sse4/work/./omdsha512.h:146: first defined here
try.c: clang: error: linker command failed with exit code 1 (use -v to see invocation)
Number of similar (implementation,compiler) pairs: 1, namely:
Implementation | Compiler |
T:sse4 | clang -march=native -Os -fwrapv -Qunused-arguments -fPIC -fPIE -gdwarf-4 -Wall (Debian_Clang_11.0.1) |
Compiler output
try.c: /usr/bin/ld: libcrypto_aead_omdsha512k128n128tau128v2.a(omdsha512.o):.../supercop-data/panther/amd64/try/c/clang_-mcpu=native_-O3_-fwrapv_-Qunused-arguments_-fPIC_-fPIE_-gdwarf-4_-Wall/timingleaks/crypto_aead/omdsha512k128n128tau128v2/sse4/work/./omdsha512.h:146: multiple definition of `Hash'; libcrypto_aead_omdsha512k128n128tau128v2.a(encrypt.o):.../supercop-data/panther/amd64/try/c/clang_-mcpu=native_-O3_-fwrapv_-Qunused-arguments_-fPIC_-fPIE_-gdwarf-4_-Wall/timingleaks/crypto_aead/omdsha512k128n128tau128v2/sse4/work/./omdsha512.h:146: first defined here
try.c: clang: error: linker command failed with exit code 1 (use -v to see invocation)
Number of similar (implementation,compiler) pairs: 1, namely:
Implementation | Compiler |
T:sse4 | clang -mcpu=native -O3 -fwrapv -Qunused-arguments -fPIC -fPIE -gdwarf-4 -Wall (Debian_Clang_11.0.1) |
Compiler output
try.c: /usr/bin/ld: libcrypto_aead_omdsha512k128n128tau128v2.a(omdsha512.o):.../supercop-data/panther/amd64/try/c/gcc_-march=native_-mtune=native_-O2_-fwrapv_-fPIC_-fPIE_-gdwarf-4_-Wall/timingleaks/crypto_aead/omdsha512k128n128tau128v2/sse4/work/omdsha512.h:146: multiple definition of `Hash'; libcrypto_aead_omdsha512k128n128tau128v2.a(encrypt.o):.../supercop-data/panther/amd64/try/c/gcc_-march=native_-mtune=native_-O2_-fwrapv_-fPIC_-fPIE_-gdwarf-4_-Wall/timingleaks/crypto_aead/omdsha512k128n128tau128v2/sse4/work/omdsha512.h:146: first defined here
try.c: collect2: error: ld returned 1 exit status
Number of similar (implementation,compiler) pairs: 1, namely:
Implementation | Compiler |
T:sse4 | gcc -march=native -mtune=native -O2 -fwrapv -fPIC -fPIE -gdwarf-4 -Wall (10.2.1_20210110) |
Compiler output
try.c: /usr/bin/ld: libcrypto_aead_omdsha512k128n128tau128v2.a(omdsha512.o):.../supercop-data/panther/amd64/try/c/gcc_-march=native_-mtune=native_-O3_-fwrapv_-fPIC_-fPIE_-gdwarf-4_-Wall/timingleaks/crypto_aead/omdsha512k128n128tau128v2/sse4/work/omdsha512.h:146: multiple definition of `Hash'; libcrypto_aead_omdsha512k128n128tau128v2.a(encrypt.o):.../supercop-data/panther/amd64/try/c/gcc_-march=native_-mtune=native_-O3_-fwrapv_-fPIC_-fPIE_-gdwarf-4_-Wall/timingleaks/crypto_aead/omdsha512k128n128tau128v2/sse4/work/omdsha512.h:146: first defined here
try.c: collect2: error: ld returned 1 exit status
Number of similar (implementation,compiler) pairs: 1, namely:
Implementation | Compiler |
T:sse4 | gcc -march=native -mtune=native -O3 -fwrapv -fPIC -fPIE -gdwarf-4 -Wall (10.2.1_20210110) |
Compiler output
try.c: /usr/bin/ld: libcrypto_aead_omdsha512k128n128tau128v2.a(omdsha512.o):.../supercop-data/panther/amd64/try/c/gcc_-march=native_-mtune=native_-O_-fwrapv_-fPIC_-fPIE_-gdwarf-4_-Wall/timingleaks/crypto_aead/omdsha512k128n128tau128v2/sse4/work/omdsha512.h:146: multiple definition of `Hash'; libcrypto_aead_omdsha512k128n128tau128v2.a(encrypt.o):.../supercop-data/panther/amd64/try/c/gcc_-march=native_-mtune=native_-O_-fwrapv_-fPIC_-fPIE_-gdwarf-4_-Wall/timingleaks/crypto_aead/omdsha512k128n128tau128v2/sse4/work/omdsha512.h:146: first defined here
try.c: collect2: error: ld returned 1 exit status
Number of similar (implementation,compiler) pairs: 1, namely:
Implementation | Compiler |
T:sse4 | gcc -march=native -mtune=native -O -fwrapv -fPIC -fPIE -gdwarf-4 -Wall (10.2.1_20210110) |
Compiler output
try.c: /usr/bin/ld: libcrypto_aead_omdsha512k128n128tau128v2.a(omdsha512.o):.../supercop-data/panther/amd64/try/c/gcc_-march=native_-mtune=native_-Os_-fwrapv_-fPIC_-fPIE_-gdwarf-4_-Wall/timingleaks/crypto_aead/omdsha512k128n128tau128v2/sse4/work/omdsha512.h:146: multiple definition of `Hash'; libcrypto_aead_omdsha512k128n128tau128v2.a(encrypt.o):.../supercop-data/panther/amd64/try/c/gcc_-march=native_-mtune=native_-Os_-fwrapv_-fPIC_-fPIE_-gdwarf-4_-Wall/timingleaks/crypto_aead/omdsha512k128n128tau128v2/sse4/work/omdsha512.h:146: first defined here
try.c: collect2: error: ld returned 1 exit status
Number of similar (implementation,compiler) pairs: 1, namely:
Implementation | Compiler |
T:sse4 | gcc -march=native -mtune=native -Os -fwrapv -fPIC -fPIE -gdwarf-4 -Wall (10.2.1_20210110) |
Namespace violations
omdsha512.o calc_L_i T
omdsha512.o double_block T
omdsha512.o final_masking_associated_data T
omdsha512.o final_masking_message T
omdsha512.o hash T
omdsha512.o increment_masking_associated_data T
omdsha512.o increment_masking_message T
omdsha512.o key_func T
omdsha512.o l2b T
omdsha512.o ntz T
omdsha512.o omdsha512_process T
omdsha512.o triple_block T
omdsha512.o xor_block T
sha512.o sha512_comp T
Number of similar (implementation,compiler) pairs: 9, namely:
Implementation | Compiler |
T:ref | clang -march=native -O2 -fwrapv -Qunused-arguments -fPIC -fPIE -gdwarf-4 -Wall (Debian_Clang_11.0.1) |
T:ref | clang -march=native -O3 -fwrapv -Qunused-arguments -fPIC -fPIE -gdwarf-4 -Wall (Debian_Clang_11.0.1) |
T:ref | clang -march=native -O -fwrapv -Qunused-arguments -fPIC -fPIE -gdwarf-4 -Wall (Debian_Clang_11.0.1) |
T:ref | clang -march=native -Os -fwrapv -Qunused-arguments -fPIC -fPIE -gdwarf-4 -Wall (Debian_Clang_11.0.1) |
T:ref | clang -mcpu=native -O3 -fwrapv -Qunused-arguments -fPIC -fPIE -gdwarf-4 -Wall (Debian_Clang_11.0.1) |
T:ref | gcc -march=native -mtune=native -O2 -fwrapv -fPIC -fPIE -gdwarf-4 -Wall (10.2.1_20210110) |
T:ref | gcc -march=native -mtune=native -O3 -fwrapv -fPIC -fPIE -gdwarf-4 -Wall (10.2.1_20210110) |
T:ref | gcc -march=native -mtune=native -O -fwrapv -fPIC -fPIE -gdwarf-4 -Wall (10.2.1_20210110) |
T:ref | gcc -march=native -mtune=native -Os -fwrapv -fPIC -fPIE -gdwarf-4 -Wall (10.2.1_20210110) |