Test results for amd64, panther, crypto_aead/morus1280128v2
[Page version: 20250315 02:02:15]
Measurements for amd64, panther, crypto_aead
Test results for amd64, panther, crypto_aead
Test results for crypto_aead/morus1280128v2
Computer: panther
Microarchitecture: amd64; Tiger Lake (806c1)
Architecture: amd64
CPU ID: GenuineIntel-000806c1-00-bfebfbff
SUPERCOP version: 20250307
Operation: crypto_aead
Primitive: morus1280128v2
Time | Object size | Test size | Implementation | Compiler | Benchmark date | SUPERCOP version |
3081 | 5216 0 0 | 21885 828 1048 | T:avx2 | clang -march=native -O2 -fwrapv -Qunused-arguments -fPIC -fPIE -gdwarf-4 -Wall | 20250309 | 20250307 |
3095 | 5216 0 0 | 21901 828 1048 | T:avx2 | clang -march=native -O3 -fwrapv -Qunused-arguments -fPIC -fPIE -gdwarf-4 -Wall | 20250309 | 20250307 |
3200 | 3471 0 0 | 16851 820 1016 | T:avx2 | clang -march=native -Os -fwrapv -Qunused-arguments -fPIC -fPIE -gdwarf-4 -Wall | 20250309 | 20250307 |
3704 | 8659 0 0 | 25285 828 1048 | T:sse2 | clang -march=native -O2 -fwrapv -Qunused-arguments -fPIC -fPIE -gdwarf-4 -Wall | 20250309 | 20250307 |
3742 | 8659 0 0 | 25301 828 1048 | T:sse2 | clang -march=native -O3 -fwrapv -Qunused-arguments -fPIC -fPIE -gdwarf-4 -Wall | 20250309 | 20250307 |
3809 | 5744 0 0 | 19155 820 1016 | T:sse2 | clang -march=native -Os -fwrapv -Qunused-arguments -fPIC -fPIE -gdwarf-4 -Wall | 20250309 | 20250307 |
4381 | 5956 0 0 | 22368 780 1080 | T:avx2 | gcc -march=native -mtune=native -O3 -fwrapv -fPIC -fPIE -gdwarf-4 -Wall | 20250309 | 20250307 |
4451 | 3200 0 0 | 17136 780 1080 | T:avx2 | gcc -march=native -mtune=native -O -fwrapv -fPIC -fPIE -gdwarf-4 -Wall | 20250309 | 20250307 |
4453 | 3180 0 0 | 17520 780 1080 | T:avx2 | gcc -march=native -mtune=native -O2 -fwrapv -fPIC -fPIE -gdwarf-4 -Wall | 20250309 | 20250307 |
6842 | 12501 0 0 | 28549 828 1016 | T:sse2 | clang -mcpu=native -O3 -fwrapv -Qunused-arguments -fPIC -fPIE -gdwarf-4 -Wall | 20250309 | 20250307 |
8316 | 8489 0 0 | 24904 780 1080 | T:sse2 | gcc -march=native -mtune=native -O3 -fwrapv -fPIC -fPIE -gdwarf-4 -Wall | 20250309 | 20250307 |
9120 | 14977 0 0 | 31408 780 1080 | T:ref64 | gcc -march=native -mtune=native -O3 -fwrapv -fPIC -fPIE -gdwarf-4 -Wall | 20250309 | 20250307 |
9194 | 14977 0 0 | 31408 780 1080 | T:ref | gcc -march=native -mtune=native -O3 -fwrapv -fPIC -fPIE -gdwarf-4 -Wall | 20250309 | 20250307 |
13426 | 5582 0 0 | 19920 780 1080 | T:ref64 | gcc -march=native -mtune=native -O2 -fwrapv -fPIC -fPIE -gdwarf-4 -Wall | 20250309 | 20250307 |
13484 | 5117 0 0 | 17827 756 1048 | T:ref | gcc -march=native -mtune=native -Os -fwrapv -fPIC -fPIE -gdwarf-4 -Wall | 20250309 | 20250307 |
13501 | 5117 0 0 | 17827 756 1048 | T:ref64 | gcc -march=native -mtune=native -Os -fwrapv -fPIC -fPIE -gdwarf-4 -Wall | 20250309 | 20250307 |
13595 | 5582 0 0 | 19920 780 1080 | T:ref | gcc -march=native -mtune=native -O2 -fwrapv -fPIC -fPIE -gdwarf-4 -Wall | 20250309 | 20250307 |
14053 | 5497 0 0 | 19351 772 1080 | T:ref | gcc -march=native -mtune=native -O -fwrapv -fPIC -fPIE -gdwarf-4 -Wall | 20250309 | 20250307 |
14068 | 5097 0 0 | 18427 820 1016 | T:ref | clang -march=native -Os -fwrapv -Qunused-arguments -fPIC -fPIE -gdwarf-4 -Wall | 20250309 | 20250307 |
14079 | 5497 0 0 | 19351 772 1080 | T:ref64 | gcc -march=native -mtune=native -O -fwrapv -fPIC -fPIE -gdwarf-4 -Wall | 20250309 | 20250307 |
14096 | 6091 0 0 | 22717 828 1048 | T:ref64 | clang -march=native -O2 -fwrapv -Qunused-arguments -fPIC -fPIE -gdwarf-4 -Wall | 20250309 | 20250307 |
14112 | 5097 0 0 | 18427 820 1016 | T:ref64 | clang -march=native -Os -fwrapv -Qunused-arguments -fPIC -fPIE -gdwarf-4 -Wall | 20250309 | 20250307 |
14114 | 6763 0 0 | 22925 828 1016 | T:ref | clang -mcpu=native -O3 -fwrapv -Qunused-arguments -fPIC -fPIE -gdwarf-4 -Wall | 20250309 | 20250307 |
14213 | 6763 0 0 | 22925 828 1016 | T:ref64 | clang -mcpu=native -O3 -fwrapv -Qunused-arguments -fPIC -fPIE -gdwarf-4 -Wall | 20250309 | 20250307 |
14333 | 6091 0 0 | 22733 828 1048 | T:ref | clang -march=native -O3 -fwrapv -Qunused-arguments -fPIC -fPIE -gdwarf-4 -Wall | 20250309 | 20250307 |
14345 | 6091 0 0 | 22733 828 1048 | T:ref64 | clang -march=native -O3 -fwrapv -Qunused-arguments -fPIC -fPIE -gdwarf-4 -Wall | 20250309 | 20250307 |
14410 | 6091 0 0 | 22717 828 1048 | T:ref | clang -march=native -O2 -fwrapv -Qunused-arguments -fPIC -fPIE -gdwarf-4 -Wall | 20250309 | 20250307 |
15968 | 5909 0 0 | 19571 820 1016 | T:ref64 | clang -march=native -O -fwrapv -Qunused-arguments -fPIC -fPIE -gdwarf-4 -Wall | 20250309 | 20250307 |
16002 | 5909 0 0 | 19571 820 1016 | T:ref | clang -march=native -O -fwrapv -Qunused-arguments -fPIC -fPIE -gdwarf-4 -Wall | 20250309 | 20250307 |
Compiler output
encrypt.c: encrypt.c:309:24: warning: unused variable 'j' [-Wunused-variable]
encrypt.c: unsigned long long i, j;
encrypt.c: ^
encrypt.c: encrypt.c:360:16: warning: unused variable 'check' [-Wunused-variable]
encrypt.c: unsigned char check = 0;
encrypt.c: ^
encrypt.c: encrypt.c:357:24: warning: unused variable 'j' [-Wunused-variable]
encrypt.c: unsigned long long i, j;
encrypt.c: ^
encrypt.c: encrypt.c:359:16: warning: unused variable 'tag' [-Wunused-variable]
encrypt.c: unsigned char tag[16];
encrypt.c: ^
encrypt.c: 4 warnings generated.
Number of similar (implementation,compiler) pairs: 1, namely:
Implementation | Compiler |
T:avx2 | clang -march=native -O2 -fwrapv -Qunused-arguments -fPIC -fPIE -gdwarf-4 -Wall (Debian_Clang_11.0.1) |
Compiler output
encrypt.c: encrypt.c:309:24: warning: unused variable 'j' [-Wunused-variable]
encrypt.c: unsigned long long i, j;
encrypt.c: ^
encrypt.c: encrypt.c:357:24: warning: unused variable 'j' [-Wunused-variable]
encrypt.c: unsigned long long i, j;
encrypt.c: ^
encrypt.c: encrypt.c:359:16: warning: unused variable 'tag' [-Wunused-variable]
encrypt.c: unsigned char tag[16];
encrypt.c: ^
encrypt.c: encrypt.c:360:16: warning: unused variable 'check' [-Wunused-variable]
encrypt.c: unsigned char check = 0;
encrypt.c: ^
encrypt.c: 4 warnings generated.
Number of similar (implementation,compiler) pairs: 1, namely:
Implementation | Compiler |
T:avx2 | clang -march=native -O3 -fwrapv -Qunused-arguments -fPIC -fPIE -gdwarf-4 -Wall (Debian_Clang_11.0.1) |
Compiler output
encrypt.c: encrypt.c:309:24: warning: unused variable 'j' [-Wunused-variable]
encrypt.c: unsigned long long i, j;
encrypt.c: ^
encrypt.c: encrypt.c:360:16: warning: unused variable 'check' [-Wunused-variable]
encrypt.c: unsigned char check = 0;
encrypt.c: ^
encrypt.c: encrypt.c:357:24: warning: unused variable 'j' [-Wunused-variable]
encrypt.c: unsigned long long i, j;
encrypt.c: ^
encrypt.c: encrypt.c:359:16: warning: unused variable 'tag' [-Wunused-variable]
encrypt.c: unsigned char tag[16];
encrypt.c: ^
encrypt.c: 4 warnings generated.
try.c: /usr/bin/ld: libcrypto_aead_morus1280128v2.a(encrypt.o): in function `crypto_aead_morus1280128v2_avx2_timingleaks_encrypt':
try.c: .../supercop-data/panther/amd64/try/c/clang_-march=native_-O_-fwrapv_-Qunused-arguments_-fPIC_-fPIE_-gdwarf-4_-Wall/timingleaks/crypto_aead/morus1280128v2/avx2/work/encrypt.c:320: undefined reference to `morus_enc_aut_step'
try.c: /usr/bin/ld: .../supercop-data/panther/amd64/try/c/clang_-march=native_-O_-fwrapv_-Qunused-arguments_-fPIC_-fPIE_-gdwarf-4_-Wall/timingleaks/crypto_aead/morus1280128v2/avx2/work/encrypt.c:332: undefined reference to `morus_enc_aut_step'
try.c: /usr/bin/ld: libcrypto_aead_morus1280128v2.a(encrypt.o): in function `crypto_aead_morus1280128v2_avx2_timingleaks_decrypt':
try.c: .../supercop-data/panther/amd64/try/c/clang_-march=native_-O_-fwrapv_-Qunused-arguments_-fPIC_-fPIE_-gdwarf-4_-Wall/timingleaks/crypto_aead/morus1280128v2/avx2/work/encrypt.c:367: undefined reference to `morus_enc_aut_step'
try.c: /usr/bin/ld: .../supercop-data/panther/amd64/try/c/clang_-march=native_-O_-fwrapv_-Qunused-arguments_-fPIC_-fPIE_-gdwarf-4_-Wall/timingleaks/crypto_aead/morus1280128v2/avx2/work/encrypt.c:379: undefined reference to `morus_dec_aut_step'
try.c: clang: error: linker command failed with exit code 1 (use -v to see invocation)
Number of similar (implementation,compiler) pairs: 1, namely:
Implementation | Compiler |
T:avx2 | clang -march=native -O -fwrapv -Qunused-arguments -fPIC -fPIE -gdwarf-4 -Wall (Debian_Clang_11.0.1) |
Compiler output
encrypt.c: encrypt.c:309:24: warning: unused variable 'j' [-Wunused-variable]
encrypt.c: unsigned long long i, j;
encrypt.c: ^
encrypt.c: encrypt.c:360:16: warning: unused variable 'check' [-Wunused-variable]
encrypt.c: unsigned char check = 0;
encrypt.c: ^
encrypt.c: encrypt.c:359:16: warning: unused variable 'tag' [-Wunused-variable]
encrypt.c: unsigned char tag[16];
encrypt.c: ^
encrypt.c: encrypt.c:357:24: warning: unused variable 'j' [-Wunused-variable]
encrypt.c: unsigned long long i, j;
encrypt.c: ^
encrypt.c: 4 warnings generated.
Number of similar (implementation,compiler) pairs: 1, namely:
Implementation | Compiler |
T:avx2 | clang -march=native -Os -fwrapv -Qunused-arguments -fPIC -fPIE -gdwarf-4 -Wall (Debian_Clang_11.0.1) |
Compiler output
encrypt.c: encrypt.c:55:13: error: always_inline function '_mm256_xor_si256' requires target feature 'avx2', but would be inlined into function 'morus_stateupdate' that is compiled without support for 'avx2'
encrypt.c: state[0] = XOR256(state[0], state[3]);
encrypt.c: ^
encrypt.c: encrypt.c:25:27: note: expanded from macro 'XOR256'
encrypt.c: #define XOR256(x,y) _mm256_xor_si256((x),(y)) /*XOR256(x,y) = x ^ y, where x and y are two 256-bit word*/
encrypt.c: ^
encrypt.c: encrypt.c:55:13: error: AVX vector argument of type '__m256i' (vector of 4 'long long' values) without 'avx' enabled changes the ABI
encrypt.c: encrypt.c:25:27: note: expanded from macro 'XOR256'
encrypt.c: #define XOR256(x,y) _mm256_xor_si256((x),(y)) /*XOR256(x,y) = x ^ y, where x and y are two 256-bit word*/
encrypt.c: ^
encrypt.c: encrypt.c:56:30: error: always_inline function '_mm256_and_si256' requires target feature 'avx2', but would be inlined into function 'morus_stateupdate' that is compiled without support for 'avx2'
encrypt.c: state[0] = XOR256(state[0], AND256(state[1], state[2]));
encrypt.c: ^
encrypt.c: encrypt.c:26:27: note: expanded from macro 'AND256'
encrypt.c: #define AND256(x,y) _mm256_and_si256((x),(y)) /*AND(x,y) = x & y, where x and y are two 256-bit word*/
encrypt.c: ^
encrypt.c: encrypt.c:56:30: error: AVX vector argument of type '__m256i' (vector of 4 'long long' values) without 'avx' enabled changes the ABI
encrypt.c: encrypt.c:26:27: note: expanded from macro 'AND256'
encrypt.c: #define AND256(x,y) _mm256_and_si256((x),(y)) /*AND(x,y) = x & y, where x and y are two 256-bit word*/
encrypt.c: ^
encrypt.c: encrypt.c:56:13: error: always_inline function '_mm256_xor_si256' requires target feature 'avx2', but would be inlined into function 'morus_stateupdate' that is compiled without support for 'avx2'
encrypt.c: state[0] = XOR256(state[0], AND256(state[1], state[2]));
encrypt.c: ^
encrypt.c: encrypt.c:25:27: note: expanded from macro 'XOR256'
encrypt.c: #define XOR256(x,y) _mm256_xor_si256((x),(y)) /*XOR256(x,y) = x ^ y, where x and y are two 256-bit word*/
encrypt.c: ...
Number of similar (implementation,compiler) pairs: 1, namely:
Implementation | Compiler |
T:avx2 | clang -mcpu=native -O3 -fwrapv -Qunused-arguments -fPIC -fPIE -gdwarf-4 -Wall (Debian_Clang_11.0.1) |
Compiler output
encrypt.c: encrypt.c: In function 'crypto_aead_morus1280128v2_avx2_timingleaks_encrypt':
encrypt.c: encrypt.c:309:24: warning: unused variable 'j' [-Wunused-variable]
encrypt.c: 309 | unsigned long long i, j;
encrypt.c: | ^
encrypt.c: encrypt.c: In function 'crypto_aead_morus1280128v2_avx2_timingleaks_decrypt':
encrypt.c: encrypt.c:360:16: warning: unused variable 'check' [-Wunused-variable]
encrypt.c: 360 | unsigned char check = 0;
encrypt.c: | ^~~~~
encrypt.c: encrypt.c:359:16: warning: unused variable 'tag' [-Wunused-variable]
encrypt.c: 359 | unsigned char tag[16];
encrypt.c: | ^~~
encrypt.c: encrypt.c:357:24: warning: unused variable 'j' [-Wunused-variable]
encrypt.c: 357 | unsigned long long i, j;
encrypt.c: | ^
Number of similar (implementation,compiler) pairs: 3, namely:
Implementation | Compiler |
T:avx2 | gcc -march=native -mtune=native -O2 -fwrapv -fPIC -fPIE -gdwarf-4 -Wall (10.2.1_20210110) |
T:avx2 | gcc -march=native -mtune=native -O3 -fwrapv -fPIC -fPIE -gdwarf-4 -Wall (10.2.1_20210110) |
T:avx2 | gcc -march=native -mtune=native -O -fwrapv -fPIC -fPIE -gdwarf-4 -Wall (10.2.1_20210110) |
Compiler output
encrypt.c: encrypt.c: In function 'crypto_aead_morus1280128v2_avx2_timingleaks_encrypt':
encrypt.c: encrypt.c:309:24: warning: unused variable 'j' [-Wunused-variable]
encrypt.c: 309 | unsigned long long i, j;
encrypt.c: | ^
encrypt.c: encrypt.c: In function 'crypto_aead_morus1280128v2_avx2_timingleaks_decrypt':
encrypt.c: encrypt.c:360:16: warning: unused variable 'check' [-Wunused-variable]
encrypt.c: 360 | unsigned char check = 0;
encrypt.c: | ^~~~~
encrypt.c: encrypt.c:359:16: warning: unused variable 'tag' [-Wunused-variable]
encrypt.c: 359 | unsigned char tag[16];
encrypt.c: | ^~~
encrypt.c: encrypt.c:357:24: warning: unused variable 'j' [-Wunused-variable]
encrypt.c: 357 | unsigned long long i, j;
encrypt.c: | ^
try.c: /usr/bin/ld: libcrypto_aead_morus1280128v2.a(encrypt.o): in function `crypto_aead_morus1280128v2_avx2_timingleaks_encrypt':
try.c: .../supercop-data/panther/amd64/try/c/gcc_-march=native_-mtune=native_-Os_-fwrapv_-fPIC_-fPIE_-gdwarf-4_-Wall/timingleaks/crypto_aead/morus1280128v2/avx2/work/encrypt.c:320: undefined reference to `morus_enc_aut_step'
try.c: /usr/bin/ld: .../supercop-data/panther/amd64/try/c/gcc_-march=native_-mtune=native_-Os_-fwrapv_-fPIC_-fPIE_-gdwarf-4_-Wall/timingleaks/crypto_aead/morus1280128v2/avx2/work/encrypt.c:332: undefined reference to `morus_enc_aut_step'
try.c: /usr/bin/ld: libcrypto_aead_morus1280128v2.a(encrypt.o): in function `crypto_aead_morus1280128v2_avx2_timingleaks_decrypt':
try.c: .../supercop-data/panther/amd64/try/c/gcc_-march=native_-mtune=native_-Os_-fwrapv_-fPIC_-fPIE_-gdwarf-4_-Wall/timingleaks/crypto_aead/morus1280128v2/avx2/work/encrypt.c:367: undefined reference to `morus_enc_aut_step'
try.c: /usr/bin/ld: .../supercop-data/panther/amd64/try/c/gcc_-march=native_-mtune=native_-Os_-fwrapv_-fPIC_-fPIE_-gdwarf-4_-Wall/timingleaks/crypto_aead/morus1280128v2/avx2/work/encrypt.c:379: undefined reference to `morus_dec_aut_step'
try.c: collect2: error: ld returned 1 exit status
Number of similar (implementation,compiler) pairs: 1, namely:
Implementation | Compiler |
T:avx2 | gcc -march=native -mtune=native -Os -fwrapv -fPIC -fPIE -gdwarf-4 -Wall (10.2.1_20210110) |
Compiler output
encrypt.c: encrypt.c:370:10: warning: unused variable 'check' [-Wunused-variable]
encrypt.c: uint8_t check = 0;
encrypt.c: ^
encrypt.c: 1 warning generated.
Number of similar (implementation,compiler) pairs: 5, namely:
Implementation | Compiler |
T:ref | clang -march=native -O2 -fwrapv -Qunused-arguments -fPIC -fPIE -gdwarf-4 -Wall (Debian_Clang_11.0.1) |
T:ref | clang -march=native -O3 -fwrapv -Qunused-arguments -fPIC -fPIE -gdwarf-4 -Wall (Debian_Clang_11.0.1) |
T:ref | clang -march=native -O -fwrapv -Qunused-arguments -fPIC -fPIE -gdwarf-4 -Wall (Debian_Clang_11.0.1) |
T:ref | clang -march=native -Os -fwrapv -Qunused-arguments -fPIC -fPIE -gdwarf-4 -Wall (Debian_Clang_11.0.1) |
T:ref | clang -mcpu=native -O3 -fwrapv -Qunused-arguments -fPIC -fPIE -gdwarf-4 -Wall (Debian_Clang_11.0.1) |
Compiler output
encrypt.c: encrypt.c: In function 'crypto_aead_morus1280128v2_ref_timingleaks_decrypt':
encrypt.c: encrypt.c:370:10: warning: unused variable 'check' [-Wunused-variable]
encrypt.c: 370 | uint8_t check = 0;
encrypt.c: | ^~~~~
Number of similar (implementation,compiler) pairs: 4, namely:
Implementation | Compiler |
T:ref | gcc -march=native -mtune=native -O2 -fwrapv -fPIC -fPIE -gdwarf-4 -Wall (10.2.1_20210110) |
T:ref | gcc -march=native -mtune=native -O3 -fwrapv -fPIC -fPIE -gdwarf-4 -Wall (10.2.1_20210110) |
T:ref | gcc -march=native -mtune=native -O -fwrapv -fPIC -fPIE -gdwarf-4 -Wall (10.2.1_20210110) |
T:ref | gcc -march=native -mtune=native -Os -fwrapv -fPIC -fPIE -gdwarf-4 -Wall (10.2.1_20210110) |
Compiler output
encrypt.c: encrypt.c:318:10: warning: unused variable 'check' [-Wunused-variable]
encrypt.c: uint8_t check = 0;
encrypt.c: ^
encrypt.c: 1 warning generated.
Number of similar (implementation,compiler) pairs: 5, namely:
Implementation | Compiler |
T:ref64 | clang -march=native -O2 -fwrapv -Qunused-arguments -fPIC -fPIE -gdwarf-4 -Wall (Debian_Clang_11.0.1) |
T:ref64 | clang -march=native -O3 -fwrapv -Qunused-arguments -fPIC -fPIE -gdwarf-4 -Wall (Debian_Clang_11.0.1) |
T:ref64 | clang -march=native -O -fwrapv -Qunused-arguments -fPIC -fPIE -gdwarf-4 -Wall (Debian_Clang_11.0.1) |
T:ref64 | clang -march=native -Os -fwrapv -Qunused-arguments -fPIC -fPIE -gdwarf-4 -Wall (Debian_Clang_11.0.1) |
T:ref64 | clang -mcpu=native -O3 -fwrapv -Qunused-arguments -fPIC -fPIE -gdwarf-4 -Wall (Debian_Clang_11.0.1) |
Compiler output
encrypt.c: encrypt.c: In function 'crypto_aead_morus1280128v2_ref64_timingleaks_decrypt':
encrypt.c: encrypt.c:318:10: warning: unused variable 'check' [-Wunused-variable]
encrypt.c: 318 | uint8_t check = 0;
encrypt.c: | ^~~~~
Number of similar (implementation,compiler) pairs: 4, namely:
Implementation | Compiler |
T:ref64 | gcc -march=native -mtune=native -O2 -fwrapv -fPIC -fPIE -gdwarf-4 -Wall (10.2.1_20210110) |
T:ref64 | gcc -march=native -mtune=native -O3 -fwrapv -fPIC -fPIE -gdwarf-4 -Wall (10.2.1_20210110) |
T:ref64 | gcc -march=native -mtune=native -O -fwrapv -fPIC -fPIE -gdwarf-4 -Wall (10.2.1_20210110) |
T:ref64 | gcc -march=native -mtune=native -Os -fwrapv -fPIC -fPIE -gdwarf-4 -Wall (10.2.1_20210110) |
Compiler output
encrypt.c: encrypt.c:366:10: warning: unused variable 'check' [-Wunused-variable]
encrypt.c: uint8_t check = 0;
encrypt.c: ^
encrypt.c: 1 warning generated.
Number of similar (implementation,compiler) pairs: 4, namely:
Implementation | Compiler |
T:sse2 | clang -march=native -O2 -fwrapv -Qunused-arguments -fPIC -fPIE -gdwarf-4 -Wall (Debian_Clang_11.0.1) |
T:sse2 | clang -march=native -O3 -fwrapv -Qunused-arguments -fPIC -fPIE -gdwarf-4 -Wall (Debian_Clang_11.0.1) |
T:sse2 | clang -march=native -Os -fwrapv -Qunused-arguments -fPIC -fPIE -gdwarf-4 -Wall (Debian_Clang_11.0.1) |
T:sse2 | clang -mcpu=native -O3 -fwrapv -Qunused-arguments -fPIC -fPIE -gdwarf-4 -Wall (Debian_Clang_11.0.1) |
Compiler output
encrypt.c: encrypt.c:366:10: warning: unused variable 'check' [-Wunused-variable]
encrypt.c: uint8_t check = 0;
encrypt.c: ^
encrypt.c: 1 warning generated.
try.c: /usr/bin/ld: libcrypto_aead_morus1280128v2.a(encrypt.o): in function `morus_initialization':
try.c: .../supercop-data/panther/amd64/try/c/clang_-march=native_-O_-fwrapv_-Qunused-arguments_-fPIC_-fPIE_-gdwarf-4_-Wall/timingleaks/crypto_aead/morus1280128v2/sse2/work/encrypt.c:98: undefined reference to `morus_stateupdate'
try.c: /usr/bin/ld: libcrypto_aead_morus1280128v2.a(encrypt.o): in function `morus_initialization_key_256':
try.c: .../supercop-data/panther/amd64/try/c/clang_-march=native_-O_-fwrapv_-Qunused-arguments_-fPIC_-fPIE_-gdwarf-4_-Wall/timingleaks/crypto_aead/morus1280128v2/sse2/work/encrypt.c:118: undefined reference to `morus_stateupdate'
try.c: /usr/bin/ld: libcrypto_aead_morus1280128v2.a(encrypt.o): in function `morus_tag_generation':
try.c: .../supercop-data/panther/amd64/try/c/clang_-march=native_-O_-fwrapv_-Qunused-arguments_-fPIC_-fPIE_-gdwarf-4_-Wall/timingleaks/crypto_aead/morus1280128v2/sse2/work/encrypt.c:141: undefined reference to `morus_stateupdate'
try.c: /usr/bin/ld: libcrypto_aead_morus1280128v2.a(encrypt.o): in function `morus_tag_verification':
try.c: .../supercop-data/panther/amd64/try/c/clang_-march=native_-O_-fwrapv_-Qunused-arguments_-fPIC_-fPIE_-gdwarf-4_-Wall/timingleaks/crypto_aead/morus1280128v2/sse2/work/encrypt.c:176: undefined reference to `morus_stateupdate'
try.c: /usr/bin/ld: libcrypto_aead_morus1280128v2.a(encrypt.o): in function `morus_enc_aut_partialblock':
try.c: .../supercop-data/panther/amd64/try/c/clang_-march=native_-O_-fwrapv_-Qunused-arguments_-fPIC_-fPIE_-gdwarf-4_-Wall/timingleaks/crypto_aead/morus1280128v2/sse2/work/encrypt.c:271: undefined reference to `morus_stateupdate'
try.c: /usr/bin/ld: libcrypto_aead_morus1280128v2.a(encrypt.o):.../supercop-data/panther/amd64/try/c/clang_-march=native_-O_-fwrapv_-Qunused-arguments_-fPIC_-fPIE_-gdwarf-4_-Wall/timingleaks/crypto_aead/morus1280128v2/sse2/work/encrypt.c:303: more undefined references to `morus_stateupdate' follow
try.c: /usr/bin/ld: libcrypto_aead_morus1280128v2.a(encrypt.o): in function `crypto_aead_morus1280128v2_sse2_timingleaks_encrypt':
try.c: .../supercop-data/panther/amd64/try/c/clang_-march=native_-O_-fwrapv_-Qunused-arguments_-fPIC_-fPIE_-gdwarf-4_-Wall/timingleaks/crypto_aead/morus1280128v2/sse2/work/encrypt.c:328: undefined reference to `morus_enc_aut_step'
try.c: /usr/bin/ld: .../supercop-data/panther/amd64/try/c/clang_-march=native_-O_-fwrapv_-Qunused-arguments_-fPIC_-fPIE_-gdwarf-4_-Wall/timingleaks/crypto_aead/morus1280128v2/sse2/work/encrypt.c:339: undefined reference to `morus_enc_aut_step'
try.c: /usr/bin/ld: libcrypto_aead_morus1280128v2.a(encrypt.o): in function `crypto_aead_morus1280128v2_sse2_timingleaks_decrypt':
try.c: .../supercop-data/panther/amd64/try/c/clang_-march=native_-O_-fwrapv_-Qunused-arguments_-fPIC_-fPIE_-gdwarf-4_-Wall/timingleaks/crypto_aead/morus1280128v2/sse2/work/encrypt.c:373: undefined reference to `morus_enc_aut_step'
try.c: /usr/bin/ld: .../supercop-data/panther/amd64/try/c/clang_-march=native_-O_-fwrapv_-Qunused-arguments_-fPIC_-fPIE_-gdwarf-4_-Wall/timingleaks/crypto_aead/morus1280128v2/sse2/work/encrypt.c:385: undefined reference to `morus_dec_aut_step'
try.c: clang: error: linker command failed with exit code 1 (use -v to see invocation)
Number of similar (implementation,compiler) pairs: 1, namely:
Implementation | Compiler |
T:sse2 | clang -march=native -O -fwrapv -Qunused-arguments -fPIC -fPIE -gdwarf-4 -Wall (Debian_Clang_11.0.1) |
Compiler output
encrypt.c: encrypt.c: In function 'crypto_aead_morus1280128v2_sse2_timingleaks_decrypt':
encrypt.c: encrypt.c:366:10: warning: unused variable 'check' [-Wunused-variable]
encrypt.c: 366 | uint8_t check = 0;
encrypt.c: | ^~~~~
try.c: /usr/bin/ld: libcrypto_aead_morus1280128v2.a(encrypt.o): in function `morus_initialization':
try.c: .../supercop-data/panther/amd64/try/c/gcc_-march=native_-mtune=native_-O2_-fwrapv_-fPIC_-fPIE_-gdwarf-4_-Wall/timingleaks/crypto_aead/morus1280128v2/sse2/work/encrypt.c:98: undefined reference to `morus_stateupdate'
try.c: /usr/bin/ld: libcrypto_aead_morus1280128v2.a(encrypt.o): in function `morus_initialization_key_256':
try.c: .../supercop-data/panther/amd64/try/c/gcc_-march=native_-mtune=native_-O2_-fwrapv_-fPIC_-fPIE_-gdwarf-4_-Wall/timingleaks/crypto_aead/morus1280128v2/sse2/work/encrypt.c:118: undefined reference to `morus_stateupdate'
try.c: /usr/bin/ld: libcrypto_aead_morus1280128v2.a(encrypt.o): in function `morus_tag_generation':
try.c: .../supercop-data/panther/amd64/try/c/gcc_-march=native_-mtune=native_-O2_-fwrapv_-fPIC_-fPIE_-gdwarf-4_-Wall/timingleaks/crypto_aead/morus1280128v2/sse2/work/encrypt.c:141: undefined reference to `morus_stateupdate'
try.c: /usr/bin/ld: libcrypto_aead_morus1280128v2.a(encrypt.o): in function `morus_tag_verification':
try.c: .../supercop-data/panther/amd64/try/c/gcc_-march=native_-mtune=native_-O2_-fwrapv_-fPIC_-fPIE_-gdwarf-4_-Wall/timingleaks/crypto_aead/morus1280128v2/sse2/work/encrypt.c:176: undefined reference to `morus_stateupdate'
try.c: /usr/bin/ld: libcrypto_aead_morus1280128v2.a(encrypt.o): in function `morus_enc_aut_partialblock':
try.c: .../supercop-data/panther/amd64/try/c/gcc_-march=native_-mtune=native_-O2_-fwrapv_-fPIC_-fPIE_-gdwarf-4_-Wall/timingleaks/crypto_aead/morus1280128v2/sse2/work/encrypt.c:271: undefined reference to `morus_stateupdate'
try.c: /usr/bin/ld: libcrypto_aead_morus1280128v2.a(encrypt.o):.../supercop-data/panther/amd64/try/c/gcc_-march=native_-mtune=native_-O2_-fwrapv_-fPIC_-fPIE_-gdwarf-4_-Wall/timingleaks/crypto_aead/morus1280128v2/sse2/work/encrypt.c:303: more undefined references to `morus_stateupdate' follow
try.c: collect2: error: ld returned 1 exit status
Number of similar (implementation,compiler) pairs: 1, namely:
Implementation | Compiler |
T:sse2 | gcc -march=native -mtune=native -O2 -fwrapv -fPIC -fPIE -gdwarf-4 -Wall (10.2.1_20210110) |
Compiler output
encrypt.c: encrypt.c: In function 'crypto_aead_morus1280128v2_sse2_timingleaks_decrypt':
encrypt.c: encrypt.c:366:10: warning: unused variable 'check' [-Wunused-variable]
encrypt.c: 366 | uint8_t check = 0;
encrypt.c: | ^~~~~
Number of similar (implementation,compiler) pairs: 1, namely:
Implementation | Compiler |
T:sse2 | gcc -march=native -mtune=native -O3 -fwrapv -fPIC -fPIE -gdwarf-4 -Wall (10.2.1_20210110) |
Compiler output
encrypt.c: encrypt.c: In function 'crypto_aead_morus1280128v2_sse2_timingleaks_decrypt':
encrypt.c: encrypt.c:366:10: warning: unused variable 'check' [-Wunused-variable]
encrypt.c: 366 | uint8_t check = 0;
encrypt.c: | ^~~~~
try.c: /usr/bin/ld: libcrypto_aead_morus1280128v2.a(encrypt.o): in function `morus_initialization':
try.c: .../supercop-data/panther/amd64/try/c/gcc_-march=native_-mtune=native_-O_-fwrapv_-fPIC_-fPIE_-gdwarf-4_-Wall/timingleaks/crypto_aead/morus1280128v2/sse2/work/encrypt.c:98: undefined reference to `morus_stateupdate'
try.c: /usr/bin/ld: libcrypto_aead_morus1280128v2.a(encrypt.o): in function `morus_initialization_key_256':
try.c: .../supercop-data/panther/amd64/try/c/gcc_-march=native_-mtune=native_-O_-fwrapv_-fPIC_-fPIE_-gdwarf-4_-Wall/timingleaks/crypto_aead/morus1280128v2/sse2/work/encrypt.c:118: undefined reference to `morus_stateupdate'
try.c: /usr/bin/ld: libcrypto_aead_morus1280128v2.a(encrypt.o): in function `morus_tag_generation':
try.c: .../supercop-data/panther/amd64/try/c/gcc_-march=native_-mtune=native_-O_-fwrapv_-fPIC_-fPIE_-gdwarf-4_-Wall/timingleaks/crypto_aead/morus1280128v2/sse2/work/encrypt.c:141: undefined reference to `morus_stateupdate'
try.c: /usr/bin/ld: libcrypto_aead_morus1280128v2.a(encrypt.o): in function `morus_tag_verification':
try.c: .../supercop-data/panther/amd64/try/c/gcc_-march=native_-mtune=native_-O_-fwrapv_-fPIC_-fPIE_-gdwarf-4_-Wall/timingleaks/crypto_aead/morus1280128v2/sse2/work/encrypt.c:176: undefined reference to `morus_stateupdate'
try.c: /usr/bin/ld: libcrypto_aead_morus1280128v2.a(encrypt.o): in function `morus_enc_aut_partialblock':
try.c: .../supercop-data/panther/amd64/try/c/gcc_-march=native_-mtune=native_-O_-fwrapv_-fPIC_-fPIE_-gdwarf-4_-Wall/timingleaks/crypto_aead/morus1280128v2/sse2/work/encrypt.c:271: undefined reference to `morus_stateupdate'
try.c: /usr/bin/ld: libcrypto_aead_morus1280128v2.a(encrypt.o):.../supercop-data/panther/amd64/try/c/gcc_-march=native_-mtune=native_-O_-fwrapv_-fPIC_-fPIE_-gdwarf-4_-Wall/timingleaks/crypto_aead/morus1280128v2/sse2/work/encrypt.c:303: more undefined references to `morus_stateupdate' follow
try.c: collect2: error: ld returned 1 exit status
Number of similar (implementation,compiler) pairs: 1, namely:
Implementation | Compiler |
T:sse2 | gcc -march=native -mtune=native -O -fwrapv -fPIC -fPIE -gdwarf-4 -Wall (10.2.1_20210110) |
Compiler output
encrypt.c: encrypt.c: In function 'crypto_aead_morus1280128v2_sse2_timingleaks_decrypt':
encrypt.c: encrypt.c:366:10: warning: unused variable 'check' [-Wunused-variable]
encrypt.c: 366 | uint8_t check = 0;
encrypt.c: | ^~~~~
try.c: /usr/bin/ld: libcrypto_aead_morus1280128v2.a(encrypt.o): in function `morus_initialization':
try.c: .../supercop-data/panther/amd64/try/c/gcc_-march=native_-mtune=native_-Os_-fwrapv_-fPIC_-fPIE_-gdwarf-4_-Wall/timingleaks/crypto_aead/morus1280128v2/sse2/work/encrypt.c:98: undefined reference to `morus_stateupdate'
try.c: /usr/bin/ld: libcrypto_aead_morus1280128v2.a(encrypt.o): in function `morus_initialization_key_256':
try.c: .../supercop-data/panther/amd64/try/c/gcc_-march=native_-mtune=native_-Os_-fwrapv_-fPIC_-fPIE_-gdwarf-4_-Wall/timingleaks/crypto_aead/morus1280128v2/sse2/work/encrypt.c:118: undefined reference to `morus_stateupdate'
try.c: /usr/bin/ld: libcrypto_aead_morus1280128v2.a(encrypt.o): in function `morus_tag_generation':
try.c: .../supercop-data/panther/amd64/try/c/gcc_-march=native_-mtune=native_-Os_-fwrapv_-fPIC_-fPIE_-gdwarf-4_-Wall/timingleaks/crypto_aead/morus1280128v2/sse2/work/encrypt.c:141: undefined reference to `morus_stateupdate'
try.c: /usr/bin/ld: libcrypto_aead_morus1280128v2.a(encrypt.o): in function `morus_tag_verification':
try.c: .../supercop-data/panther/amd64/try/c/gcc_-march=native_-mtune=native_-Os_-fwrapv_-fPIC_-fPIE_-gdwarf-4_-Wall/timingleaks/crypto_aead/morus1280128v2/sse2/work/encrypt.c:176: undefined reference to `morus_stateupdate'
try.c: /usr/bin/ld: libcrypto_aead_morus1280128v2.a(encrypt.o): in function `morus_enc_aut_partialblock':
try.c: .../supercop-data/panther/amd64/try/c/gcc_-march=native_-mtune=native_-Os_-fwrapv_-fPIC_-fPIE_-gdwarf-4_-Wall/timingleaks/crypto_aead/morus1280128v2/sse2/work/encrypt.c:271: undefined reference to `morus_stateupdate'
try.c: /usr/bin/ld: libcrypto_aead_morus1280128v2.a(encrypt.o):.../supercop-data/panther/amd64/try/c/gcc_-march=native_-mtune=native_-Os_-fwrapv_-fPIC_-fPIE_-gdwarf-4_-Wall/timingleaks/crypto_aead/morus1280128v2/sse2/work/encrypt.c:303: more undefined references to `morus_stateupdate' follow
try.c: /usr/bin/ld: libcrypto_aead_morus1280128v2.a(encrypt.o): in function `crypto_aead_morus1280128v2_sse2_timingleaks_encrypt':
try.c: .../supercop-data/panther/amd64/try/c/gcc_-march=native_-mtune=native_-Os_-fwrapv_-fPIC_-fPIE_-gdwarf-4_-Wall/timingleaks/crypto_aead/morus1280128v2/sse2/work/encrypt.c:328: undefined reference to `morus_enc_aut_step'
try.c: /usr/bin/ld: .../supercop-data/panther/amd64/try/c/gcc_-march=native_-mtune=native_-Os_-fwrapv_-fPIC_-fPIE_-gdwarf-4_-Wall/timingleaks/crypto_aead/morus1280128v2/sse2/work/encrypt.c:339: undefined reference to `morus_enc_aut_step'
try.c: /usr/bin/ld: libcrypto_aead_morus1280128v2.a(encrypt.o): in function `crypto_aead_morus1280128v2_sse2_timingleaks_decrypt':
try.c: .../supercop-data/panther/amd64/try/c/gcc_-march=native_-mtune=native_-Os_-fwrapv_-fPIC_-fPIE_-gdwarf-4_-Wall/timingleaks/crypto_aead/morus1280128v2/sse2/work/encrypt.c:373: undefined reference to `morus_enc_aut_step'
try.c: /usr/bin/ld: .../supercop-data/panther/amd64/try/c/gcc_-march=native_-mtune=native_-Os_-fwrapv_-fPIC_-fPIE_-gdwarf-4_-Wall/timingleaks/crypto_aead/morus1280128v2/sse2/work/encrypt.c:385: undefined reference to `morus_dec_aut_step'
try.c: collect2: error: ld returned 1 exit status
Number of similar (implementation,compiler) pairs: 1, namely:
Implementation | Compiler |
T:sse2 | gcc -march=native -mtune=native -Os -fwrapv -fPIC -fPIE -gdwarf-4 -Wall (10.2.1_20210110) |
Namespace violations
encrypt.o morus_dec_aut_partialblock T
encrypt.o morus_enc_aut_partialblock T
encrypt.o morus_initialization T
encrypt.o morus_stateupdate T
encrypt.o morus_tag_generation T
encrypt.o morus_tag_verification T
Number of similar (implementation,compiler) pairs: 6, namely:
Implementation | Compiler |
T:avx2 | clang -march=native -O2 -fwrapv -Qunused-arguments -fPIC -fPIE -gdwarf-4 -Wall (Debian_Clang_11.0.1) |
T:avx2 | clang -march=native -O3 -fwrapv -Qunused-arguments -fPIC -fPIE -gdwarf-4 -Wall (Debian_Clang_11.0.1) |
T:avx2 | clang -march=native -Os -fwrapv -Qunused-arguments -fPIC -fPIE -gdwarf-4 -Wall (Debian_Clang_11.0.1) |
T:avx2 | gcc -march=native -mtune=native -O2 -fwrapv -fPIC -fPIE -gdwarf-4 -Wall (10.2.1_20210110) |
T:avx2 | gcc -march=native -mtune=native -O3 -fwrapv -fPIC -fPIE -gdwarf-4 -Wall (10.2.1_20210110) |
T:avx2 | gcc -march=native -mtune=native -O -fwrapv -fPIC -fPIE -gdwarf-4 -Wall (10.2.1_20210110) |
Namespace violations
encrypt.o morus_dec_aut_partialblock T
encrypt.o morus_dec_aut_step T
encrypt.o morus_enc_aut_partialblock T
encrypt.o morus_enc_aut_step T
encrypt.o morus_initialization T
encrypt.o morus_stateupdate T
encrypt.o morus_tag_generation T
encrypt.o morus_tag_verification T
Number of similar (implementation,compiler) pairs: 18, namely:
Implementation | Compiler |
T:ref | clang -march=native -O2 -fwrapv -Qunused-arguments -fPIC -fPIE -gdwarf-4 -Wall (Debian_Clang_11.0.1) |
T:ref | clang -march=native -O3 -fwrapv -Qunused-arguments -fPIC -fPIE -gdwarf-4 -Wall (Debian_Clang_11.0.1) |
T:ref | clang -march=native -O -fwrapv -Qunused-arguments -fPIC -fPIE -gdwarf-4 -Wall (Debian_Clang_11.0.1) |
T:ref | clang -march=native -Os -fwrapv -Qunused-arguments -fPIC -fPIE -gdwarf-4 -Wall (Debian_Clang_11.0.1) |
T:ref | clang -mcpu=native -O3 -fwrapv -Qunused-arguments -fPIC -fPIE -gdwarf-4 -Wall (Debian_Clang_11.0.1) |
T:ref | gcc -march=native -mtune=native -O2 -fwrapv -fPIC -fPIE -gdwarf-4 -Wall (10.2.1_20210110) |
T:ref | gcc -march=native -mtune=native -O3 -fwrapv -fPIC -fPIE -gdwarf-4 -Wall (10.2.1_20210110) |
T:ref | gcc -march=native -mtune=native -O -fwrapv -fPIC -fPIE -gdwarf-4 -Wall (10.2.1_20210110) |
T:ref | gcc -march=native -mtune=native -Os -fwrapv -fPIC -fPIE -gdwarf-4 -Wall (10.2.1_20210110) |
T:ref64 | clang -march=native -O2 -fwrapv -Qunused-arguments -fPIC -fPIE -gdwarf-4 -Wall (Debian_Clang_11.0.1) |
T:ref64 | clang -march=native -O3 -fwrapv -Qunused-arguments -fPIC -fPIE -gdwarf-4 -Wall (Debian_Clang_11.0.1) |
T:ref64 | clang -march=native -O -fwrapv -Qunused-arguments -fPIC -fPIE -gdwarf-4 -Wall (Debian_Clang_11.0.1) |
T:ref64 | clang -march=native -Os -fwrapv -Qunused-arguments -fPIC -fPIE -gdwarf-4 -Wall (Debian_Clang_11.0.1) |
T:ref64 | clang -mcpu=native -O3 -fwrapv -Qunused-arguments -fPIC -fPIE -gdwarf-4 -Wall (Debian_Clang_11.0.1) |
T:ref64 | gcc -march=native -mtune=native -O2 -fwrapv -fPIC -fPIE -gdwarf-4 -Wall (10.2.1_20210110) |
T:ref64 | gcc -march=native -mtune=native -O3 -fwrapv -fPIC -fPIE -gdwarf-4 -Wall (10.2.1_20210110) |
T:ref64 | gcc -march=native -mtune=native -O -fwrapv -fPIC -fPIE -gdwarf-4 -Wall (10.2.1_20210110) |
T:ref64 | gcc -march=native -mtune=native -Os -fwrapv -fPIC -fPIE -gdwarf-4 -Wall (10.2.1_20210110) |
Namespace violations
encrypt.o morus_dec_aut_partialblock T
encrypt.o morus_enc_aut_partialblock T
encrypt.o morus_initialization T
encrypt.o morus_initialization_key_256 T
encrypt.o morus_tag_generation T
encrypt.o morus_tag_verification T
Number of similar (implementation,compiler) pairs: 5, namely:
Implementation | Compiler |
T:sse2 | clang -march=native -O2 -fwrapv -Qunused-arguments -fPIC -fPIE -gdwarf-4 -Wall (Debian_Clang_11.0.1) |
T:sse2 | clang -march=native -O3 -fwrapv -Qunused-arguments -fPIC -fPIE -gdwarf-4 -Wall (Debian_Clang_11.0.1) |
T:sse2 | clang -march=native -Os -fwrapv -Qunused-arguments -fPIC -fPIE -gdwarf-4 -Wall (Debian_Clang_11.0.1) |
T:sse2 | clang -mcpu=native -O3 -fwrapv -Qunused-arguments -fPIC -fPIE -gdwarf-4 -Wall (Debian_Clang_11.0.1) |
T:sse2 | gcc -march=native -mtune=native -O3 -fwrapv -fPIC -fPIE -gdwarf-4 -Wall (10.2.1_20210110) |