Test results for amd64, know, crypto_kem/titaniumccalite
[Page version: 20250322 15:59:23]
Measurements for amd64, know, crypto_kem
Test results for amd64, know, crypto_kem
Test results for crypto_kem/titaniumccalite
Computer: know
Microarchitecture: amd64; Comet Lake (806ec)
Architecture: amd64
CPU ID: GenuineIntel-000806ec-bfebfbff
SUPERCOP version: 20250307
Operation: crypto_kem
Primitive: titaniumccalite
Time | Object size | Test size | Implementation | Compiler | Benchmark date | SUPERCOP version |
1990997 | 121647 0 36 | 247097 860 1856 | T:avx2 | clang -march=native -O3 -fwrapv -Qunused-arguments -fPIC -fPIE -gdwarf-4 -Wall | 20250320 | 20250307 |
2016323 | 69074 0 36 | 190313 860 1760 | T:avx2 | clang -march=native -O -fwrapv -Qunused-arguments -fPIC -fPIE -gdwarf-4 -Wall | 20250320 | 20250307 |
2017927 | 71044 0 36 | 196257 860 1760 | T:avx2 | clang -march=native -O2 -fwrapv -Qunused-arguments -fPIC -fPIE -gdwarf-4 -Wall | 20250320 | 20250307 |
2036141 | 65318 0 36 | 187647 852 1856 | T:avx2 | clang -march=native -Os -fwrapv -Qunused-arguments -fPIC -fPIE -gdwarf-4 -Wall | 20250320 | 20250307 |
2120291 | 71171 0 64 | 195364 788 1824 | T:avx2 | gcc -march=native -mtune=native -O3 -fwrapv -fPIC -fPIE -gdwarf-4 -Wall | 20250320 | 20250307 |
2158288 | 70734 0 64 | 193100 788 1824 | T:avx2 | gcc -march=native -mtune=native -O2 -fwrapv -fPIC -fPIE -gdwarf-4 -Wall | 20250320 | 20250307 |
2273426 | 69668 0 64 | 191516 788 1824 | T:avx2 | gcc -march=native -mtune=native -O -fwrapv -fPIC -fPIE -gdwarf-4 -Wall | 20250320 | 20250307 |
2618299 | 104891 0 36 | 229537 860 1856 | T:opt | clang -march=native -O3 -fwrapv -Qunused-arguments -fPIC -fPIE -gdwarf-4 -Wall | 20250320 | 20250307 |
2693473 | 82815 0 36 | 207201 860 1760 | T:opt | clang -march=native -O2 -fwrapv -Qunused-arguments -fPIC -fPIE -gdwarf-4 -Wall | 20250320 | 20250307 |
2914420 | 55805 0 36 | 179953 860 1760 | T:opt | clang -mcpu=native -O3 -fwrapv -Qunused-arguments -fPIC -fPIE -gdwarf-4 -Wall | 20250320 | 20250307 |
2927195 | 37747 0 36 | 160279 852 1856 | T:opt | clang -march=native -Os -fwrapv -Qunused-arguments -fPIC -fPIE -gdwarf-4 -Wall | 20250320 | 20250307 |
2981316 | 37608 0 36 | 159473 860 1760 | T:opt | clang -march=native -O -fwrapv -Qunused-arguments -fPIC -fPIE -gdwarf-4 -Wall | 20250320 | 20250307 |
3150493 | 43455 0 64 | 165908 788 1824 | T:opt | gcc -march=native -mtune=native -O2 -fwrapv -fPIC -fPIE -gdwarf-4 -Wall | 20250320 | 20250307 |
3162807 | 68475 0 64 | 192556 788 1824 | T:opt | gcc -march=native -mtune=native -O3 -fwrapv -fPIC -fPIE -gdwarf-4 -Wall | 20250320 | 20250307 |
3469901 | 39526 0 64 | 161444 788 1824 | T:opt | gcc -march=native -mtune=native -O -fwrapv -fPIC -fPIE -gdwarf-4 -Wall | 20250320 | 20250307 |
286293166 | 47959 0 36 | 173257 860 1760 | T:ref | clang -march=native -O2 -fwrapv -Qunused-arguments -fPIC -fPIE -gdwarf-4 -Wall | 20250320 | 20250307 |
288338275 | 87659 0 36 | 213257 860 1856 | T:ref | clang -march=native -O3 -fwrapv -Qunused-arguments -fPIC -fPIE -gdwarf-4 -Wall | 20250320 | 20250307 |
296557730 | 56247 0 36 | 180385 860 1760 | T:ref | clang -mcpu=native -O3 -fwrapv -Qunused-arguments -fPIC -fPIE -gdwarf-4 -Wall | 20250320 | 20250307 |
297772495 | 49878 0 64 | 174092 788 1824 | T:ref | gcc -march=native -mtune=native -O3 -fwrapv -fPIC -fPIE -gdwarf-4 -Wall | 20250320 | 20250307 |
301882438 | 30025 0 64 | 152340 788 1824 | T:ref | gcc -march=native -mtune=native -O2 -fwrapv -fPIC -fPIE -gdwarf-4 -Wall | 20250320 | 20250307 |
321422032 | 30039 0 36 | 151857 860 1760 | T:ref | clang -march=native -O -fwrapv -Qunused-arguments -fPIC -fPIE -gdwarf-4 -Wall | 20250320 | 20250307 |
327899963 | 29869 0 36 | 152367 852 1856 | T:ref | clang -march=native -Os -fwrapv -Qunused-arguments -fPIC -fPIE -gdwarf-4 -Wall | 20250320 | 20250307 |
349939742 | 29624 0 64 | 151436 788 1824 | T:ref | gcc -march=native -mtune=native -O -fwrapv -fPIC -fPIE -gdwarf-4 -Wall | 20250320 | 20250307 |
1114058403 | 28193 0 64 | 148828 780 1792 | T:ref | gcc -march=native -mtune=native -Os -fwrapv -fPIC -fPIE -gdwarf-4 -Wall | 20250320 | 20250307 |
Compiler output
encrypt.c: encrypt.c:64:8: error: always_inline function '_mm256_loadu_si256' requires target feature 'avx', but would be inlined into function 'crypto_encrypt_keypair' that is compiled without support for 'avx'
encrypt.c: u = _mm256_loadu_si256((__m256i *)(a[i] + j));
encrypt.c: ^
encrypt.c: encrypt.c:64:8: error: AVX vector return of type '__m256i' (vector of 4 'long long' values) without 'avx' enabled changes the ABI
encrypt.c: encrypt.c:65:8: error: always_inline function '_mm256_loadu_si256' requires target feature 'avx', but would be inlined into function 'crypto_encrypt_keypair' that is compiled without support for 'avx'
encrypt.c: v = _mm256_loadu_si256((__m256i *)(s + j));
encrypt.c: ^
encrypt.c: encrypt.c:65:8: error: AVX vector return of type '__m256i' (vector of 4 'long long' values) without 'avx' enabled changes the ABI
encrypt.c: encrypt.c:66:8: error: always_inline function '_mm256_mul_epu32' requires target feature 'avx2', but would be inlined into function 'crypto_encrypt_keypair' that is compiled without support for 'avx2'
encrypt.c: t = _mm256_mul_epu32(u, v);
encrypt.c: ^
encrypt.c: encrypt.c:66:8: error: AVX vector argument of type '__m256i' (vector of 4 'long long' values) without 'avx' enabled changes the ABI
encrypt.c: encrypt.c:67:4: error: always_inline function '_mm256_storeu_si256' requires target feature 'avx', but would be inlined into function 'crypto_encrypt_keypair' that is compiled without support for 'avx'
encrypt.c: _mm256_storeu_si256((__m256i *)(a[i] + j), t);
encrypt.c: ^
encrypt.c: encrypt.c:67:4: error: AVX vector argument of type '__m256i' (vector of 4 'long long' values) without 'avx' enabled changes the ABI
encrypt.c: encrypt.c:79:8: error: always_inline function '_mm256_loadu_si256' requires target feature 'avx', but would be inlined into function 'crypto_encrypt_keypair' that is compiled without support for 'avx'
encrypt.c: u = _mm256_loadu_si256((__m256i *)(a[i] + j));
encrypt.c: ^
encrypt.c: encrypt.c:79:8: error: AVX vector return of type '__m256i' (vector of 4 'long long' values) without 'avx' enabled changes the ABI
encrypt.c: encrypt.c:80:8: error: always_inline function '_mm256_loadu_si256' requires target feature 'avx', but would be inlined into function 'crypto_encrypt_keypair' that is compiled without support for 'avx'
encrypt.c: v = _mm256_loadu_si256((__m256i *)(e[i] + j));
encrypt.c: ^
encrypt.c: encrypt.c:80:8: error: AVX vector return of type '__m256i' (vector of 4 'long long' values) without 'avx' enabled changes the ABI
encrypt.c: encrypt.c:81:8: error: always_inline function '_mm256_add_epi64' requires target feature 'avx2', but would be inlined into function 'crypto_encrypt_keypair' that is compiled without support for 'avx2'
encrypt.c: ...
Number of similar (implementation,compiler) pairs: 1, namely:
Implementation | Compiler |
T:avx2 | clang -mcpu=native -O3 -fwrapv -Qunused-arguments -fPIC -fPIE -gdwarf-4 -Wall (Debian_Clang_14.0.6) |
Compiler output
try.c: /usr/bin/ld: libcrypto_kem_titaniumccalite.a(sampler.o): in function `sampler_zq':
try.c: .../supercop-data/know/amd64/try/c/gcc_-march=native_-mtune=native_-Os_-fwrapv_-fPIC_-fPIE_-gdwarf-4_-Wall/timingleaks/crypto_kem/titaniumccalite/avx2/work/sampler.c:160: undefined reference to `barrett_zq'
try.c: collect2: error: ld returned 1 exit status
Number of similar (implementation,compiler) pairs: 1, namely:
Implementation | Compiler |
T:avx2 | gcc -march=native -mtune=native -Os -fwrapv -fPIC -fPIE -gdwarf-4 -Wall (12.2.0) |
Compiler output
try.c: /usr/bin/ld: libcrypto_kem_titaniumccalite.a(encrypt.o): in function `crypto_encrypt_keypair':
try.c: .../supercop-data/know/amd64/try/c/gcc_-march=native_-mtune=native_-Os_-fwrapv_-fPIC_-fPIE_-gdwarf-4_-Wall/timingleaks/crypto_kem/titaniumccalite/opt/work/encrypt.c:56: undefined reference to `barrett_4q2'
try.c: /usr/bin/ld: .../supercop-data/know/amd64/try/c/gcc_-march=native_-mtune=native_-Os_-fwrapv_-fPIC_-fPIE_-gdwarf-4_-Wall/timingleaks/crypto_kem/titaniumccalite/opt/work/encrypt.c:64: undefined reference to `barrett_4q'
try.c: /usr/bin/ld: libcrypto_kem_titaniumccalite.a(encrypt.o): in function `crypto_encrypt':
try.c: .../supercop-data/know/amd64/try/c/gcc_-march=native_-mtune=native_-Os_-fwrapv_-fPIC_-fPIE_-gdwarf-4_-Wall/timingleaks/crypto_kem/titaniumccalite/opt/work/encrypt.c:146: undefined reference to `barrett_4q2'
try.c: /usr/bin/ld: .../supercop-data/know/amd64/try/c/gcc_-march=native_-mtune=native_-Os_-fwrapv_-fPIC_-fPIE_-gdwarf-4_-Wall/timingleaks/crypto_kem/titaniumccalite/opt/work/encrypt.c:156: undefined reference to `barrett_4q2'
try.c: /usr/bin/ld: libcrypto_kem_titaniumccalite.a(encrypt.o): in function `crypto_encrypt_open':
try.c: .../supercop-data/know/amd64/try/c/gcc_-march=native_-mtune=native_-Os_-fwrapv_-fPIC_-fPIE_-gdwarf-4_-Wall/timingleaks/crypto_kem/titaniumccalite/opt/work/encrypt.c:200: undefined reference to `barrett_4q2'
try.c: /usr/bin/ld: libcrypto_kem_titaniumccalite.a(ntt.o): in function `ntt_butterfly_1024_1536':
try.c: .../supercop-data/know/amd64/try/c/gcc_-march=native_-mtune=native_-Os_-fwrapv_-fPIC_-fPIE_-gdwarf-4_-Wall/timingleaks/crypto_kem/titaniumccalite/opt/work/ntt.c:342: undefined reference to `barrett_8q'
try.c: /usr/bin/ld: libcrypto_kem_titaniumccalite.a(ntt.o): in function `ntt_butterfly_1536_768':
try.c: .../supercop-data/know/amd64/try/c/gcc_-march=native_-mtune=native_-Os_-fwrapv_-fPIC_-fPIE_-gdwarf-4_-Wall/timingleaks/crypto_kem/titaniumccalite/opt/work/ntt.c:362: undefined reference to `barrett_16q'
try.c: /usr/bin/ld: libcrypto_kem_titaniumccalite.a(ntt.o): in function `ntt_butterfly_512_1280':
try.c: .../supercop-data/know/amd64/try/c/gcc_-march=native_-mtune=native_-Os_-fwrapv_-fPIC_-fPIE_-gdwarf-4_-Wall/timingleaks/crypto_kem/titaniumccalite/opt/work/ntt.c:375: undefined reference to `barrett_4q'
try.c: /usr/bin/ld: libcrypto_kem_titaniumccalite.a(ntt.o): in function `ntt_butterfly_1024_1280':
try.c: .../supercop-data/know/amd64/try/c/gcc_-march=native_-mtune=native_-Os_-fwrapv_-fPIC_-fPIE_-gdwarf-4_-Wall/timingleaks/crypto_kem/titaniumccalite/opt/work/ntt.c:392: undefined reference to `barrett_8q'
try.c: /usr/bin/ld: libcrypto_kem_titaniumccalite.a(ntt.o): in function `ntt_butterfly_1280_1280_inv':
try.c: .../supercop-data/know/amd64/try/c/gcc_-march=native_-mtune=native_-Os_-fwrapv_-fPIC_-fPIE_-gdwarf-4_-Wall/timingleaks/crypto_kem/titaniumccalite/opt/work/ntt.c:410: undefined reference to `barrett_16q'
try.c: /usr/bin/ld: libcrypto_kem_titaniumccalite.a(ntt.o): in function `ntt_butterfly_768_768_inv':
try.c: .../supercop-data/know/amd64/try/c/gcc_-march=native_-mtune=native_-Os_-fwrapv_-fPIC_-fPIE_-gdwarf-4_-Wall/timingleaks/crypto_kem/titaniumccalite/opt/work/ntt.c:426: undefined reference to `barrett_8q'
try.c: /usr/bin/ld: libcrypto_kem_titaniumccalite.a(ntt.o): in function `ntt_butterfly_512_768':
try.c: .../supercop-data/know/amd64/try/c/gcc_-march=native_-mtune=native_-Os_-fwrapv_-fPIC_-fPIE_-gdwarf-4_-Wall/timingleaks/crypto_kem/titaniumccalite/opt/work/ntt.c:439: undefined reference to `barrett_4q'
try.c: /usr/bin/ld: libcrypto_kem_titaniumccalite.a(ntt.o): in function `ntt_butterfly_768_256':
try.c: .../supercop-data/know/amd64/try/c/gcc_-march=native_-mtune=native_-Os_-fwrapv_-fPIC_-fPIE_-gdwarf-4_-Wall/timingleaks/crypto_kem/titaniumccalite/opt/work/ntt.c:447: undefined reference to `barrett_8q'
try.c: /usr/bin/ld: libcrypto_kem_titaniumccalite.a(ntt.o): in function `ntt_butterfly_1280_1536':
try.c: ...
Number of similar (implementation,compiler) pairs: 1, namely:
Implementation | Compiler |
T:opt | gcc -march=native -mtune=native -Os -fwrapv -fPIC -fPIE -gdwarf-4 -Wall (12.2.0) |
Namespace violations
encrypt.o crypto_encrypt T
encrypt.o crypto_encrypt_keypair T
encrypt.o crypto_encrypt_open T
fastrandombytes.o fastrandombytes T
fastrandombytes.o fastrandombytes_setseed T
fastrandombytes.o iv B
fastrandombytes.o key B
ntt.o intt_1280_1280_inv T
ntt.o intt_1536_256 T
ntt.o intt_1536_768 T
ntt.o intt_768_256 T
ntt.o ntt_1024_1280 T
ntt.o ntt_1024_1536 T
ntt.o ntt_1280_1536 T
ntt.o ntt_512_1280 T
ntt.o ntt_512_768 T
ntt.o ntt_768_768_inv T
pack.o poly_decode T
pack.o poly_decode_c2 T
pack.o poly_encode T
pack.o poly_encode_c2 T
sampler.o sampler_binomial T
sampler.o sampler_zb T
sampler.o sampler_zq T
Number of similar (implementation,compiler) pairs: 15, namely:
Implementation | Compiler |
T:avx2 | clang -march=native -O2 -fwrapv -Qunused-arguments -fPIC -fPIE -gdwarf-4 -Wall (Debian_Clang_14.0.6) |
T:avx2 | clang -march=native -O3 -fwrapv -Qunused-arguments -fPIC -fPIE -gdwarf-4 -Wall (Debian_Clang_14.0.6) |
T:avx2 | clang -march=native -O -fwrapv -Qunused-arguments -fPIC -fPIE -gdwarf-4 -Wall (Debian_Clang_14.0.6) |
T:avx2 | clang -march=native -Os -fwrapv -Qunused-arguments -fPIC -fPIE -gdwarf-4 -Wall (Debian_Clang_14.0.6) |
T:avx2 | gcc -march=native -mtune=native -O2 -fwrapv -fPIC -fPIE -gdwarf-4 -Wall (12.2.0) |
T:avx2 | gcc -march=native -mtune=native -O3 -fwrapv -fPIC -fPIE -gdwarf-4 -Wall (12.2.0) |
T:avx2 | gcc -march=native -mtune=native -O -fwrapv -fPIC -fPIE -gdwarf-4 -Wall (12.2.0) |
T:opt | clang -march=native -O2 -fwrapv -Qunused-arguments -fPIC -fPIE -gdwarf-4 -Wall (Debian_Clang_14.0.6) |
T:opt | clang -march=native -O3 -fwrapv -Qunused-arguments -fPIC -fPIE -gdwarf-4 -Wall (Debian_Clang_14.0.6) |
T:opt | clang -march=native -O -fwrapv -Qunused-arguments -fPIC -fPIE -gdwarf-4 -Wall (Debian_Clang_14.0.6) |
T:opt | clang -march=native -Os -fwrapv -Qunused-arguments -fPIC -fPIE -gdwarf-4 -Wall (Debian_Clang_14.0.6) |
T:opt | clang -mcpu=native -O3 -fwrapv -Qunused-arguments -fPIC -fPIE -gdwarf-4 -Wall (Debian_Clang_14.0.6) |
T:opt | gcc -march=native -mtune=native -O2 -fwrapv -fPIC -fPIE -gdwarf-4 -Wall (12.2.0) |
T:opt | gcc -march=native -mtune=native -O3 -fwrapv -fPIC -fPIE -gdwarf-4 -Wall (12.2.0) |
T:opt | gcc -march=native -mtune=native -O -fwrapv -fPIC -fPIE -gdwarf-4 -Wall (12.2.0) |
Namespace violations
encrypt.o crypto_encrypt T
encrypt.o crypto_encrypt_keypair T
encrypt.o crypto_encrypt_open T
fastrandombytes.o fastrandombytes T
fastrandombytes.o fastrandombytes_setseed T
fastrandombytes.o iv B
fastrandombytes.o key B
ntt.o intt_1280_1280_inv T
ntt.o intt_1536_1536 T
ntt.o intt_768_768 T
ntt.o ntt_1280_1280 T
ntt.o ntt_768_768_inv T
pack.o poly_decode T
pack.o poly_decode_c2 T
pack.o poly_encode T
pack.o poly_encode_c2 T
product.o mp T
product.o product T
sampler.o sampler_binomial T
sampler.o sampler_zb T
sampler.o sampler_zq T
Number of similar (implementation,compiler) pairs: 9, namely:
Implementation | Compiler |
T:ref | clang -march=native -O2 -fwrapv -Qunused-arguments -fPIC -fPIE -gdwarf-4 -Wall (Debian_Clang_14.0.6) |
T:ref | clang -march=native -O3 -fwrapv -Qunused-arguments -fPIC -fPIE -gdwarf-4 -Wall (Debian_Clang_14.0.6) |
T:ref | clang -march=native -O -fwrapv -Qunused-arguments -fPIC -fPIE -gdwarf-4 -Wall (Debian_Clang_14.0.6) |
T:ref | clang -march=native -Os -fwrapv -Qunused-arguments -fPIC -fPIE -gdwarf-4 -Wall (Debian_Clang_14.0.6) |
T:ref | clang -mcpu=native -O3 -fwrapv -Qunused-arguments -fPIC -fPIE -gdwarf-4 -Wall (Debian_Clang_14.0.6) |
T:ref | gcc -march=native -mtune=native -O2 -fwrapv -fPIC -fPIE -gdwarf-4 -Wall (12.2.0) |
T:ref | gcc -march=native -mtune=native -O3 -fwrapv -fPIC -fPIE -gdwarf-4 -Wall (12.2.0) |
T:ref | gcc -march=native -mtune=native -O -fwrapv -fPIC -fPIE -gdwarf-4 -Wall (12.2.0) |
T:ref | gcc -march=native -mtune=native -Os -fwrapv -fPIC -fPIE -gdwarf-4 -Wall (12.2.0) |