Test results for amd64, jasper, crypto_hash/sha256
[Page version: 20241023 21:19:00]
Measurements for amd64, jasper, crypto_hash
Test results for amd64, jasper, crypto_hash
Test results for crypto_hash/sha256
Computer: jasper
Microarchitecture: amd64; Tremont (906c0)
Architecture: amd64
CPU ID: GenuineIntel-000906c0-20-bfebfbff
SUPERCOP version: 20241022
Operation: crypto_hash
Primitive: sha256
Time | Object size | Test size | Implementation | Compiler | Benchmark date | SUPERCOP version |
3523 | 70 0 0 | 14427 820 888 | openssl | clang -march=native -O3 -fwrapv -Qunused-arguments -fPIC -fPIE -gdwarf-4 -Wall | 20240718 | 20240716 |
3524 | 70 0 0 | 13043 820 888 | openssl | clang -mcpu=native -O3 -fwrapv -Qunused-arguments -fPIC -fPIE -gdwarf-4 -Wall | 20240718 | 20240716 |
3525 | 70 0 0 | 10289 812 888 | openssl | clang -march=native -Os -fwrapv -Qunused-arguments -fPIC -fPIE -gdwarf-4 -Wall | 20240718 | 20240716 |
3525 | 70 0 0 | 9795 780 920 | openssl | gcc -march=native -mtune=native -Os -fwrapv -fPIC -fPIE -gdwarf-4 -Wall | 20240718 | 20240716 |
3526 | 70 0 0 | 12123 820 888 | openssl | clang -march=native -O2 -fwrapv -Qunused-arguments -fPIC -fPIE -gdwarf-4 -Wall | 20240718 | 20240716 |
3526 | 78 0 0 | 12464 804 920 | openssl | gcc -march=native -mtune=native -O3 -fwrapv -fPIC -fPIE -gdwarf-4 -Wall | 20240718 | 20240716 |
3528 | 70 0 0 | 10801 812 888 | openssl | clang -march=native -O -fwrapv -Qunused-arguments -fPIC -fPIE -gdwarf-4 -Wall | 20240718 | 20240716 |
3529 | 81 0 0 | 10807 796 920 | openssl | gcc -march=native -mtune=native -O -fwrapv -fPIC -fPIE -gdwarf-4 -Wall | 20240718 | 20240716 |
3544 | 78 0 0 | 11248 804 920 | openssl | gcc -march=native -mtune=native -O2 -fwrapv -fPIC -fPIE -gdwarf-4 -Wall | 20240718 | 20240716 |
3613 | 752 0 0 | 14240 780 952 | ref | gcc -march=native -mtune=native -O3 -fwrapv -fPIC -fPIE -gdwarf-4 -Wall | 20240718 | 20240716 |
3623 | 582 0 0 | 11934 804 888 | ref | clang -march=native -Os -fwrapv -Qunused-arguments -fPIC -fPIE -gdwarf-4 -Wall | 20240718 | 20240716 |
3629 | 592 0 0 | 12446 804 888 | ref | clang -march=native -O -fwrapv -Qunused-arguments -fPIC -fPIE -gdwarf-4 -Wall | 20240718 | 20240716 |
3631 | 707 0 0 | 14800 812 888 | ref | clang -mcpu=native -O3 -fwrapv -Qunused-arguments -fPIC -fPIE -gdwarf-4 -Wall | 20240718 | 20240716 |
3632 | 697 0 0 | 13880 812 888 | ref | clang -march=native -O2 -fwrapv -Qunused-arguments -fPIC -fPIE -gdwarf-4 -Wall | 20240718 | 20240716 |
3635 | 697 0 0 | 16184 812 888 | ref | clang -march=native -O3 -fwrapv -Qunused-arguments -fPIC -fPIE -gdwarf-4 -Wall | 20240718 | 20240716 |
3658 | 769 0 0 | 13072 780 952 | ref | gcc -march=native -mtune=native -O2 -fwrapv -fPIC -fPIE -gdwarf-4 -Wall | 20240718 | 20240716 |
3779 | 566 0 0 | 12423 772 952 | ref | gcc -march=native -mtune=native -O -fwrapv -fPIC -fPIE -gdwarf-4 -Wall | 20240718 | 20240716 |
3788 | 377 0 0 | 11227 756 920 | ref | gcc -march=native -mtune=native -Os -fwrapv -fPIC -fPIE -gdwarf-4 -Wall | 20240718 | 20240716 |
3836 | 4660 928 0 | 1663338 144668 10360 | cryptopp | g++ -march=native -mtune=native -O -fwrapv -fPIC -fPIE -gdwarf-4 -Wall | 20240718 | 20240716 |
3839 | 4900 928 0 | 1664028 144668 10360 | cryptopp | g++ -march=native -mtune=native -O2 -fwrapv -fPIC -fPIE -gdwarf-4 -Wall | 20240718 | 20240716 |
3841 | 4638 768 0 | 1370735 144436 10264 | cryptopp | clang++ -march=native -Os -fwrapv -Qunused-arguments -fPIC -fPIE -gdwarf-4 -Wall | 20240718 | 20240716 |
3843 | 4801 992 0 | 1372322 144444 10264 | cryptopp | clang++ -march=native -O2 -fwrapv -Qunused-arguments -fPIC -fPIE -gdwarf-4 -Wall | 20240718 | 20240716 |
3844 | 3689 992 0 | 1661396 144668 10328 | cryptopp | g++ -march=native -mtune=native -Os -fwrapv -fPIC -fPIE -gdwarf-4 -Wall | 20240718 | 20240716 |
3847 | 4747 992 0 | 1374578 144444 10264 | cryptopp | clang++ -march=native -O3 -fwrapv -Qunused-arguments -fPIC -fPIE -gdwarf-4 -Wall | 20240718 | 20240716 |
3853 | 4809 704 0 | 1664334 144436 10360 | cryptopp | g++ -march=native -mtune=native -O3 -fwrapv -fPIC -fPIE -gdwarf-4 -Wall | 20240718 | 20240716 |
4017 | 8354 1576 0 | 1378076 145028 10264 | cryptopp | clang++ -march=native -O -fwrapv -Qunused-arguments -fPIC -fPIE -gdwarf-4 -Wall | 20240718 | 20240716 |
30103 | 21247 0 0 | 30923 756 920 | sphlib | gcc -march=native -mtune=native -Os -fwrapv -fPIC -fPIE -gdwarf-4 -Wall | 20240718 | 20240716 |
30236 | 20907 0 0 | 35216 812 888 | sphlib | clang -march=native -O3 -fwrapv -Qunused-arguments -fPIC -fPIE -gdwarf-4 -Wall | 20240718 | 20240716 |
30280 | 20907 0 0 | 32912 812 888 | sphlib | clang -march=native -O2 -fwrapv -Qunused-arguments -fPIC -fPIE -gdwarf-4 -Wall | 20240718 | 20240716 |
30287 | 20306 0 0 | 30494 804 888 | sphlib | clang -march=native -Os -fwrapv -Qunused-arguments -fPIC -fPIE -gdwarf-4 -Wall | 20240718 | 20240716 |
30458 | 10550 0 0 | 20235 756 920 | sphlib-small | gcc -march=native -mtune=native -Os -fwrapv -fPIC -fPIE -gdwarf-4 -Wall | 20240718 | 20240716 |
30714 | 12556 0 0 | 24888 780 952 | sphlib-small | gcc -march=native -mtune=native -O3 -fwrapv -fPIC -fPIE -gdwarf-4 -Wall | 20240718 | 20240716 |
30813 | 21266 0 0 | 34184 812 888 | sphlib | clang -mcpu=native -O3 -fwrapv -Qunused-arguments -fPIC -fPIE -gdwarf-4 -Wall | 20240718 | 20240716 |
31047 | 10903 0 0 | 21591 772 952 | sphlib-small | gcc -march=native -mtune=native -O -fwrapv -fPIC -fPIE -gdwarf-4 -Wall | 20240718 | 20240716 |
31423 | 24353 0 0 | 36680 780 952 | sphlib | gcc -march=native -mtune=native -O3 -fwrapv -fPIC -fPIE -gdwarf-4 -Wall | 20240718 | 20240716 |
31427 | 12334 0 0 | 26640 812 888 | sphlib-small | clang -march=native -O3 -fwrapv -Qunused-arguments -fPIC -fPIE -gdwarf-4 -Wall | 20240718 | 20240716 |
31437 | 23001 0 0 | 34144 780 952 | sphlib | gcc -march=native -mtune=native -O2 -fwrapv -fPIC -fPIE -gdwarf-4 -Wall | 20240718 | 20240716 |
31447 | 11710 0 0 | 21886 804 888 | sphlib-small | clang -march=native -Os -fwrapv -Qunused-arguments -fPIC -fPIE -gdwarf-4 -Wall | 20240718 | 20240716 |
31450 | 12334 0 0 | 24352 812 888 | sphlib-small | clang -march=native -O2 -fwrapv -Qunused-arguments -fPIC -fPIE -gdwarf-4 -Wall | 20240718 | 20240716 |
31779 | 12146 0 0 | 25064 812 888 | sphlib-small | clang -mcpu=native -O3 -fwrapv -Qunused-arguments -fPIC -fPIE -gdwarf-4 -Wall | 20240718 | 20240716 |
32138 | 22719 0 0 | 33407 772 952 | sphlib | gcc -march=native -mtune=native -O -fwrapv -fPIC -fPIE -gdwarf-4 -Wall | 20240718 | 20240716 |
32343 | 20853 0 0 | 31598 804 888 | sphlib | clang -march=native -O -fwrapv -Qunused-arguments -fPIC -fPIE -gdwarf-4 -Wall | 20240718 | 20240716 |
32372 | 12065 0 0 | 23216 780 952 | sphlib-small | gcc -march=native -mtune=native -O2 -fwrapv -fPIC -fPIE -gdwarf-4 -Wall | 20240718 | 20240716 |
34137 | 12453 0 0 | 23198 804 888 | sphlib-small | clang -march=native -O -fwrapv -Qunused-arguments -fPIC -fPIE -gdwarf-4 -Wall | 20240718 | 20240716 |
Compiler output
try.c: error: linking with `cc` failed: exit code: 1
try.c: |
try.c: = note: "cc" "-Wl,--as-needed" "-Wl,-z,noexecstack" "-m64" "-Wl,--eh-frame-hdr" "-L" "/usr/lib/rustlib/x86_64-unknown-linux-gnu/lib" ".../supercop-data/jasper/amd64/try/c/clang_-march=native_-O2_-fwrapv_-Qunused-arguments_-fPIC_-fPIE_-gdwarf-4_-Wall/constbranchindex/crypto_hash/sha256/rust_crypto/work/target/release/deps/try_small-f566cacc72890263.try_small.83ks8n5m-cgu.0.rcgu.o" ".../supercop-data/jasper/amd64/try/c/clang_-march=native_-O2_-fwrapv_-Qunused-arguments_-fPIC_-fPIE_-gdwarf-4_-Wall/constbranchindex/crypto_hash/sha256/rust_crypto/work/target/release/deps/try_small-f566cacc72890263.try_small.83ks8n5m-cgu.1.rcgu.o" ".../supercop-data/jasper/amd64/try/c/clang_-march=native_-O2_-fwrapv_-Qunused-arguments_-fPIC_-fPIE_-gdwarf-4_-Wall/constbranchindex/crypto_hash/sha256/rust_crypto/work/target/release/deps/try_small-f566cacc72890263.try_small.83ks8n5m-cgu.2.rcgu.o" ".../supercop-data/jasper/amd64/try/c/clang_-march=native_-O2_-fwrapv_-Qunused-arguments_-fPIC_-fPIE_-gdwarf-4_-Wall/constbranchindex/crypto_hash/sha256/rust_crypto/work/target/release/deps/try_small-f566cacc72890263.try_small.83ks8n5m-cgu.3.rcgu.o" ".../supercop-data/jasper/amd64/try/c/clang_-march=native_-O2_-fwrapv_-Qunused-arguments_-fPIC_-fPIE_-gdwarf-4_-Wall/constbranchindex/crypto_hash/sha256/rust_crypto/work/target/release/deps/try_small-f566cacc72890263.try_small.83ks8n5m-cgu.4.rcgu.o" "-o" ".../supercop-data/jasper/amd64/try/c/clang_-march=native_-O2_-fwrapv_-Qunused-arguments_-fPIC_-fPIE_-gdwarf-4_-Wall/constbranchindex/crypto_hash/sha256/rust_crypto/work/target/release/deps/try_small-f566cacc72890263" ".../supercop-data/jasper/amd64/try/c/clang_-march=native_-O2_-fwrapv_-Qunused-arguments_-fPIC_-fPIE_-gdwarf-4_-Wall/constbranchindex/crypto_hash/sha256/rust_crypto/work/target/release/deps/try_small-f566cacc72890263.2yzzwl19n3ayhtwn.rcgu.o" "-Wl,--gc-sections" "-pie" "-Wl,-zrelro" "-Wl,-znow" "-Wl,-O1" "-nodefaultlibs" "-L" ".../supercop-data/jasper/amd64/try/c/clang_-march=native_-O2_-fwrapv_-Qunused-arguments_-fPIC_-fPIE_-gdwarf-4_-Wall/constbranchindex/crypto_hash/sha256/rust_crypto/work/target/release/deps" "-L" ".../supercop-data/jasper/amd64/lib" "-L" ".../supercop-data/jasper/amd64/try/c/clang_-march=native_-O2_-fwrapv_-Qunused-arguments_-fPIC_-fPIE_-gdwarf-4_-Wall/constbranchindex/crypto_hash/sha256/rust_crypto/work/target/release/build/crypto_hash_sha256-5cd230be06f90398/out" "-L" ".../supercop-data/jasper/amd64/try/c/clang_-march=native_-O2_-fwrapv_-Qunused-arguments_-fPIC_-fPIE_-gdwarf-4_-Wall/constbranchindex/crypto_hash/sha256/rust_crypto/work/target/release/build/rust-crypto-afe9b4ff19c80bbc/out" "-L" "/usr/lib/rustlib/x86_64-unknown-linux-gnu/lib" "-ltry-anything" "-ltry-small" "-lsupercop" "-lkernelrandombytes" "-lcpucycles" "-lcrypto" "-lnsl" "-lm" "-Wl,-Bstatic" ".../supercop-data/jasper/amd64/try/c/clang_-march=native_-O2_-fwrapv_-Qunused-arguments_-fPIC_-fPIE_-gdwarf-4_-Wall/constbranchindex/crypto_hash/sha256/rust_crypto/work/target/release/deps/libcrypto_hash_sha256-b6dc07f49da86745.rlib" ".../supercop-data/jasper/amd64/try/c/clang_-march=native_-O2_-fwrapv_-Qunused-arguments_-fPIC_-fPIE_-gdwarf-4_-Wall/constbranchindex/crypto_hash/sha256/rust_crypto/work/target/release/deps/libcrypto-83ceebf3c7290f98.rlib" ".../supercop-data/jasper/amd64/try/c/clang_-march=native_-O2_-fwrapv_-Qunused-arguments_-fPIC_-fPIE_-gdwarf-4_-Wall/constbranchindex/crypto_hash/sha256/rust_crypto/work/target/release/deps/libtime-b473882f9f54487c.rlib" ".../supercop-data/jasper/amd64/try/c/clang_-march=native_-O2_-fwrapv_-Qunused-arguments_-fPIC_-fPIE_-gdwarf-4_-Wall/constbranchindex/crypto_hash/sha256/rust_crypto/work/target/release/deps/librustc_serialize-72942cfdca4fb518.rlib" ".../supercop-data/jasper/amd64/try/c/clang_-march=native_-O2_-fwrapv_-Qunused-arguments_-fPIC_-fPIE_-gdwarf-4_-Wall/constbranchindex/crypto_hash/sha256/rust_crypto/work/target/release/deps/librand-2cdf248a3f2ca473.rlib" ".../supercop-data/jasper/amd64/try/c/clang_-march=native_-O2_-fwrapv_-Qunused-arguments_-fPIC_-fPIE_-gdwarf-4_-Wall/constbranchindex/crypto_hash/sha256/rust_crypto/work/target/release/deps/librand-7df229a95dbcb448.rlib" ".../supercop-data/jasper/amd64/try/c/clang_-march=native_-O2_-fwrapv_-Qunused-arguments_-fPIC_-fPIE_-gdwarf-4_-Wall/constbranchindex/crypto_hash/sha256/rust_crypto/work/target/release/deps/liblibc-141c671f2ddc755d.rlib" "-Wl,--start-group" "/usr/lib/rustlib/x86_64-unknown-linux-gnu/lib/libstd-6bf3f16f340782ca.rlib" "/usr/lib/rustlib/x86_64-unknown-linux-gnu/lib/libpanic_unwind-13f3099d50c21bc6.rlib" "/usr/lib/rustlib/x86_64-unknown-linux-gnu/lib/libminiz_oxide-a2ba33c985785afe.rlib" "/usr/lib/rustlib/x86_64-unknown-linux-gnu/lib/libadler-3f6e9f8f4afbea6d.rlib" "/usr/lib/rustlib/x86_64-unknown-linux-gnu/lib/libobject-af517d7f13e7c960.rlib" "/usr/lib/rustlib/x86_64-unknown-linux-gnu/lib/libaddr2line-12740563628e601f.rlib" "/usr/lib/rustlib/x86_64-unknown-linux-gnu/lib/libgimli-0ac82a1e1820dd21.rlib" "/usr/lib/rustlib/x86_64-unknown-linux-gnu/lib/librustc_demangle-3ac2d0878c297d42.rlib" "/usr/lib/rustlib/x86_64-unknown-linux-gnu/lib/libhashbrown-c6632ca171f954dd.rlib" "/usr/lib/rustlib/x86_64-unknown-linux-gnu/lib/librustc_std_workspace_alloc-b5bfd0198c7b740d.rlib" "/usr/lib/rustlib/x86_64-unknown-linux-gnu/lib/libunwind-bd645b20c6c7b56d.rlib" "/usr/lib/rustlib/x86_64-unknown-linux-gnu/lib/libcfg_if-b9e1e523c0c29a77.rlib" "/usr/lib/rustlib/x86_64-unknown-linux-gnu/lib/liblibc-dfbef8c525de0186.rlib" "/usr/lib/rustlib/x86_64-unknown-linux-gnu/lib/liballoc-1ebf406bd4ea5769.rlib" "/usr/lib/rustlib/x86_64-unknown-linux-gnu/lib/librustc_std_workspace_core-5e0675f526ef5c6b.rlib" "/usr/lib/rustlib/x86_64-unknown-linux-gnu/lib/libcore-3375e4f89d420e7a.rlib" "-Wl,--end-group" "/usr/lib/rustlib/x86_64-unknown-linux-gnu/lib/libcompiler_builtins-f74b197469e67088.rlib" "-Wl,-Bdynamic" "-lgcc_s" "-lc" "-lm" "-lrt" "-lpthread" "-lutil" "-ldl" "-lutil"
try.c: = note: /usr/bin/ld: .../supercop-data/jasper/amd64/try/c/clang_-march=native_-O2_-fwrapv_-Qunused-arguments_-fPIC_-fPIE_-gdwarf-4_-Wall/constbranchindex/crypto_hash/sha256/rust_crypto/work/target/release/build/crypto_hash_sha256-5cd230be06f90398/out/libtry-anything.a(try-anything.o): in function `c_main':
try.c: .../supercop-data/jasper/amd64/try/c/clang_-march=native_-O2_-fwrapv_-Qunused-arguments_-fPIC_-fPIE_-gdwarf-4_-Wall/constbranchindex/crypto_hash/sha256/rust_crypto/work/try-anything.c:331: undefined reference to `cpucycles_amd64rdpmc'
try.c: /usr/bin/ld: .../supercop-data/jasper/amd64/try/c/clang_-march=native_-O2_-fwrapv_-Qunused-arguments_-fPIC_-fPIE_-gdwarf-4_-Wall/constbranchindex/crypto_hash/sha256/rust_crypto/work/try-anything.c:332: undefined reference to `cpucycles_amd64rdpmc'
try.c: /usr/bin/ld: .../supercop-data/jasper/amd64/try/c/clang_-march=native_-O2_-fwrapv_-Qunused-arguments_-fPIC_-fPIE_-gdwarf-4_-Wall/constbranchindex/crypto_hash/sha256/rust_crypto/work/try-anything.c:333: undefined reference to `cpucycles_amd64rdpmc_persecond'
try.c: /usr/bin/ld: .../supercop-data/jasper/amd64/try/c/clang_-march=native_-O2_-fwrapv_-Qunused-arguments_-fPIC_-fPIE_-gdwarf-4_-Wall/constbranchindex/crypto_hash/sha256/rust_crypto/work/try-anything.c:344: undefined reference to `cpucycles_amd64rdpmc'
try.c: /usr/bin/ld: .../supercop-data/jasper/amd64/try/c/clang_-march=native_-O2_-fwrapv_-Qunused-arguments_-fPIC_-fPIE_-gdwarf-4_-Wall/constbranchindex/crypto_hash/sha256/rust_crypto/work/try-anything.c:346: undefined reference to `cpucycles_amd64rdpmc'
try.c: /usr/bin/ld: .../supercop-data/jasper/amd64/try/c/clang_-march=native_-O2_-fwrapv_-Qunused-arguments_-fPIC_-fPIE_-gdwarf-4_-Wall/constbranchindex/crypto_hash/sha256/rust_crypto/work/try-anything.c:353: undefined reference to `cpucycles_amd64rdpmc'
try.c: /usr/bin/ld: .../supercop-data/jasper/amd64/try/c/clang_-march=native_-O2_-fwrapv_-Qunused-arguments_-fPIC_-fPIE_-gdwarf-4_-Wall/constbranchindex/crypto_hash/sha256/rust_crypto/work/try-anything.c:356: undefined reference to `cpucycles_amd64rdpmc'
try.c: collect2: error: ld returned 1 exit status
try.c:
try.c:
try.c: error: aborting due to previous error
try.c:
try.c: error: could not compile `crypto_hash_sha256`.
try.c:
try.c: To learn more, run the command again with --verbose.
Number of similar (implementation,compiler) pairs: 1, namely:
Implementation | Compiler |
rust_crypto | clang -march=native -O2 -fwrapv -Qunused-arguments -fPIC -fPIE -gdwarf-4 -Wall (Debian_Clang_11.0.1) |
Compiler output
try.c: error: linking with `cc` failed: exit code: 1
try.c: |
try.c: = note: "cc" "-Wl,--as-needed" "-Wl,-z,noexecstack" "-m64" "-Wl,--eh-frame-hdr" "-L" "/usr/lib/rustlib/x86_64-unknown-linux-gnu/lib" ".../supercop-data/jasper/amd64/try/c/clang_-march=native_-O3_-fwrapv_-Qunused-arguments_-fPIC_-fPIE_-gdwarf-4_-Wall/constbranchindex/crypto_hash/sha256/rust_crypto/work/target/release/deps/try-baac04c777a2678c.try.dtsbxaoj-cgu.0.rcgu.o" ".../supercop-data/jasper/amd64/try/c/clang_-march=native_-O3_-fwrapv_-Qunused-arguments_-fPIC_-fPIE_-gdwarf-4_-Wall/constbranchindex/crypto_hash/sha256/rust_crypto/work/target/release/deps/try-baac04c777a2678c.try.dtsbxaoj-cgu.1.rcgu.o" ".../supercop-data/jasper/amd64/try/c/clang_-march=native_-O3_-fwrapv_-Qunused-arguments_-fPIC_-fPIE_-gdwarf-4_-Wall/constbranchindex/crypto_hash/sha256/rust_crypto/work/target/release/deps/try-baac04c777a2678c.try.dtsbxaoj-cgu.2.rcgu.o" ".../supercop-data/jasper/amd64/try/c/clang_-march=native_-O3_-fwrapv_-Qunused-arguments_-fPIC_-fPIE_-gdwarf-4_-Wall/constbranchindex/crypto_hash/sha256/rust_crypto/work/target/release/deps/try-baac04c777a2678c.try.dtsbxaoj-cgu.3.rcgu.o" ".../supercop-data/jasper/amd64/try/c/clang_-march=native_-O3_-fwrapv_-Qunused-arguments_-fPIC_-fPIE_-gdwarf-4_-Wall/constbranchindex/crypto_hash/sha256/rust_crypto/work/target/release/deps/try-baac04c777a2678c.try.dtsbxaoj-cgu.4.rcgu.o" "-o" ".../supercop-data/jasper/amd64/try/c/clang_-march=native_-O3_-fwrapv_-Qunused-arguments_-fPIC_-fPIE_-gdwarf-4_-Wall/constbranchindex/crypto_hash/sha256/rust_crypto/work/target/release/deps/try-baac04c777a2678c" ".../supercop-data/jasper/amd64/try/c/clang_-march=native_-O3_-fwrapv_-Qunused-arguments_-fPIC_-fPIE_-gdwarf-4_-Wall/constbranchindex/crypto_hash/sha256/rust_crypto/work/target/release/deps/try-baac04c777a2678c.1g22a3jq6o5wtxe0.rcgu.o" "-Wl,--gc-sections" "-pie" "-Wl,-zrelro" "-Wl,-znow" "-Wl,-O1" "-nodefaultlibs" "-L" ".../supercop-data/jasper/amd64/try/c/clang_-march=native_-O3_-fwrapv_-Qunused-arguments_-fPIC_-fPIE_-gdwarf-4_-Wall/constbranchindex/crypto_hash/sha256/rust_crypto/work/target/release/deps" "-L" ".../supercop-data/jasper/amd64/lib" "-L" ".../supercop-data/jasper/amd64/try/c/clang_-march=native_-O3_-fwrapv_-Qunused-arguments_-fPIC_-fPIE_-gdwarf-4_-Wall/constbranchindex/crypto_hash/sha256/rust_crypto/work/target/release/build/crypto_hash_sha256-5cd230be06f90398/out" "-L" ".../supercop-data/jasper/amd64/try/c/clang_-march=native_-O3_-fwrapv_-Qunused-arguments_-fPIC_-fPIE_-gdwarf-4_-Wall/constbranchindex/crypto_hash/sha256/rust_crypto/work/target/release/build/rust-crypto-afe9b4ff19c80bbc/out" "-L" "/usr/lib/rustlib/x86_64-unknown-linux-gnu/lib" "-ltry-anything" "-ltry" "-lsupercop" "-lkernelrandombytes" "-lcpucycles" "-lcrypto" "-lnsl" "-lm" "-Wl,-Bstatic" ".../supercop-data/jasper/amd64/try/c/clang_-march=native_-O3_-fwrapv_-Qunused-arguments_-fPIC_-fPIE_-gdwarf-4_-Wall/constbranchindex/crypto_hash/sha256/rust_crypto/work/target/release/deps/libcrypto_hash_sha256-b6dc07f49da86745.rlib" ".../supercop-data/jasper/amd64/try/c/clang_-march=native_-O3_-fwrapv_-Qunused-arguments_-fPIC_-fPIE_-gdwarf-4_-Wall/constbranchindex/crypto_hash/sha256/rust_crypto/work/target/release/deps/libcrypto-83ceebf3c7290f98.rlib" ".../supercop-data/jasper/amd64/try/c/clang_-march=native_-O3_-fwrapv_-Qunused-arguments_-fPIC_-fPIE_-gdwarf-4_-Wall/constbranchindex/crypto_hash/sha256/rust_crypto/work/target/release/deps/libtime-b473882f9f54487c.rlib" ".../supercop-data/jasper/amd64/try/c/clang_-march=native_-O3_-fwrapv_-Qunused-arguments_-fPIC_-fPIE_-gdwarf-4_-Wall/constbranchindex/crypto_hash/sha256/rust_crypto/work/target/release/deps/librustc_serialize-72942cfdca4fb518.rlib" ".../supercop-data/jasper/amd64/try/c/clang_-march=native_-O3_-fwrapv_-Qunused-arguments_-fPIC_-fPIE_-gdwarf-4_-Wall/constbranchindex/crypto_hash/sha256/rust_crypto/work/target/release/deps/librand-2cdf248a3f2ca473.rlib" ".../supercop-data/jasper/amd64/try/c/clang_-march=native_-O3_-fwrapv_-Qunused-arguments_-fPIC_-fPIE_-gdwarf-4_-Wall/constbranchindex/crypto_hash/sha256/rust_crypto/work/target/release/deps/librand-7df229a95dbcb448.rlib" ".../supercop-data/jasper/amd64/try/c/clang_-march=native_-O3_-fwrapv_-Qunused-arguments_-fPIC_-fPIE_-gdwarf-4_-Wall/constbranchindex/crypto_hash/sha256/rust_crypto/work/target/release/deps/liblibc-141c671f2ddc755d.rlib" "-Wl,--start-group" "/usr/lib/rustlib/x86_64-unknown-linux-gnu/lib/libstd-6bf3f16f340782ca.rlib" "/usr/lib/rustlib/x86_64-unknown-linux-gnu/lib/libpanic_unwind-13f3099d50c21bc6.rlib" "/usr/lib/rustlib/x86_64-unknown-linux-gnu/lib/libminiz_oxide-a2ba33c985785afe.rlib" "/usr/lib/rustlib/x86_64-unknown-linux-gnu/lib/libadler-3f6e9f8f4afbea6d.rlib" "/usr/lib/rustlib/x86_64-unknown-linux-gnu/lib/libobject-af517d7f13e7c960.rlib" "/usr/lib/rustlib/x86_64-unknown-linux-gnu/lib/libaddr2line-12740563628e601f.rlib" "/usr/lib/rustlib/x86_64-unknown-linux-gnu/lib/libgimli-0ac82a1e1820dd21.rlib" "/usr/lib/rustlib/x86_64-unknown-linux-gnu/lib/librustc_demangle-3ac2d0878c297d42.rlib" "/usr/lib/rustlib/x86_64-unknown-linux-gnu/lib/libhashbrown-c6632ca171f954dd.rlib" "/usr/lib/rustlib/x86_64-unknown-linux-gnu/lib/librustc_std_workspace_alloc-b5bfd0198c7b740d.rlib" "/usr/lib/rustlib/x86_64-unknown-linux-gnu/lib/libunwind-bd645b20c6c7b56d.rlib" "/usr/lib/rustlib/x86_64-unknown-linux-gnu/lib/libcfg_if-b9e1e523c0c29a77.rlib" "/usr/lib/rustlib/x86_64-unknown-linux-gnu/lib/liblibc-dfbef8c525de0186.rlib" "/usr/lib/rustlib/x86_64-unknown-linux-gnu/lib/liballoc-1ebf406bd4ea5769.rlib" "/usr/lib/rustlib/x86_64-unknown-linux-gnu/lib/librustc_std_workspace_core-5e0675f526ef5c6b.rlib" "/usr/lib/rustlib/x86_64-unknown-linux-gnu/lib/libcore-3375e4f89d420e7a.rlib" "-Wl,--end-group" "/usr/lib/rustlib/x86_64-unknown-linux-gnu/lib/libcompiler_builtins-f74b197469e67088.rlib" "-Wl,-Bdynamic" "-lgcc_s" "-lc" "-lm" "-lrt" "-lpthread" "-lutil" "-ldl" "-lutil"
try.c: = note: /usr/bin/ld: .../supercop-data/jasper/amd64/try/c/clang_-march=native_-O3_-fwrapv_-Qunused-arguments_-fPIC_-fPIE_-gdwarf-4_-Wall/constbranchindex/crypto_hash/sha256/rust_crypto/work/target/release/build/crypto_hash_sha256-5cd230be06f90398/out/libtry-anything.a(try-anything.o): in function `c_main':
try.c: .../supercop-data/jasper/amd64/try/c/clang_-march=native_-O3_-fwrapv_-Qunused-arguments_-fPIC_-fPIE_-gdwarf-4_-Wall/constbranchindex/crypto_hash/sha256/rust_crypto/work/try-anything.c:331: undefined reference to `cpucycles_amd64rdpmc'
try.c: /usr/bin/ld: .../supercop-data/jasper/amd64/try/c/clang_-march=native_-O3_-fwrapv_-Qunused-arguments_-fPIC_-fPIE_-gdwarf-4_-Wall/constbranchindex/crypto_hash/sha256/rust_crypto/work/try-anything.c:332: undefined reference to `cpucycles_amd64rdpmc'
try.c: /usr/bin/ld: .../supercop-data/jasper/amd64/try/c/clang_-march=native_-O3_-fwrapv_-Qunused-arguments_-fPIC_-fPIE_-gdwarf-4_-Wall/constbranchindex/crypto_hash/sha256/rust_crypto/work/try-anything.c:333: undefined reference to `cpucycles_amd64rdpmc_persecond'
try.c: /usr/bin/ld: .../supercop-data/jasper/amd64/try/c/clang_-march=native_-O3_-fwrapv_-Qunused-arguments_-fPIC_-fPIE_-gdwarf-4_-Wall/constbranchindex/crypto_hash/sha256/rust_crypto/work/try-anything.c:344: undefined reference to `cpucycles_amd64rdpmc'
try.c: /usr/bin/ld: .../supercop-data/jasper/amd64/try/c/clang_-march=native_-O3_-fwrapv_-Qunused-arguments_-fPIC_-fPIE_-gdwarf-4_-Wall/constbranchindex/crypto_hash/sha256/rust_crypto/work/try-anything.c:346: undefined reference to `cpucycles_amd64rdpmc'
try.c: /usr/bin/ld: .../supercop-data/jasper/amd64/try/c/clang_-march=native_-O3_-fwrapv_-Qunused-arguments_-fPIC_-fPIE_-gdwarf-4_-Wall/constbranchindex/crypto_hash/sha256/rust_crypto/work/try-anything.c:353: undefined reference to `cpucycles_amd64rdpmc'
try.c: /usr/bin/ld: .../supercop-data/jasper/amd64/try/c/clang_-march=native_-O3_-fwrapv_-Qunused-arguments_-fPIC_-fPIE_-gdwarf-4_-Wall/constbranchindex/crypto_hash/sha256/rust_crypto/work/try-anything.c:356: undefined reference to `cpucycles_amd64rdpmc'
try.c: collect2: error: ld returned 1 exit status
try.c:
try.c:
try.c: error: aborting due to previous error
try.c:
try.c: error: could not compile `crypto_hash_sha256`.
try.c:
try.c: To learn more, run the command again with --verbose.
Number of similar (implementation,compiler) pairs: 1, namely:
Implementation | Compiler |
rust_crypto | clang -march=native -O3 -fwrapv -Qunused-arguments -fPIC -fPIE -gdwarf-4 -Wall (Debian_Clang_11.0.1) |
Compiler output
try.c: error: linking with `cc` failed: exit code: 1
try.c: |
try.c: = note: "cc" "-Wl,--as-needed" "-Wl,-z,noexecstack" "-m64" "-Wl,--eh-frame-hdr" "-L" "/usr/lib/rustlib/x86_64-unknown-linux-gnu/lib" ".../supercop-data/jasper/amd64/try/c/clang_-march=native_-O_-fwrapv_-Qunused-arguments_-fPIC_-fPIE_-gdwarf-4_-Wall/constbranchindex/crypto_hash/sha256/rust_crypto/work/target/release/deps/try-baac04c777a2678c.try.dtsbxaoj-cgu.0.rcgu.o" ".../supercop-data/jasper/amd64/try/c/clang_-march=native_-O_-fwrapv_-Qunused-arguments_-fPIC_-fPIE_-gdwarf-4_-Wall/constbranchindex/crypto_hash/sha256/rust_crypto/work/target/release/deps/try-baac04c777a2678c.try.dtsbxaoj-cgu.1.rcgu.o" ".../supercop-data/jasper/amd64/try/c/clang_-march=native_-O_-fwrapv_-Qunused-arguments_-fPIC_-fPIE_-gdwarf-4_-Wall/constbranchindex/crypto_hash/sha256/rust_crypto/work/target/release/deps/try-baac04c777a2678c.try.dtsbxaoj-cgu.2.rcgu.o" ".../supercop-data/jasper/amd64/try/c/clang_-march=native_-O_-fwrapv_-Qunused-arguments_-fPIC_-fPIE_-gdwarf-4_-Wall/constbranchindex/crypto_hash/sha256/rust_crypto/work/target/release/deps/try-baac04c777a2678c.try.dtsbxaoj-cgu.3.rcgu.o" ".../supercop-data/jasper/amd64/try/c/clang_-march=native_-O_-fwrapv_-Qunused-arguments_-fPIC_-fPIE_-gdwarf-4_-Wall/constbranchindex/crypto_hash/sha256/rust_crypto/work/target/release/deps/try-baac04c777a2678c.try.dtsbxaoj-cgu.4.rcgu.o" "-o" ".../supercop-data/jasper/amd64/try/c/clang_-march=native_-O_-fwrapv_-Qunused-arguments_-fPIC_-fPIE_-gdwarf-4_-Wall/constbranchindex/crypto_hash/sha256/rust_crypto/work/target/release/deps/try-baac04c777a2678c" ".../supercop-data/jasper/amd64/try/c/clang_-march=native_-O_-fwrapv_-Qunused-arguments_-fPIC_-fPIE_-gdwarf-4_-Wall/constbranchindex/crypto_hash/sha256/rust_crypto/work/target/release/deps/try-baac04c777a2678c.1g22a3jq6o5wtxe0.rcgu.o" "-Wl,--gc-sections" "-pie" "-Wl,-zrelro" "-Wl,-znow" "-Wl,-O1" "-nodefaultlibs" "-L" ".../supercop-data/jasper/amd64/try/c/clang_-march=native_-O_-fwrapv_-Qunused-arguments_-fPIC_-fPIE_-gdwarf-4_-Wall/constbranchindex/crypto_hash/sha256/rust_crypto/work/target/release/deps" "-L" ".../supercop-data/jasper/amd64/lib" "-L" ".../supercop-data/jasper/amd64/try/c/clang_-march=native_-O_-fwrapv_-Qunused-arguments_-fPIC_-fPIE_-gdwarf-4_-Wall/constbranchindex/crypto_hash/sha256/rust_crypto/work/target/release/build/crypto_hash_sha256-5cd230be06f90398/out" "-L" ".../supercop-data/jasper/amd64/try/c/clang_-march=native_-O_-fwrapv_-Qunused-arguments_-fPIC_-fPIE_-gdwarf-4_-Wall/constbranchindex/crypto_hash/sha256/rust_crypto/work/target/release/build/rust-crypto-afe9b4ff19c80bbc/out" "-L" "/usr/lib/rustlib/x86_64-unknown-linux-gnu/lib" "-ltry-anything" "-ltry" "-lsupercop" "-lkernelrandombytes" "-lcpucycles" "-lcrypto" "-lnsl" "-lm" "-Wl,-Bstatic" ".../supercop-data/jasper/amd64/try/c/clang_-march=native_-O_-fwrapv_-Qunused-arguments_-fPIC_-fPIE_-gdwarf-4_-Wall/constbranchindex/crypto_hash/sha256/rust_crypto/work/target/release/deps/libcrypto_hash_sha256-b6dc07f49da86745.rlib" ".../supercop-data/jasper/amd64/try/c/clang_-march=native_-O_-fwrapv_-Qunused-arguments_-fPIC_-fPIE_-gdwarf-4_-Wall/constbranchindex/crypto_hash/sha256/rust_crypto/work/target/release/deps/libcrypto-83ceebf3c7290f98.rlib" ".../supercop-data/jasper/amd64/try/c/clang_-march=native_-O_-fwrapv_-Qunused-arguments_-fPIC_-fPIE_-gdwarf-4_-Wall/constbranchindex/crypto_hash/sha256/rust_crypto/work/target/release/deps/libtime-b473882f9f54487c.rlib" ".../supercop-data/jasper/amd64/try/c/clang_-march=native_-O_-fwrapv_-Qunused-arguments_-fPIC_-fPIE_-gdwarf-4_-Wall/constbranchindex/crypto_hash/sha256/rust_crypto/work/target/release/deps/librustc_serialize-72942cfdca4fb518.rlib" ".../supercop-data/jasper/amd64/try/c/clang_-march=native_-O_-fwrapv_-Qunused-arguments_-fPIC_-fPIE_-gdwarf-4_-Wall/constbranchindex/crypto_hash/sha256/rust_crypto/work/target/release/deps/librand-2cdf248a3f2ca473.rlib" ".../supercop-data/jasper/amd64/try/c/clang_-march=native_-O_-fwrapv_-Qunused-arguments_-fPIC_-fPIE_-gdwarf-4_-Wall/constbranchindex/crypto_hash/sha256/rust_crypto/work/target/release/deps/librand-7df229a95dbcb448.rlib" ".../supercop-data/jasper/amd64/try/c/clang_-march=native_-O_-fwrapv_-Qunused-arguments_-fPIC_-fPIE_-gdwarf-4_-Wall/constbranchindex/crypto_hash/sha256/rust_crypto/work/target/release/deps/liblibc-141c671f2ddc755d.rlib" "-Wl,--start-group" "/usr/lib/rustlib/x86_64-unknown-linux-gnu/lib/libstd-6bf3f16f340782ca.rlib" "/usr/lib/rustlib/x86_64-unknown-linux-gnu/lib/libpanic_unwind-13f3099d50c21bc6.rlib" "/usr/lib/rustlib/x86_64-unknown-linux-gnu/lib/libminiz_oxide-a2ba33c985785afe.rlib" "/usr/lib/rustlib/x86_64-unknown-linux-gnu/lib/libadler-3f6e9f8f4afbea6d.rlib" "/usr/lib/rustlib/x86_64-unknown-linux-gnu/lib/libobject-af517d7f13e7c960.rlib" "/usr/lib/rustlib/x86_64-unknown-linux-gnu/lib/libaddr2line-12740563628e601f.rlib" "/usr/lib/rustlib/x86_64-unknown-linux-gnu/lib/libgimli-0ac82a1e1820dd21.rlib" "/usr/lib/rustlib/x86_64-unknown-linux-gnu/lib/librustc_demangle-3ac2d0878c297d42.rlib" "/usr/lib/rustlib/x86_64-unknown-linux-gnu/lib/libhashbrown-c6632ca171f954dd.rlib" "/usr/lib/rustlib/x86_64-unknown-linux-gnu/lib/librustc_std_workspace_alloc-b5bfd0198c7b740d.rlib" "/usr/lib/rustlib/x86_64-unknown-linux-gnu/lib/libunwind-bd645b20c6c7b56d.rlib" "/usr/lib/rustlib/x86_64-unknown-linux-gnu/lib/libcfg_if-b9e1e523c0c29a77.rlib" "/usr/lib/rustlib/x86_64-unknown-linux-gnu/lib/liblibc-dfbef8c525de0186.rlib" "/usr/lib/rustlib/x86_64-unknown-linux-gnu/lib/liballoc-1ebf406bd4ea5769.rlib" "/usr/lib/rustlib/x86_64-unknown-linux-gnu/lib/librustc_std_workspace_core-5e0675f526ef5c6b.rlib" "/usr/lib/rustlib/x86_64-unknown-linux-gnu/lib/libcore-3375e4f89d420e7a.rlib" "-Wl,--end-group" "/usr/lib/rustlib/x86_64-unknown-linux-gnu/lib/libcompiler_builtins-f74b197469e67088.rlib" "-Wl,-Bdynamic" "-lgcc_s" "-lc" "-lm" "-lrt" "-lpthread" "-lutil" "-ldl" "-lutil"
try.c: = note: /usr/bin/ld: .../supercop-data/jasper/amd64/try/c/clang_-march=native_-O_-fwrapv_-Qunused-arguments_-fPIC_-fPIE_-gdwarf-4_-Wall/constbranchindex/crypto_hash/sha256/rust_crypto/work/target/release/build/crypto_hash_sha256-5cd230be06f90398/out/libtry-anything.a(try-anything.o): in function `c_main':
try.c: .../supercop-data/jasper/amd64/try/c/clang_-march=native_-O_-fwrapv_-Qunused-arguments_-fPIC_-fPIE_-gdwarf-4_-Wall/constbranchindex/crypto_hash/sha256/rust_crypto/work/try-anything.c:331: undefined reference to `cpucycles_amd64rdpmc'
try.c: /usr/bin/ld: .../supercop-data/jasper/amd64/try/c/clang_-march=native_-O_-fwrapv_-Qunused-arguments_-fPIC_-fPIE_-gdwarf-4_-Wall/constbranchindex/crypto_hash/sha256/rust_crypto/work/try-anything.c:332: undefined reference to `cpucycles_amd64rdpmc'
try.c: /usr/bin/ld: .../supercop-data/jasper/amd64/try/c/clang_-march=native_-O_-fwrapv_-Qunused-arguments_-fPIC_-fPIE_-gdwarf-4_-Wall/constbranchindex/crypto_hash/sha256/rust_crypto/work/try-anything.c:333: undefined reference to `cpucycles_amd64rdpmc_persecond'
try.c: /usr/bin/ld: .../supercop-data/jasper/amd64/try/c/clang_-march=native_-O_-fwrapv_-Qunused-arguments_-fPIC_-fPIE_-gdwarf-4_-Wall/constbranchindex/crypto_hash/sha256/rust_crypto/work/try-anything.c:344: undefined reference to `cpucycles_amd64rdpmc'
try.c: /usr/bin/ld: .../supercop-data/jasper/amd64/try/c/clang_-march=native_-O_-fwrapv_-Qunused-arguments_-fPIC_-fPIE_-gdwarf-4_-Wall/constbranchindex/crypto_hash/sha256/rust_crypto/work/try-anything.c:346: undefined reference to `cpucycles_amd64rdpmc'
try.c: /usr/bin/ld: .../supercop-data/jasper/amd64/try/c/clang_-march=native_-O_-fwrapv_-Qunused-arguments_-fPIC_-fPIE_-gdwarf-4_-Wall/constbranchindex/crypto_hash/sha256/rust_crypto/work/try-anything.c:353: undefined reference to `cpucycles_amd64rdpmc'
try.c: /usr/bin/ld: .../supercop-data/jasper/amd64/try/c/clang_-march=native_-O_-fwrapv_-Qunused-arguments_-fPIC_-fPIE_-gdwarf-4_-Wall/constbranchindex/crypto_hash/sha256/rust_crypto/work/try-anything.c:356: undefined reference to `cpucycles_amd64rdpmc'
try.c: collect2: error: ld returned 1 exit status
try.c:
try.c:
try.c: error: aborting due to previous error
try.c:
try.c: error: could not compile `crypto_hash_sha256`.
try.c:
try.c: To learn more, run the command again with --verbose.
Number of similar (implementation,compiler) pairs: 1, namely:
Implementation | Compiler |
rust_crypto | clang -march=native -O -fwrapv -Qunused-arguments -fPIC -fPIE -gdwarf-4 -Wall (Debian_Clang_11.0.1) |
Compiler output
try.c: error: linking with `cc` failed: exit code: 1
try.c: |
try.c: = note: "cc" "-Wl,--as-needed" "-Wl,-z,noexecstack" "-m64" "-Wl,--eh-frame-hdr" "-L" "/usr/lib/rustlib/x86_64-unknown-linux-gnu/lib" ".../supercop-data/jasper/amd64/try/c/clang_-march=native_-Os_-fwrapv_-Qunused-arguments_-fPIC_-fPIE_-gdwarf-4_-Wall/constbranchindex/crypto_hash/sha256/rust_crypto/work/target/release/deps/try_small-f566cacc72890263.try_small.83ks8n5m-cgu.0.rcgu.o" ".../supercop-data/jasper/amd64/try/c/clang_-march=native_-Os_-fwrapv_-Qunused-arguments_-fPIC_-fPIE_-gdwarf-4_-Wall/constbranchindex/crypto_hash/sha256/rust_crypto/work/target/release/deps/try_small-f566cacc72890263.try_small.83ks8n5m-cgu.1.rcgu.o" ".../supercop-data/jasper/amd64/try/c/clang_-march=native_-Os_-fwrapv_-Qunused-arguments_-fPIC_-fPIE_-gdwarf-4_-Wall/constbranchindex/crypto_hash/sha256/rust_crypto/work/target/release/deps/try_small-f566cacc72890263.try_small.83ks8n5m-cgu.2.rcgu.o" ".../supercop-data/jasper/amd64/try/c/clang_-march=native_-Os_-fwrapv_-Qunused-arguments_-fPIC_-fPIE_-gdwarf-4_-Wall/constbranchindex/crypto_hash/sha256/rust_crypto/work/target/release/deps/try_small-f566cacc72890263.try_small.83ks8n5m-cgu.3.rcgu.o" ".../supercop-data/jasper/amd64/try/c/clang_-march=native_-Os_-fwrapv_-Qunused-arguments_-fPIC_-fPIE_-gdwarf-4_-Wall/constbranchindex/crypto_hash/sha256/rust_crypto/work/target/release/deps/try_small-f566cacc72890263.try_small.83ks8n5m-cgu.4.rcgu.o" "-o" ".../supercop-data/jasper/amd64/try/c/clang_-march=native_-Os_-fwrapv_-Qunused-arguments_-fPIC_-fPIE_-gdwarf-4_-Wall/constbranchindex/crypto_hash/sha256/rust_crypto/work/target/release/deps/try_small-f566cacc72890263" ".../supercop-data/jasper/amd64/try/c/clang_-march=native_-Os_-fwrapv_-Qunused-arguments_-fPIC_-fPIE_-gdwarf-4_-Wall/constbranchindex/crypto_hash/sha256/rust_crypto/work/target/release/deps/try_small-f566cacc72890263.2yzzwl19n3ayhtwn.rcgu.o" "-Wl,--gc-sections" "-pie" "-Wl,-zrelro" "-Wl,-znow" "-Wl,-O1" "-nodefaultlibs" "-L" ".../supercop-data/jasper/amd64/try/c/clang_-march=native_-Os_-fwrapv_-Qunused-arguments_-fPIC_-fPIE_-gdwarf-4_-Wall/constbranchindex/crypto_hash/sha256/rust_crypto/work/target/release/deps" "-L" ".../supercop-data/jasper/amd64/lib" "-L" ".../supercop-data/jasper/amd64/try/c/clang_-march=native_-Os_-fwrapv_-Qunused-arguments_-fPIC_-fPIE_-gdwarf-4_-Wall/constbranchindex/crypto_hash/sha256/rust_crypto/work/target/release/build/crypto_hash_sha256-5cd230be06f90398/out" "-L" ".../supercop-data/jasper/amd64/try/c/clang_-march=native_-Os_-fwrapv_-Qunused-arguments_-fPIC_-fPIE_-gdwarf-4_-Wall/constbranchindex/crypto_hash/sha256/rust_crypto/work/target/release/build/rust-crypto-afe9b4ff19c80bbc/out" "-L" "/usr/lib/rustlib/x86_64-unknown-linux-gnu/lib" "-ltry-anything" "-ltry-small" "-lsupercop" "-lkernelrandombytes" "-lcpucycles" "-lcrypto" "-lnsl" "-lm" "-Wl,-Bstatic" ".../supercop-data/jasper/amd64/try/c/clang_-march=native_-Os_-fwrapv_-Qunused-arguments_-fPIC_-fPIE_-gdwarf-4_-Wall/constbranchindex/crypto_hash/sha256/rust_crypto/work/target/release/deps/libcrypto_hash_sha256-b6dc07f49da86745.rlib" ".../supercop-data/jasper/amd64/try/c/clang_-march=native_-Os_-fwrapv_-Qunused-arguments_-fPIC_-fPIE_-gdwarf-4_-Wall/constbranchindex/crypto_hash/sha256/rust_crypto/work/target/release/deps/libcrypto-83ceebf3c7290f98.rlib" ".../supercop-data/jasper/amd64/try/c/clang_-march=native_-Os_-fwrapv_-Qunused-arguments_-fPIC_-fPIE_-gdwarf-4_-Wall/constbranchindex/crypto_hash/sha256/rust_crypto/work/target/release/deps/libtime-b473882f9f54487c.rlib" ".../supercop-data/jasper/amd64/try/c/clang_-march=native_-Os_-fwrapv_-Qunused-arguments_-fPIC_-fPIE_-gdwarf-4_-Wall/constbranchindex/crypto_hash/sha256/rust_crypto/work/target/release/deps/librustc_serialize-72942cfdca4fb518.rlib" ".../supercop-data/jasper/amd64/try/c/clang_-march=native_-Os_-fwrapv_-Qunused-arguments_-fPIC_-fPIE_-gdwarf-4_-Wall/constbranchindex/crypto_hash/sha256/rust_crypto/work/target/release/deps/librand-2cdf248a3f2ca473.rlib" ".../supercop-data/jasper/amd64/try/c/clang_-march=native_-Os_-fwrapv_-Qunused-arguments_-fPIC_-fPIE_-gdwarf-4_-Wall/constbranchindex/crypto_hash/sha256/rust_crypto/work/target/release/deps/librand-7df229a95dbcb448.rlib" ".../supercop-data/jasper/amd64/try/c/clang_-march=native_-Os_-fwrapv_-Qunused-arguments_-fPIC_-fPIE_-gdwarf-4_-Wall/constbranchindex/crypto_hash/sha256/rust_crypto/work/target/release/deps/liblibc-141c671f2ddc755d.rlib" "-Wl,--start-group" "/usr/lib/rustlib/x86_64-unknown-linux-gnu/lib/libstd-6bf3f16f340782ca.rlib" "/usr/lib/rustlib/x86_64-unknown-linux-gnu/lib/libpanic_unwind-13f3099d50c21bc6.rlib" "/usr/lib/rustlib/x86_64-unknown-linux-gnu/lib/libminiz_oxide-a2ba33c985785afe.rlib" "/usr/lib/rustlib/x86_64-unknown-linux-gnu/lib/libadler-3f6e9f8f4afbea6d.rlib" "/usr/lib/rustlib/x86_64-unknown-linux-gnu/lib/libobject-af517d7f13e7c960.rlib" "/usr/lib/rustlib/x86_64-unknown-linux-gnu/lib/libaddr2line-12740563628e601f.rlib" "/usr/lib/rustlib/x86_64-unknown-linux-gnu/lib/libgimli-0ac82a1e1820dd21.rlib" "/usr/lib/rustlib/x86_64-unknown-linux-gnu/lib/librustc_demangle-3ac2d0878c297d42.rlib" "/usr/lib/rustlib/x86_64-unknown-linux-gnu/lib/libhashbrown-c6632ca171f954dd.rlib" "/usr/lib/rustlib/x86_64-unknown-linux-gnu/lib/librustc_std_workspace_alloc-b5bfd0198c7b740d.rlib" "/usr/lib/rustlib/x86_64-unknown-linux-gnu/lib/libunwind-bd645b20c6c7b56d.rlib" "/usr/lib/rustlib/x86_64-unknown-linux-gnu/lib/libcfg_if-b9e1e523c0c29a77.rlib" "/usr/lib/rustlib/x86_64-unknown-linux-gnu/lib/liblibc-dfbef8c525de0186.rlib" "/usr/lib/rustlib/x86_64-unknown-linux-gnu/lib/liballoc-1ebf406bd4ea5769.rlib" "/usr/lib/rustlib/x86_64-unknown-linux-gnu/lib/librustc_std_workspace_core-5e0675f526ef5c6b.rlib" "/usr/lib/rustlib/x86_64-unknown-linux-gnu/lib/libcore-3375e4f89d420e7a.rlib" "-Wl,--end-group" "/usr/lib/rustlib/x86_64-unknown-linux-gnu/lib/libcompiler_builtins-f74b197469e67088.rlib" "-Wl,-Bdynamic" "-lgcc_s" "-lc" "-lm" "-lrt" "-lpthread" "-lutil" "-ldl" "-lutil"
try.c: = note: /usr/bin/ld: .../supercop-data/jasper/amd64/try/c/clang_-march=native_-Os_-fwrapv_-Qunused-arguments_-fPIC_-fPIE_-gdwarf-4_-Wall/constbranchindex/crypto_hash/sha256/rust_crypto/work/target/release/build/crypto_hash_sha256-5cd230be06f90398/out/libtry-anything.a(try-anything.o): in function `c_main':
try.c: .../supercop-data/jasper/amd64/try/c/clang_-march=native_-Os_-fwrapv_-Qunused-arguments_-fPIC_-fPIE_-gdwarf-4_-Wall/constbranchindex/crypto_hash/sha256/rust_crypto/work/try-anything.c:331: undefined reference to `cpucycles_amd64rdpmc'
try.c: /usr/bin/ld: .../supercop-data/jasper/amd64/try/c/clang_-march=native_-Os_-fwrapv_-Qunused-arguments_-fPIC_-fPIE_-gdwarf-4_-Wall/constbranchindex/crypto_hash/sha256/rust_crypto/work/try-anything.c:332: undefined reference to `cpucycles_amd64rdpmc'
try.c: /usr/bin/ld: .../supercop-data/jasper/amd64/try/c/clang_-march=native_-Os_-fwrapv_-Qunused-arguments_-fPIC_-fPIE_-gdwarf-4_-Wall/constbranchindex/crypto_hash/sha256/rust_crypto/work/try-anything.c:333: undefined reference to `cpucycles_amd64rdpmc_persecond'
try.c: /usr/bin/ld: .../supercop-data/jasper/amd64/try/c/clang_-march=native_-Os_-fwrapv_-Qunused-arguments_-fPIC_-fPIE_-gdwarf-4_-Wall/constbranchindex/crypto_hash/sha256/rust_crypto/work/try-anything.c:344: undefined reference to `cpucycles_amd64rdpmc'
try.c: /usr/bin/ld: .../supercop-data/jasper/amd64/try/c/clang_-march=native_-Os_-fwrapv_-Qunused-arguments_-fPIC_-fPIE_-gdwarf-4_-Wall/constbranchindex/crypto_hash/sha256/rust_crypto/work/try-anything.c:346: undefined reference to `cpucycles_amd64rdpmc'
try.c: /usr/bin/ld: .../supercop-data/jasper/amd64/try/c/clang_-march=native_-Os_-fwrapv_-Qunused-arguments_-fPIC_-fPIE_-gdwarf-4_-Wall/constbranchindex/crypto_hash/sha256/rust_crypto/work/try-anything.c:353: undefined reference to `cpucycles_amd64rdpmc'
try.c: /usr/bin/ld: .../supercop-data/jasper/amd64/try/c/clang_-march=native_-Os_-fwrapv_-Qunused-arguments_-fPIC_-fPIE_-gdwarf-4_-Wall/constbranchindex/crypto_hash/sha256/rust_crypto/work/try-anything.c:356: undefined reference to `cpucycles_amd64rdpmc'
try.c: collect2: error: ld returned 1 exit status
try.c:
try.c:
try.c: error: aborting due to previous error
try.c:
try.c: error: could not compile `crypto_hash_sha256`.
try.c:
try.c: To learn more, run the command again with --verbose.
Number of similar (implementation,compiler) pairs: 1, namely:
Implementation | Compiler |
rust_crypto | clang -march=native -Os -fwrapv -Qunused-arguments -fPIC -fPIE -gdwarf-4 -Wall (Debian_Clang_11.0.1) |
Compiler output
try.c: error: linking with `cc` failed: exit code: 1
try.c: |
try.c: = note: "cc" "-Wl,--as-needed" "-Wl,-z,noexecstack" "-m64" "-Wl,--eh-frame-hdr" "-L" "/usr/lib/rustlib/x86_64-unknown-linux-gnu/lib" ".../supercop-data/jasper/amd64/try/c/clang_-mcpu=native_-O3_-fwrapv_-Qunused-arguments_-fPIC_-fPIE_-gdwarf-4_-Wall/constbranchindex/crypto_hash/sha256/rust_crypto/work/target/release/deps/try-baac04c777a2678c.try.dtsbxaoj-cgu.0.rcgu.o" ".../supercop-data/jasper/amd64/try/c/clang_-mcpu=native_-O3_-fwrapv_-Qunused-arguments_-fPIC_-fPIE_-gdwarf-4_-Wall/constbranchindex/crypto_hash/sha256/rust_crypto/work/target/release/deps/try-baac04c777a2678c.try.dtsbxaoj-cgu.1.rcgu.o" ".../supercop-data/jasper/amd64/try/c/clang_-mcpu=native_-O3_-fwrapv_-Qunused-arguments_-fPIC_-fPIE_-gdwarf-4_-Wall/constbranchindex/crypto_hash/sha256/rust_crypto/work/target/release/deps/try-baac04c777a2678c.try.dtsbxaoj-cgu.2.rcgu.o" ".../supercop-data/jasper/amd64/try/c/clang_-mcpu=native_-O3_-fwrapv_-Qunused-arguments_-fPIC_-fPIE_-gdwarf-4_-Wall/constbranchindex/crypto_hash/sha256/rust_crypto/work/target/release/deps/try-baac04c777a2678c.try.dtsbxaoj-cgu.3.rcgu.o" ".../supercop-data/jasper/amd64/try/c/clang_-mcpu=native_-O3_-fwrapv_-Qunused-arguments_-fPIC_-fPIE_-gdwarf-4_-Wall/constbranchindex/crypto_hash/sha256/rust_crypto/work/target/release/deps/try-baac04c777a2678c.try.dtsbxaoj-cgu.4.rcgu.o" "-o" ".../supercop-data/jasper/amd64/try/c/clang_-mcpu=native_-O3_-fwrapv_-Qunused-arguments_-fPIC_-fPIE_-gdwarf-4_-Wall/constbranchindex/crypto_hash/sha256/rust_crypto/work/target/release/deps/try-baac04c777a2678c" ".../supercop-data/jasper/amd64/try/c/clang_-mcpu=native_-O3_-fwrapv_-Qunused-arguments_-fPIC_-fPIE_-gdwarf-4_-Wall/constbranchindex/crypto_hash/sha256/rust_crypto/work/target/release/deps/try-baac04c777a2678c.1g22a3jq6o5wtxe0.rcgu.o" "-Wl,--gc-sections" "-pie" "-Wl,-zrelro" "-Wl,-znow" "-Wl,-O1" "-nodefaultlibs" "-L" ".../supercop-data/jasper/amd64/try/c/clang_-mcpu=native_-O3_-fwrapv_-Qunused-arguments_-fPIC_-fPIE_-gdwarf-4_-Wall/constbranchindex/crypto_hash/sha256/rust_crypto/work/target/release/deps" "-L" ".../supercop-data/jasper/amd64/lib" "-L" ".../supercop-data/jasper/amd64/try/c/clang_-mcpu=native_-O3_-fwrapv_-Qunused-arguments_-fPIC_-fPIE_-gdwarf-4_-Wall/constbranchindex/crypto_hash/sha256/rust_crypto/work/target/release/build/crypto_hash_sha256-5cd230be06f90398/out" "-L" ".../supercop-data/jasper/amd64/try/c/clang_-mcpu=native_-O3_-fwrapv_-Qunused-arguments_-fPIC_-fPIE_-gdwarf-4_-Wall/constbranchindex/crypto_hash/sha256/rust_crypto/work/target/release/build/rust-crypto-afe9b4ff19c80bbc/out" "-L" "/usr/lib/rustlib/x86_64-unknown-linux-gnu/lib" "-ltry-anything" "-ltry" "-lsupercop" "-lkernelrandombytes" "-lcpucycles" "-lcrypto" "-lnsl" "-lm" "-Wl,-Bstatic" ".../supercop-data/jasper/amd64/try/c/clang_-mcpu=native_-O3_-fwrapv_-Qunused-arguments_-fPIC_-fPIE_-gdwarf-4_-Wall/constbranchindex/crypto_hash/sha256/rust_crypto/work/target/release/deps/libcrypto_hash_sha256-b6dc07f49da86745.rlib" ".../supercop-data/jasper/amd64/try/c/clang_-mcpu=native_-O3_-fwrapv_-Qunused-arguments_-fPIC_-fPIE_-gdwarf-4_-Wall/constbranchindex/crypto_hash/sha256/rust_crypto/work/target/release/deps/libcrypto-83ceebf3c7290f98.rlib" ".../supercop-data/jasper/amd64/try/c/clang_-mcpu=native_-O3_-fwrapv_-Qunused-arguments_-fPIC_-fPIE_-gdwarf-4_-Wall/constbranchindex/crypto_hash/sha256/rust_crypto/work/target/release/deps/libtime-b473882f9f54487c.rlib" ".../supercop-data/jasper/amd64/try/c/clang_-mcpu=native_-O3_-fwrapv_-Qunused-arguments_-fPIC_-fPIE_-gdwarf-4_-Wall/constbranchindex/crypto_hash/sha256/rust_crypto/work/target/release/deps/librustc_serialize-72942cfdca4fb518.rlib" ".../supercop-data/jasper/amd64/try/c/clang_-mcpu=native_-O3_-fwrapv_-Qunused-arguments_-fPIC_-fPIE_-gdwarf-4_-Wall/constbranchindex/crypto_hash/sha256/rust_crypto/work/target/release/deps/librand-2cdf248a3f2ca473.rlib" ".../supercop-data/jasper/amd64/try/c/clang_-mcpu=native_-O3_-fwrapv_-Qunused-arguments_-fPIC_-fPIE_-gdwarf-4_-Wall/constbranchindex/crypto_hash/sha256/rust_crypto/work/target/release/deps/librand-7df229a95dbcb448.rlib" ".../supercop-data/jasper/amd64/try/c/clang_-mcpu=native_-O3_-fwrapv_-Qunused-arguments_-fPIC_-fPIE_-gdwarf-4_-Wall/constbranchindex/crypto_hash/sha256/rust_crypto/work/target/release/deps/liblibc-141c671f2ddc755d.rlib" "-Wl,--start-group" "/usr/lib/rustlib/x86_64-unknown-linux-gnu/lib/libstd-6bf3f16f340782ca.rlib" "/usr/lib/rustlib/x86_64-unknown-linux-gnu/lib/libpanic_unwind-13f3099d50c21bc6.rlib" "/usr/lib/rustlib/x86_64-unknown-linux-gnu/lib/libminiz_oxide-a2ba33c985785afe.rlib" "/usr/lib/rustlib/x86_64-unknown-linux-gnu/lib/libadler-3f6e9f8f4afbea6d.rlib" "/usr/lib/rustlib/x86_64-unknown-linux-gnu/lib/libobject-af517d7f13e7c960.rlib" "/usr/lib/rustlib/x86_64-unknown-linux-gnu/lib/libaddr2line-12740563628e601f.rlib" "/usr/lib/rustlib/x86_64-unknown-linux-gnu/lib/libgimli-0ac82a1e1820dd21.rlib" "/usr/lib/rustlib/x86_64-unknown-linux-gnu/lib/librustc_demangle-3ac2d0878c297d42.rlib" "/usr/lib/rustlib/x86_64-unknown-linux-gnu/lib/libhashbrown-c6632ca171f954dd.rlib" "/usr/lib/rustlib/x86_64-unknown-linux-gnu/lib/librustc_std_workspace_alloc-b5bfd0198c7b740d.rlib" "/usr/lib/rustlib/x86_64-unknown-linux-gnu/lib/libunwind-bd645b20c6c7b56d.rlib" "/usr/lib/rustlib/x86_64-unknown-linux-gnu/lib/libcfg_if-b9e1e523c0c29a77.rlib" "/usr/lib/rustlib/x86_64-unknown-linux-gnu/lib/liblibc-dfbef8c525de0186.rlib" "/usr/lib/rustlib/x86_64-unknown-linux-gnu/lib/liballoc-1ebf406bd4ea5769.rlib" "/usr/lib/rustlib/x86_64-unknown-linux-gnu/lib/librustc_std_workspace_core-5e0675f526ef5c6b.rlib" "/usr/lib/rustlib/x86_64-unknown-linux-gnu/lib/libcore-3375e4f89d420e7a.rlib" "-Wl,--end-group" "/usr/lib/rustlib/x86_64-unknown-linux-gnu/lib/libcompiler_builtins-f74b197469e67088.rlib" "-Wl,-Bdynamic" "-lgcc_s" "-lc" "-lm" "-lrt" "-lpthread" "-lutil" "-ldl" "-lutil"
try.c: = note: /usr/bin/ld: .../supercop-data/jasper/amd64/try/c/clang_-mcpu=native_-O3_-fwrapv_-Qunused-arguments_-fPIC_-fPIE_-gdwarf-4_-Wall/constbranchindex/crypto_hash/sha256/rust_crypto/work/target/release/build/crypto_hash_sha256-5cd230be06f90398/out/libtry-anything.a(try-anything.o): in function `c_main':
try.c: .../supercop-data/jasper/amd64/try/c/clang_-mcpu=native_-O3_-fwrapv_-Qunused-arguments_-fPIC_-fPIE_-gdwarf-4_-Wall/constbranchindex/crypto_hash/sha256/rust_crypto/work/try-anything.c:331: undefined reference to `cpucycles_amd64rdpmc'
try.c: /usr/bin/ld: .../supercop-data/jasper/amd64/try/c/clang_-mcpu=native_-O3_-fwrapv_-Qunused-arguments_-fPIC_-fPIE_-gdwarf-4_-Wall/constbranchindex/crypto_hash/sha256/rust_crypto/work/try-anything.c:332: undefined reference to `cpucycles_amd64rdpmc'
try.c: /usr/bin/ld: .../supercop-data/jasper/amd64/try/c/clang_-mcpu=native_-O3_-fwrapv_-Qunused-arguments_-fPIC_-fPIE_-gdwarf-4_-Wall/constbranchindex/crypto_hash/sha256/rust_crypto/work/try-anything.c:333: undefined reference to `cpucycles_amd64rdpmc_persecond'
try.c: /usr/bin/ld: .../supercop-data/jasper/amd64/try/c/clang_-mcpu=native_-O3_-fwrapv_-Qunused-arguments_-fPIC_-fPIE_-gdwarf-4_-Wall/constbranchindex/crypto_hash/sha256/rust_crypto/work/try-anything.c:344: undefined reference to `cpucycles_amd64rdpmc'
try.c: /usr/bin/ld: .../supercop-data/jasper/amd64/try/c/clang_-mcpu=native_-O3_-fwrapv_-Qunused-arguments_-fPIC_-fPIE_-gdwarf-4_-Wall/constbranchindex/crypto_hash/sha256/rust_crypto/work/try-anything.c:346: undefined reference to `cpucycles_amd64rdpmc'
try.c: /usr/bin/ld: .../supercop-data/jasper/amd64/try/c/clang_-mcpu=native_-O3_-fwrapv_-Qunused-arguments_-fPIC_-fPIE_-gdwarf-4_-Wall/constbranchindex/crypto_hash/sha256/rust_crypto/work/try-anything.c:353: undefined reference to `cpucycles_amd64rdpmc'
try.c: /usr/bin/ld: .../supercop-data/jasper/amd64/try/c/clang_-mcpu=native_-O3_-fwrapv_-Qunused-arguments_-fPIC_-fPIE_-gdwarf-4_-Wall/constbranchindex/crypto_hash/sha256/rust_crypto/work/try-anything.c:356: undefined reference to `cpucycles_amd64rdpmc'
try.c: collect2: error: ld returned 1 exit status
try.c:
try.c:
try.c: error: aborting due to previous error
try.c:
try.c: error: could not compile `crypto_hash_sha256`.
try.c:
try.c: To learn more, run the command again with --verbose.
Number of similar (implementation,compiler) pairs: 1, namely:
Implementation | Compiler |
rust_crypto | clang -mcpu=native -O3 -fwrapv -Qunused-arguments -fPIC -fPIE -gdwarf-4 -Wall (Debian_Clang_11.0.1) |
Compiler output
try.c: error: linking with `cc` failed: exit code: 1
try.c: |
try.c: = note: "cc" "-Wl,--as-needed" "-Wl,-z,noexecstack" "-m64" "-Wl,--eh-frame-hdr" "-L" "/usr/lib/rustlib/x86_64-unknown-linux-gnu/lib" ".../supercop-data/jasper/amd64/try/c/gcc_-march=native_-mtune=native_-O2_-fwrapv_-fPIC_-fPIE_-gdwarf-4_-Wall/constbranchindex/crypto_hash/sha256/rust_crypto/work/target/release/deps/try_small-f566cacc72890263.try_small.83ks8n5m-cgu.0.rcgu.o" ".../supercop-data/jasper/amd64/try/c/gcc_-march=native_-mtune=native_-O2_-fwrapv_-fPIC_-fPIE_-gdwarf-4_-Wall/constbranchindex/crypto_hash/sha256/rust_crypto/work/target/release/deps/try_small-f566cacc72890263.try_small.83ks8n5m-cgu.1.rcgu.o" ".../supercop-data/jasper/amd64/try/c/gcc_-march=native_-mtune=native_-O2_-fwrapv_-fPIC_-fPIE_-gdwarf-4_-Wall/constbranchindex/crypto_hash/sha256/rust_crypto/work/target/release/deps/try_small-f566cacc72890263.try_small.83ks8n5m-cgu.2.rcgu.o" ".../supercop-data/jasper/amd64/try/c/gcc_-march=native_-mtune=native_-O2_-fwrapv_-fPIC_-fPIE_-gdwarf-4_-Wall/constbranchindex/crypto_hash/sha256/rust_crypto/work/target/release/deps/try_small-f566cacc72890263.try_small.83ks8n5m-cgu.3.rcgu.o" ".../supercop-data/jasper/amd64/try/c/gcc_-march=native_-mtune=native_-O2_-fwrapv_-fPIC_-fPIE_-gdwarf-4_-Wall/constbranchindex/crypto_hash/sha256/rust_crypto/work/target/release/deps/try_small-f566cacc72890263.try_small.83ks8n5m-cgu.4.rcgu.o" "-o" ".../supercop-data/jasper/amd64/try/c/gcc_-march=native_-mtune=native_-O2_-fwrapv_-fPIC_-fPIE_-gdwarf-4_-Wall/constbranchindex/crypto_hash/sha256/rust_crypto/work/target/release/deps/try_small-f566cacc72890263" ".../supercop-data/jasper/amd64/try/c/gcc_-march=native_-mtune=native_-O2_-fwrapv_-fPIC_-fPIE_-gdwarf-4_-Wall/constbranchindex/crypto_hash/sha256/rust_crypto/work/target/release/deps/try_small-f566cacc72890263.2yzzwl19n3ayhtwn.rcgu.o" "-Wl,--gc-sections" "-pie" "-Wl,-zrelro" "-Wl,-znow" "-Wl,-O1" "-nodefaultlibs" "-L" ".../supercop-data/jasper/amd64/try/c/gcc_-march=native_-mtune=native_-O2_-fwrapv_-fPIC_-fPIE_-gdwarf-4_-Wall/constbranchindex/crypto_hash/sha256/rust_crypto/work/target/release/deps" "-L" ".../supercop-data/jasper/amd64/lib" "-L" ".../supercop-data/jasper/amd64/try/c/gcc_-march=native_-mtune=native_-O2_-fwrapv_-fPIC_-fPIE_-gdwarf-4_-Wall/constbranchindex/crypto_hash/sha256/rust_crypto/work/target/release/build/crypto_hash_sha256-5cd230be06f90398/out" "-L" ".../supercop-data/jasper/amd64/try/c/gcc_-march=native_-mtune=native_-O2_-fwrapv_-fPIC_-fPIE_-gdwarf-4_-Wall/constbranchindex/crypto_hash/sha256/rust_crypto/work/target/release/build/rust-crypto-afe9b4ff19c80bbc/out" "-L" "/usr/lib/rustlib/x86_64-unknown-linux-gnu/lib" "-ltry-anything" "-ltry-small" "-lsupercop" "-lkernelrandombytes" "-lcpucycles" "-lcrypto" "-lnsl" "-lm" "-Wl,-Bstatic" ".../supercop-data/jasper/amd64/try/c/gcc_-march=native_-mtune=native_-O2_-fwrapv_-fPIC_-fPIE_-gdwarf-4_-Wall/constbranchindex/crypto_hash/sha256/rust_crypto/work/target/release/deps/libcrypto_hash_sha256-b6dc07f49da86745.rlib" ".../supercop-data/jasper/amd64/try/c/gcc_-march=native_-mtune=native_-O2_-fwrapv_-fPIC_-fPIE_-gdwarf-4_-Wall/constbranchindex/crypto_hash/sha256/rust_crypto/work/target/release/deps/libcrypto-83ceebf3c7290f98.rlib" ".../supercop-data/jasper/amd64/try/c/gcc_-march=native_-mtune=native_-O2_-fwrapv_-fPIC_-fPIE_-gdwarf-4_-Wall/constbranchindex/crypto_hash/sha256/rust_crypto/work/target/release/deps/libtime-b473882f9f54487c.rlib" ".../supercop-data/jasper/amd64/try/c/gcc_-march=native_-mtune=native_-O2_-fwrapv_-fPIC_-fPIE_-gdwarf-4_-Wall/constbranchindex/crypto_hash/sha256/rust_crypto/work/target/release/deps/librustc_serialize-72942cfdca4fb518.rlib" ".../supercop-data/jasper/amd64/try/c/gcc_-march=native_-mtune=native_-O2_-fwrapv_-fPIC_-fPIE_-gdwarf-4_-Wall/constbranchindex/crypto_hash/sha256/rust_crypto/work/target/release/deps/librand-2cdf248a3f2ca473.rlib" ".../supercop-data/jasper/amd64/try/c/gcc_-march=native_-mtune=native_-O2_-fwrapv_-fPIC_-fPIE_-gdwarf-4_-Wall/constbranchindex/crypto_hash/sha256/rust_crypto/work/target/release/deps/librand-7df229a95dbcb448.rlib" ".../supercop-data/jasper/amd64/try/c/gcc_-march=native_-mtune=native_-O2_-fwrapv_-fPIC_-fPIE_-gdwarf-4_-Wall/constbranchindex/crypto_hash/sha256/rust_crypto/work/target/release/deps/liblibc-141c671f2ddc755d.rlib" "-Wl,--start-group" "/usr/lib/rustlib/x86_64-unknown-linux-gnu/lib/libstd-6bf3f16f340782ca.rlib" "/usr/lib/rustlib/x86_64-unknown-linux-gnu/lib/libpanic_unwind-13f3099d50c21bc6.rlib" "/usr/lib/rustlib/x86_64-unknown-linux-gnu/lib/libminiz_oxide-a2ba33c985785afe.rlib" "/usr/lib/rustlib/x86_64-unknown-linux-gnu/lib/libadler-3f6e9f8f4afbea6d.rlib" "/usr/lib/rustlib/x86_64-unknown-linux-gnu/lib/libobject-af517d7f13e7c960.rlib" "/usr/lib/rustlib/x86_64-unknown-linux-gnu/lib/libaddr2line-12740563628e601f.rlib" "/usr/lib/rustlib/x86_64-unknown-linux-gnu/lib/libgimli-0ac82a1e1820dd21.rlib" "/usr/lib/rustlib/x86_64-unknown-linux-gnu/lib/librustc_demangle-3ac2d0878c297d42.rlib" "/usr/lib/rustlib/x86_64-unknown-linux-gnu/lib/libhashbrown-c6632ca171f954dd.rlib" "/usr/lib/rustlib/x86_64-unknown-linux-gnu/lib/librustc_std_workspace_alloc-b5bfd0198c7b740d.rlib" "/usr/lib/rustlib/x86_64-unknown-linux-gnu/lib/libunwind-bd645b20c6c7b56d.rlib" "/usr/lib/rustlib/x86_64-unknown-linux-gnu/lib/libcfg_if-b9e1e523c0c29a77.rlib" "/usr/lib/rustlib/x86_64-unknown-linux-gnu/lib/liblibc-dfbef8c525de0186.rlib" "/usr/lib/rustlib/x86_64-unknown-linux-gnu/lib/liballoc-1ebf406bd4ea5769.rlib" "/usr/lib/rustlib/x86_64-unknown-linux-gnu/lib/librustc_std_workspace_core-5e0675f526ef5c6b.rlib" "/usr/lib/rustlib/x86_64-unknown-linux-gnu/lib/libcore-3375e4f89d420e7a.rlib" "-Wl,--end-group" "/usr/lib/rustlib/x86_64-unknown-linux-gnu/lib/libcompiler_builtins-f74b197469e67088.rlib" "-Wl,-Bdynamic" "-lgcc_s" "-lc" "-lm" "-lrt" "-lpthread" "-lutil" "-ldl" "-lutil"
try.c: = note: /usr/bin/ld: .../supercop-data/jasper/amd64/try/c/gcc_-march=native_-mtune=native_-O2_-fwrapv_-fPIC_-fPIE_-gdwarf-4_-Wall/constbranchindex/crypto_hash/sha256/rust_crypto/work/target/release/build/crypto_hash_sha256-5cd230be06f90398/out/libtry-anything.a(try-anything.o): in function `c_main':
try.c: .../supercop-data/jasper/amd64/try/c/gcc_-march=native_-mtune=native_-O2_-fwrapv_-fPIC_-fPIE_-gdwarf-4_-Wall/constbranchindex/crypto_hash/sha256/rust_crypto/work/try-anything.c:331: undefined reference to `cpucycles_amd64rdpmc'
try.c: /usr/bin/ld: .../supercop-data/jasper/amd64/try/c/gcc_-march=native_-mtune=native_-O2_-fwrapv_-fPIC_-fPIE_-gdwarf-4_-Wall/constbranchindex/crypto_hash/sha256/rust_crypto/work/try-anything.c:332: undefined reference to `cpucycles_amd64rdpmc'
try.c: /usr/bin/ld: .../supercop-data/jasper/amd64/try/c/gcc_-march=native_-mtune=native_-O2_-fwrapv_-fPIC_-fPIE_-gdwarf-4_-Wall/constbranchindex/crypto_hash/sha256/rust_crypto/work/try-anything.c:333: undefined reference to `cpucycles_amd64rdpmc_persecond'
try.c: /usr/bin/ld: .../supercop-data/jasper/amd64/try/c/gcc_-march=native_-mtune=native_-O2_-fwrapv_-fPIC_-fPIE_-gdwarf-4_-Wall/constbranchindex/crypto_hash/sha256/rust_crypto/work/try-anything.c:344: undefined reference to `cpucycles_amd64rdpmc'
try.c: /usr/bin/ld: .../supercop-data/jasper/amd64/try/c/gcc_-march=native_-mtune=native_-O2_-fwrapv_-fPIC_-fPIE_-gdwarf-4_-Wall/constbranchindex/crypto_hash/sha256/rust_crypto/work/try-anything.c:346: undefined reference to `cpucycles_amd64rdpmc'
try.c: /usr/bin/ld: .../supercop-data/jasper/amd64/try/c/gcc_-march=native_-mtune=native_-O2_-fwrapv_-fPIC_-fPIE_-gdwarf-4_-Wall/constbranchindex/crypto_hash/sha256/rust_crypto/work/try-anything.c:353: undefined reference to `cpucycles_amd64rdpmc'
try.c: /usr/bin/ld: .../supercop-data/jasper/amd64/try/c/gcc_-march=native_-mtune=native_-O2_-fwrapv_-fPIC_-fPIE_-gdwarf-4_-Wall/constbranchindex/crypto_hash/sha256/rust_crypto/work/try-anything.c:356: undefined reference to `cpucycles_amd64rdpmc'
try.c: collect2: error: ld returned 1 exit status
try.c:
try.c:
try.c: error: aborting due to previous error
try.c:
try.c: error: could not compile `crypto_hash_sha256`.
try.c:
try.c: To learn more, run the command again with --verbose.
Number of similar (implementation,compiler) pairs: 1, namely:
Implementation | Compiler |
rust_crypto | gcc -march=native -mtune=native -O2 -fwrapv -fPIC -fPIE -gdwarf-4 -Wall (10.2.1_20210110) |
Compiler output
try.c: error: linking with `cc` failed: exit code: 1
try.c: |
try.c: = note: "cc" "-Wl,--as-needed" "-Wl,-z,noexecstack" "-m64" "-Wl,--eh-frame-hdr" "-L" "/usr/lib/rustlib/x86_64-unknown-linux-gnu/lib" ".../supercop-data/jasper/amd64/try/c/gcc_-march=native_-mtune=native_-O3_-fwrapv_-fPIC_-fPIE_-gdwarf-4_-Wall/constbranchindex/crypto_hash/sha256/rust_crypto/work/target/release/deps/measure-e6f8efcfbea4e30e.measure.2yz52fdu-cgu.0.rcgu.o" ".../supercop-data/jasper/amd64/try/c/gcc_-march=native_-mtune=native_-O3_-fwrapv_-fPIC_-fPIE_-gdwarf-4_-Wall/constbranchindex/crypto_hash/sha256/rust_crypto/work/target/release/deps/measure-e6f8efcfbea4e30e.measure.2yz52fdu-cgu.1.rcgu.o" ".../supercop-data/jasper/amd64/try/c/gcc_-march=native_-mtune=native_-O3_-fwrapv_-fPIC_-fPIE_-gdwarf-4_-Wall/constbranchindex/crypto_hash/sha256/rust_crypto/work/target/release/deps/measure-e6f8efcfbea4e30e.measure.2yz52fdu-cgu.2.rcgu.o" ".../supercop-data/jasper/amd64/try/c/gcc_-march=native_-mtune=native_-O3_-fwrapv_-fPIC_-fPIE_-gdwarf-4_-Wall/constbranchindex/crypto_hash/sha256/rust_crypto/work/target/release/deps/measure-e6f8efcfbea4e30e.measure.2yz52fdu-cgu.3.rcgu.o" ".../supercop-data/jasper/amd64/try/c/gcc_-march=native_-mtune=native_-O3_-fwrapv_-fPIC_-fPIE_-gdwarf-4_-Wall/constbranchindex/crypto_hash/sha256/rust_crypto/work/target/release/deps/measure-e6f8efcfbea4e30e.measure.2yz52fdu-cgu.4.rcgu.o" "-o" ".../supercop-data/jasper/amd64/try/c/gcc_-march=native_-mtune=native_-O3_-fwrapv_-fPIC_-fPIE_-gdwarf-4_-Wall/constbranchindex/crypto_hash/sha256/rust_crypto/work/target/release/deps/measure-e6f8efcfbea4e30e" ".../supercop-data/jasper/amd64/try/c/gcc_-march=native_-mtune=native_-O3_-fwrapv_-fPIC_-fPIE_-gdwarf-4_-Wall/constbranchindex/crypto_hash/sha256/rust_crypto/work/target/release/deps/measure-e6f8efcfbea4e30e.2vbk2gyir92gcind.rcgu.o" "-Wl,--gc-sections" "-pie" "-Wl,-zrelro" "-Wl,-znow" "-Wl,-O1" "-nodefaultlibs" "-L" ".../supercop-data/jasper/amd64/try/c/gcc_-march=native_-mtune=native_-O3_-fwrapv_-fPIC_-fPIE_-gdwarf-4_-Wall/constbranchindex/crypto_hash/sha256/rust_crypto/work/target/release/deps" "-L" ".../supercop-data/jasper/amd64/lib" "-L" ".../supercop-data/jasper/amd64/try/c/gcc_-march=native_-mtune=native_-O3_-fwrapv_-fPIC_-fPIE_-gdwarf-4_-Wall/constbranchindex/crypto_hash/sha256/rust_crypto/work/target/release/build/crypto_hash_sha256-5cd230be06f90398/out" "-L" ".../supercop-data/jasper/amd64/try/c/gcc_-march=native_-mtune=native_-O3_-fwrapv_-fPIC_-fPIE_-gdwarf-4_-Wall/constbranchindex/crypto_hash/sha256/rust_crypto/work/target/release/build/rust-crypto-afe9b4ff19c80bbc/out" "-L" "/usr/lib/rustlib/x86_64-unknown-linux-gnu/lib" "-lmeasure-anything" "-lmeasure" "-lsupercop" "-lkernelrandombytes" "-lcpucycles" "-lcrypto" "-lnsl" "-lm" "-Wl,-Bstatic" ".../supercop-data/jasper/amd64/try/c/gcc_-march=native_-mtune=native_-O3_-fwrapv_-fPIC_-fPIE_-gdwarf-4_-Wall/constbranchindex/crypto_hash/sha256/rust_crypto/work/target/release/deps/libcrypto_hash_sha256-b6dc07f49da86745.rlib" ".../supercop-data/jasper/amd64/try/c/gcc_-march=native_-mtune=native_-O3_-fwrapv_-fPIC_-fPIE_-gdwarf-4_-Wall/constbranchindex/crypto_hash/sha256/rust_crypto/work/target/release/deps/libcrypto-83ceebf3c7290f98.rlib" ".../supercop-data/jasper/amd64/try/c/gcc_-march=native_-mtune=native_-O3_-fwrapv_-fPIC_-fPIE_-gdwarf-4_-Wall/constbranchindex/crypto_hash/sha256/rust_crypto/work/target/release/deps/libtime-b473882f9f54487c.rlib" ".../supercop-data/jasper/amd64/try/c/gcc_-march=native_-mtune=native_-O3_-fwrapv_-fPIC_-fPIE_-gdwarf-4_-Wall/constbranchindex/crypto_hash/sha256/rust_crypto/work/target/release/deps/librustc_serialize-72942cfdca4fb518.rlib" ".../supercop-data/jasper/amd64/try/c/gcc_-march=native_-mtune=native_-O3_-fwrapv_-fPIC_-fPIE_-gdwarf-4_-Wall/constbranchindex/crypto_hash/sha256/rust_crypto/work/target/release/deps/librand-2cdf248a3f2ca473.rlib" ".../supercop-data/jasper/amd64/try/c/gcc_-march=native_-mtune=native_-O3_-fwrapv_-fPIC_-fPIE_-gdwarf-4_-Wall/constbranchindex/crypto_hash/sha256/rust_crypto/work/target/release/deps/librand-7df229a95dbcb448.rlib" ".../supercop-data/jasper/amd64/try/c/gcc_-march=native_-mtune=native_-O3_-fwrapv_-fPIC_-fPIE_-gdwarf-4_-Wall/constbranchindex/crypto_hash/sha256/rust_crypto/work/target/release/deps/liblibc-141c671f2ddc755d.rlib" "-Wl,--start-group" "/usr/lib/rustlib/x86_64-unknown-linux-gnu/lib/libstd-6bf3f16f340782ca.rlib" "/usr/lib/rustlib/x86_64-unknown-linux-gnu/lib/libpanic_unwind-13f3099d50c21bc6.rlib" "/usr/lib/rustlib/x86_64-unknown-linux-gnu/lib/libminiz_oxide-a2ba33c985785afe.rlib" "/usr/lib/rustlib/x86_64-unknown-linux-gnu/lib/libadler-3f6e9f8f4afbea6d.rlib" "/usr/lib/rustlib/x86_64-unknown-linux-gnu/lib/libobject-af517d7f13e7c960.rlib" "/usr/lib/rustlib/x86_64-unknown-linux-gnu/lib/libaddr2line-12740563628e601f.rlib" "/usr/lib/rustlib/x86_64-unknown-linux-gnu/lib/libgimli-0ac82a1e1820dd21.rlib" "/usr/lib/rustlib/x86_64-unknown-linux-gnu/lib/librustc_demangle-3ac2d0878c297d42.rlib" "/usr/lib/rustlib/x86_64-unknown-linux-gnu/lib/libhashbrown-c6632ca171f954dd.rlib" "/usr/lib/rustlib/x86_64-unknown-linux-gnu/lib/librustc_std_workspace_alloc-b5bfd0198c7b740d.rlib" "/usr/lib/rustlib/x86_64-unknown-linux-gnu/lib/libunwind-bd645b20c6c7b56d.rlib" "/usr/lib/rustlib/x86_64-unknown-linux-gnu/lib/libcfg_if-b9e1e523c0c29a77.rlib" "/usr/lib/rustlib/x86_64-unknown-linux-gnu/lib/liblibc-dfbef8c525de0186.rlib" "/usr/lib/rustlib/x86_64-unknown-linux-gnu/lib/liballoc-1ebf406bd4ea5769.rlib" "/usr/lib/rustlib/x86_64-unknown-linux-gnu/lib/librustc_std_workspace_core-5e0675f526ef5c6b.rlib" "/usr/lib/rustlib/x86_64-unknown-linux-gnu/lib/libcore-3375e4f89d420e7a.rlib" "-Wl,--end-group" "/usr/lib/rustlib/x86_64-unknown-linux-gnu/lib/libcompiler_builtins-f74b197469e67088.rlib" "-Wl,-Bdynamic" "-lgcc_s" "-lc" "-lm" "-lrt" "-lpthread" "-lutil" "-ldl" "-lutil"
try.c: = note: /usr/bin/ld: .../supercop-data/jasper/amd64/try/c/gcc_-march=native_-mtune=native_-O3_-fwrapv_-fPIC_-fPIE_-gdwarf-4_-Wall/constbranchindex/crypto_hash/sha256/rust_crypto/work/target/release/build/crypto_hash_sha256-5cd230be06f90398/out/libmeasure-anything.a(measure-anything.o): in function `c_main':
try.c: .../supercop-data/jasper/amd64/try/c/gcc_-march=native_-mtune=native_-O3_-fwrapv_-fPIC_-fPIE_-gdwarf-4_-Wall/constbranchindex/crypto_hash/sha256/rust_crypto/work/measure-anything.c:178: undefined reference to `cpucycles_amd64rdpmc'
try.c: /usr/bin/ld: .../supercop-data/jasper/amd64/try/c/gcc_-march=native_-mtune=native_-O3_-fwrapv_-fPIC_-fPIE_-gdwarf-4_-Wall/constbranchindex/crypto_hash/sha256/rust_crypto/work/measure-anything.c:179: undefined reference to `cpucycles_amd64rdpmc'
try.c: /usr/bin/ld: .../supercop-data/jasper/amd64/try/c/gcc_-march=native_-mtune=native_-O3_-fwrapv_-fPIC_-fPIE_-gdwarf-4_-Wall/constbranchindex/crypto_hash/sha256/rust_crypto/work/measure-anything.c:180: undefined reference to `cpucycles_amd64rdpmc_persecond'
try.c: /usr/bin/ld: .../supercop-data/jasper/amd64/try/c/gcc_-march=native_-mtune=native_-O3_-fwrapv_-fPIC_-fPIE_-gdwarf-4_-Wall/constbranchindex/crypto_hash/sha256/rust_crypto/work/target/release/build/crypto_hash_sha256-5cd230be06f90398/out/libmeasure.a(measure.o): in function `measure':
try.c: .../supercop-data/jasper/amd64/try/c/gcc_-march=native_-mtune=native_-O3_-fwrapv_-fPIC_-fPIE_-gdwarf-4_-Wall/constbranchindex/crypto_hash/sha256/rust_crypto/work/measure.c:56: undefined reference to `cpucycles_amd64rdpmc'
try.c: collect2: error: ld returned 1 exit status
try.c:
try.c:
try.c: error: aborting due to previous error
try.c:
try.c: error: could not compile `crypto_hash_sha256`.
try.c:
try.c: To learn more, run the command again with --verbose.
Number of similar (implementation,compiler) pairs: 1, namely:
Implementation | Compiler |
rust_crypto | gcc -march=native -mtune=native -O3 -fwrapv -fPIC -fPIE -gdwarf-4 -Wall (10.2.1_20210110) |
Compiler output
try.c: error: linking with `cc` failed: exit code: 1
try.c: |
try.c: = note: "cc" "-Wl,--as-needed" "-Wl,-z,noexecstack" "-m64" "-Wl,--eh-frame-hdr" "-L" "/usr/lib/rustlib/x86_64-unknown-linux-gnu/lib" ".../supercop-data/jasper/amd64/try/c/gcc_-march=native_-mtune=native_-O_-fwrapv_-fPIC_-fPIE_-gdwarf-4_-Wall/constbranchindex/crypto_hash/sha256/rust_crypto/work/target/release/deps/try_small-f566cacc72890263.try_small.83ks8n5m-cgu.0.rcgu.o" ".../supercop-data/jasper/amd64/try/c/gcc_-march=native_-mtune=native_-O_-fwrapv_-fPIC_-fPIE_-gdwarf-4_-Wall/constbranchindex/crypto_hash/sha256/rust_crypto/work/target/release/deps/try_small-f566cacc72890263.try_small.83ks8n5m-cgu.1.rcgu.o" ".../supercop-data/jasper/amd64/try/c/gcc_-march=native_-mtune=native_-O_-fwrapv_-fPIC_-fPIE_-gdwarf-4_-Wall/constbranchindex/crypto_hash/sha256/rust_crypto/work/target/release/deps/try_small-f566cacc72890263.try_small.83ks8n5m-cgu.2.rcgu.o" ".../supercop-data/jasper/amd64/try/c/gcc_-march=native_-mtune=native_-O_-fwrapv_-fPIC_-fPIE_-gdwarf-4_-Wall/constbranchindex/crypto_hash/sha256/rust_crypto/work/target/release/deps/try_small-f566cacc72890263.try_small.83ks8n5m-cgu.3.rcgu.o" ".../supercop-data/jasper/amd64/try/c/gcc_-march=native_-mtune=native_-O_-fwrapv_-fPIC_-fPIE_-gdwarf-4_-Wall/constbranchindex/crypto_hash/sha256/rust_crypto/work/target/release/deps/try_small-f566cacc72890263.try_small.83ks8n5m-cgu.4.rcgu.o" "-o" ".../supercop-data/jasper/amd64/try/c/gcc_-march=native_-mtune=native_-O_-fwrapv_-fPIC_-fPIE_-gdwarf-4_-Wall/constbranchindex/crypto_hash/sha256/rust_crypto/work/target/release/deps/try_small-f566cacc72890263" ".../supercop-data/jasper/amd64/try/c/gcc_-march=native_-mtune=native_-O_-fwrapv_-fPIC_-fPIE_-gdwarf-4_-Wall/constbranchindex/crypto_hash/sha256/rust_crypto/work/target/release/deps/try_small-f566cacc72890263.2yzzwl19n3ayhtwn.rcgu.o" "-Wl,--gc-sections" "-pie" "-Wl,-zrelro" "-Wl,-znow" "-Wl,-O1" "-nodefaultlibs" "-L" ".../supercop-data/jasper/amd64/try/c/gcc_-march=native_-mtune=native_-O_-fwrapv_-fPIC_-fPIE_-gdwarf-4_-Wall/constbranchindex/crypto_hash/sha256/rust_crypto/work/target/release/deps" "-L" ".../supercop-data/jasper/amd64/lib" "-L" ".../supercop-data/jasper/amd64/try/c/gcc_-march=native_-mtune=native_-O_-fwrapv_-fPIC_-fPIE_-gdwarf-4_-Wall/constbranchindex/crypto_hash/sha256/rust_crypto/work/target/release/build/crypto_hash_sha256-5cd230be06f90398/out" "-L" ".../supercop-data/jasper/amd64/try/c/gcc_-march=native_-mtune=native_-O_-fwrapv_-fPIC_-fPIE_-gdwarf-4_-Wall/constbranchindex/crypto_hash/sha256/rust_crypto/work/target/release/build/rust-crypto-afe9b4ff19c80bbc/out" "-L" "/usr/lib/rustlib/x86_64-unknown-linux-gnu/lib" "-ltry-anything" "-ltry-small" "-lsupercop" "-lkernelrandombytes" "-lcpucycles" "-lcrypto" "-lnsl" "-lm" "-Wl,-Bstatic" ".../supercop-data/jasper/amd64/try/c/gcc_-march=native_-mtune=native_-O_-fwrapv_-fPIC_-fPIE_-gdwarf-4_-Wall/constbranchindex/crypto_hash/sha256/rust_crypto/work/target/release/deps/libcrypto_hash_sha256-b6dc07f49da86745.rlib" ".../supercop-data/jasper/amd64/try/c/gcc_-march=native_-mtune=native_-O_-fwrapv_-fPIC_-fPIE_-gdwarf-4_-Wall/constbranchindex/crypto_hash/sha256/rust_crypto/work/target/release/deps/libcrypto-83ceebf3c7290f98.rlib" ".../supercop-data/jasper/amd64/try/c/gcc_-march=native_-mtune=native_-O_-fwrapv_-fPIC_-fPIE_-gdwarf-4_-Wall/constbranchindex/crypto_hash/sha256/rust_crypto/work/target/release/deps/libtime-b473882f9f54487c.rlib" ".../supercop-data/jasper/amd64/try/c/gcc_-march=native_-mtune=native_-O_-fwrapv_-fPIC_-fPIE_-gdwarf-4_-Wall/constbranchindex/crypto_hash/sha256/rust_crypto/work/target/release/deps/librustc_serialize-72942cfdca4fb518.rlib" ".../supercop-data/jasper/amd64/try/c/gcc_-march=native_-mtune=native_-O_-fwrapv_-fPIC_-fPIE_-gdwarf-4_-Wall/constbranchindex/crypto_hash/sha256/rust_crypto/work/target/release/deps/librand-2cdf248a3f2ca473.rlib" ".../supercop-data/jasper/amd64/try/c/gcc_-march=native_-mtune=native_-O_-fwrapv_-fPIC_-fPIE_-gdwarf-4_-Wall/constbranchindex/crypto_hash/sha256/rust_crypto/work/target/release/deps/librand-7df229a95dbcb448.rlib" ".../supercop-data/jasper/amd64/try/c/gcc_-march=native_-mtune=native_-O_-fwrapv_-fPIC_-fPIE_-gdwarf-4_-Wall/constbranchindex/crypto_hash/sha256/rust_crypto/work/target/release/deps/liblibc-141c671f2ddc755d.rlib" "-Wl,--start-group" "/usr/lib/rustlib/x86_64-unknown-linux-gnu/lib/libstd-6bf3f16f340782ca.rlib" "/usr/lib/rustlib/x86_64-unknown-linux-gnu/lib/libpanic_unwind-13f3099d50c21bc6.rlib" "/usr/lib/rustlib/x86_64-unknown-linux-gnu/lib/libminiz_oxide-a2ba33c985785afe.rlib" "/usr/lib/rustlib/x86_64-unknown-linux-gnu/lib/libadler-3f6e9f8f4afbea6d.rlib" "/usr/lib/rustlib/x86_64-unknown-linux-gnu/lib/libobject-af517d7f13e7c960.rlib" "/usr/lib/rustlib/x86_64-unknown-linux-gnu/lib/libaddr2line-12740563628e601f.rlib" "/usr/lib/rustlib/x86_64-unknown-linux-gnu/lib/libgimli-0ac82a1e1820dd21.rlib" "/usr/lib/rustlib/x86_64-unknown-linux-gnu/lib/librustc_demangle-3ac2d0878c297d42.rlib" "/usr/lib/rustlib/x86_64-unknown-linux-gnu/lib/libhashbrown-c6632ca171f954dd.rlib" "/usr/lib/rustlib/x86_64-unknown-linux-gnu/lib/librustc_std_workspace_alloc-b5bfd0198c7b740d.rlib" "/usr/lib/rustlib/x86_64-unknown-linux-gnu/lib/libunwind-bd645b20c6c7b56d.rlib" "/usr/lib/rustlib/x86_64-unknown-linux-gnu/lib/libcfg_if-b9e1e523c0c29a77.rlib" "/usr/lib/rustlib/x86_64-unknown-linux-gnu/lib/liblibc-dfbef8c525de0186.rlib" "/usr/lib/rustlib/x86_64-unknown-linux-gnu/lib/liballoc-1ebf406bd4ea5769.rlib" "/usr/lib/rustlib/x86_64-unknown-linux-gnu/lib/librustc_std_workspace_core-5e0675f526ef5c6b.rlib" "/usr/lib/rustlib/x86_64-unknown-linux-gnu/lib/libcore-3375e4f89d420e7a.rlib" "-Wl,--end-group" "/usr/lib/rustlib/x86_64-unknown-linux-gnu/lib/libcompiler_builtins-f74b197469e67088.rlib" "-Wl,-Bdynamic" "-lgcc_s" "-lc" "-lm" "-lrt" "-lpthread" "-lutil" "-ldl" "-lutil"
try.c: = note: /usr/bin/ld: .../supercop-data/jasper/amd64/try/c/gcc_-march=native_-mtune=native_-O_-fwrapv_-fPIC_-fPIE_-gdwarf-4_-Wall/constbranchindex/crypto_hash/sha256/rust_crypto/work/target/release/build/crypto_hash_sha256-5cd230be06f90398/out/libtry-anything.a(try-anything.o): in function `c_main':
try.c: .../supercop-data/jasper/amd64/try/c/gcc_-march=native_-mtune=native_-O_-fwrapv_-fPIC_-fPIE_-gdwarf-4_-Wall/constbranchindex/crypto_hash/sha256/rust_crypto/work/try-anything.c:331: undefined reference to `cpucycles_amd64rdpmc'
try.c: /usr/bin/ld: .../supercop-data/jasper/amd64/try/c/gcc_-march=native_-mtune=native_-O_-fwrapv_-fPIC_-fPIE_-gdwarf-4_-Wall/constbranchindex/crypto_hash/sha256/rust_crypto/work/try-anything.c:332: undefined reference to `cpucycles_amd64rdpmc'
try.c: /usr/bin/ld: .../supercop-data/jasper/amd64/try/c/gcc_-march=native_-mtune=native_-O_-fwrapv_-fPIC_-fPIE_-gdwarf-4_-Wall/constbranchindex/crypto_hash/sha256/rust_crypto/work/try-anything.c:333: undefined reference to `cpucycles_amd64rdpmc_persecond'
try.c: /usr/bin/ld: .../supercop-data/jasper/amd64/try/c/gcc_-march=native_-mtune=native_-O_-fwrapv_-fPIC_-fPIE_-gdwarf-4_-Wall/constbranchindex/crypto_hash/sha256/rust_crypto/work/try-anything.c:344: undefined reference to `cpucycles_amd64rdpmc'
try.c: /usr/bin/ld: .../supercop-data/jasper/amd64/try/c/gcc_-march=native_-mtune=native_-O_-fwrapv_-fPIC_-fPIE_-gdwarf-4_-Wall/constbranchindex/crypto_hash/sha256/rust_crypto/work/try-anything.c:346: undefined reference to `cpucycles_amd64rdpmc'
try.c: /usr/bin/ld: .../supercop-data/jasper/amd64/try/c/gcc_-march=native_-mtune=native_-O_-fwrapv_-fPIC_-fPIE_-gdwarf-4_-Wall/constbranchindex/crypto_hash/sha256/rust_crypto/work/try-anything.c:353: undefined reference to `cpucycles_amd64rdpmc'
try.c: /usr/bin/ld: .../supercop-data/jasper/amd64/try/c/gcc_-march=native_-mtune=native_-O_-fwrapv_-fPIC_-fPIE_-gdwarf-4_-Wall/constbranchindex/crypto_hash/sha256/rust_crypto/work/try-anything.c:356: undefined reference to `cpucycles_amd64rdpmc'
try.c: collect2: error: ld returned 1 exit status
try.c:
try.c:
try.c: error: aborting due to previous error
try.c:
try.c: error: could not compile `crypto_hash_sha256`.
try.c:
try.c: To learn more, run the command again with --verbose.
Number of similar (implementation,compiler) pairs: 1, namely:
Implementation | Compiler |
rust_crypto | gcc -march=native -mtune=native -O -fwrapv -fPIC -fPIE -gdwarf-4 -Wall (10.2.1_20210110) |
Compiler output
try.c: error: linking with `cc` failed: exit code: 1
try.c: |
try.c: = note: "cc" "-Wl,--as-needed" "-Wl,-z,noexecstack" "-m64" "-Wl,--eh-frame-hdr" "-L" "/usr/lib/rustlib/x86_64-unknown-linux-gnu/lib" ".../supercop-data/jasper/amd64/try/c/gcc_-march=native_-mtune=native_-Os_-fwrapv_-fPIC_-fPIE_-gdwarf-4_-Wall/constbranchindex/crypto_hash/sha256/rust_crypto/work/target/release/deps/try-baac04c777a2678c.try.dtsbxaoj-cgu.0.rcgu.o" ".../supercop-data/jasper/amd64/try/c/gcc_-march=native_-mtune=native_-Os_-fwrapv_-fPIC_-fPIE_-gdwarf-4_-Wall/constbranchindex/crypto_hash/sha256/rust_crypto/work/target/release/deps/try-baac04c777a2678c.try.dtsbxaoj-cgu.1.rcgu.o" ".../supercop-data/jasper/amd64/try/c/gcc_-march=native_-mtune=native_-Os_-fwrapv_-fPIC_-fPIE_-gdwarf-4_-Wall/constbranchindex/crypto_hash/sha256/rust_crypto/work/target/release/deps/try-baac04c777a2678c.try.dtsbxaoj-cgu.2.rcgu.o" ".../supercop-data/jasper/amd64/try/c/gcc_-march=native_-mtune=native_-Os_-fwrapv_-fPIC_-fPIE_-gdwarf-4_-Wall/constbranchindex/crypto_hash/sha256/rust_crypto/work/target/release/deps/try-baac04c777a2678c.try.dtsbxaoj-cgu.3.rcgu.o" ".../supercop-data/jasper/amd64/try/c/gcc_-march=native_-mtune=native_-Os_-fwrapv_-fPIC_-fPIE_-gdwarf-4_-Wall/constbranchindex/crypto_hash/sha256/rust_crypto/work/target/release/deps/try-baac04c777a2678c.try.dtsbxaoj-cgu.4.rcgu.o" "-o" ".../supercop-data/jasper/amd64/try/c/gcc_-march=native_-mtune=native_-Os_-fwrapv_-fPIC_-fPIE_-gdwarf-4_-Wall/constbranchindex/crypto_hash/sha256/rust_crypto/work/target/release/deps/try-baac04c777a2678c" ".../supercop-data/jasper/amd64/try/c/gcc_-march=native_-mtune=native_-Os_-fwrapv_-fPIC_-fPIE_-gdwarf-4_-Wall/constbranchindex/crypto_hash/sha256/rust_crypto/work/target/release/deps/try-baac04c777a2678c.1g22a3jq6o5wtxe0.rcgu.o" "-Wl,--gc-sections" "-pie" "-Wl,-zrelro" "-Wl,-znow" "-Wl,-O1" "-nodefaultlibs" "-L" ".../supercop-data/jasper/amd64/try/c/gcc_-march=native_-mtune=native_-Os_-fwrapv_-fPIC_-fPIE_-gdwarf-4_-Wall/constbranchindex/crypto_hash/sha256/rust_crypto/work/target/release/deps" "-L" ".../supercop-data/jasper/amd64/lib" "-L" ".../supercop-data/jasper/amd64/try/c/gcc_-march=native_-mtune=native_-Os_-fwrapv_-fPIC_-fPIE_-gdwarf-4_-Wall/constbranchindex/crypto_hash/sha256/rust_crypto/work/target/release/build/crypto_hash_sha256-5cd230be06f90398/out" "-L" ".../supercop-data/jasper/amd64/try/c/gcc_-march=native_-mtune=native_-Os_-fwrapv_-fPIC_-fPIE_-gdwarf-4_-Wall/constbranchindex/crypto_hash/sha256/rust_crypto/work/target/release/build/rust-crypto-afe9b4ff19c80bbc/out" "-L" "/usr/lib/rustlib/x86_64-unknown-linux-gnu/lib" "-ltry-anything" "-ltry" "-lsupercop" "-lkernelrandombytes" "-lcpucycles" "-lcrypto" "-lnsl" "-lm" "-Wl,-Bstatic" ".../supercop-data/jasper/amd64/try/c/gcc_-march=native_-mtune=native_-Os_-fwrapv_-fPIC_-fPIE_-gdwarf-4_-Wall/constbranchindex/crypto_hash/sha256/rust_crypto/work/target/release/deps/libcrypto_hash_sha256-b6dc07f49da86745.rlib" ".../supercop-data/jasper/amd64/try/c/gcc_-march=native_-mtune=native_-Os_-fwrapv_-fPIC_-fPIE_-gdwarf-4_-Wall/constbranchindex/crypto_hash/sha256/rust_crypto/work/target/release/deps/libcrypto-83ceebf3c7290f98.rlib" ".../supercop-data/jasper/amd64/try/c/gcc_-march=native_-mtune=native_-Os_-fwrapv_-fPIC_-fPIE_-gdwarf-4_-Wall/constbranchindex/crypto_hash/sha256/rust_crypto/work/target/release/deps/libtime-b473882f9f54487c.rlib" ".../supercop-data/jasper/amd64/try/c/gcc_-march=native_-mtune=native_-Os_-fwrapv_-fPIC_-fPIE_-gdwarf-4_-Wall/constbranchindex/crypto_hash/sha256/rust_crypto/work/target/release/deps/librustc_serialize-72942cfdca4fb518.rlib" ".../supercop-data/jasper/amd64/try/c/gcc_-march=native_-mtune=native_-Os_-fwrapv_-fPIC_-fPIE_-gdwarf-4_-Wall/constbranchindex/crypto_hash/sha256/rust_crypto/work/target/release/deps/librand-2cdf248a3f2ca473.rlib" ".../supercop-data/jasper/amd64/try/c/gcc_-march=native_-mtune=native_-Os_-fwrapv_-fPIC_-fPIE_-gdwarf-4_-Wall/constbranchindex/crypto_hash/sha256/rust_crypto/work/target/release/deps/librand-7df229a95dbcb448.rlib" ".../supercop-data/jasper/amd64/try/c/gcc_-march=native_-mtune=native_-Os_-fwrapv_-fPIC_-fPIE_-gdwarf-4_-Wall/constbranchindex/crypto_hash/sha256/rust_crypto/work/target/release/deps/liblibc-141c671f2ddc755d.rlib" "-Wl,--start-group" "/usr/lib/rustlib/x86_64-unknown-linux-gnu/lib/libstd-6bf3f16f340782ca.rlib" "/usr/lib/rustlib/x86_64-unknown-linux-gnu/lib/libpanic_unwind-13f3099d50c21bc6.rlib" "/usr/lib/rustlib/x86_64-unknown-linux-gnu/lib/libminiz_oxide-a2ba33c985785afe.rlib" "/usr/lib/rustlib/x86_64-unknown-linux-gnu/lib/libadler-3f6e9f8f4afbea6d.rlib" "/usr/lib/rustlib/x86_64-unknown-linux-gnu/lib/libobject-af517d7f13e7c960.rlib" "/usr/lib/rustlib/x86_64-unknown-linux-gnu/lib/libaddr2line-12740563628e601f.rlib" "/usr/lib/rustlib/x86_64-unknown-linux-gnu/lib/libgimli-0ac82a1e1820dd21.rlib" "/usr/lib/rustlib/x86_64-unknown-linux-gnu/lib/librustc_demangle-3ac2d0878c297d42.rlib" "/usr/lib/rustlib/x86_64-unknown-linux-gnu/lib/libhashbrown-c6632ca171f954dd.rlib" "/usr/lib/rustlib/x86_64-unknown-linux-gnu/lib/librustc_std_workspace_alloc-b5bfd0198c7b740d.rlib" "/usr/lib/rustlib/x86_64-unknown-linux-gnu/lib/libunwind-bd645b20c6c7b56d.rlib" "/usr/lib/rustlib/x86_64-unknown-linux-gnu/lib/libcfg_if-b9e1e523c0c29a77.rlib" "/usr/lib/rustlib/x86_64-unknown-linux-gnu/lib/liblibc-dfbef8c525de0186.rlib" "/usr/lib/rustlib/x86_64-unknown-linux-gnu/lib/liballoc-1ebf406bd4ea5769.rlib" "/usr/lib/rustlib/x86_64-unknown-linux-gnu/lib/librustc_std_workspace_core-5e0675f526ef5c6b.rlib" "/usr/lib/rustlib/x86_64-unknown-linux-gnu/lib/libcore-3375e4f89d420e7a.rlib" "-Wl,--end-group" "/usr/lib/rustlib/x86_64-unknown-linux-gnu/lib/libcompiler_builtins-f74b197469e67088.rlib" "-Wl,-Bdynamic" "-lgcc_s" "-lc" "-lm" "-lrt" "-lpthread" "-lutil" "-ldl" "-lutil"
try.c: = note: /usr/bin/ld: .../supercop-data/jasper/amd64/try/c/gcc_-march=native_-mtune=native_-Os_-fwrapv_-fPIC_-fPIE_-gdwarf-4_-Wall/constbranchindex/crypto_hash/sha256/rust_crypto/work/target/release/build/crypto_hash_sha256-5cd230be06f90398/out/libtry-anything.a(try-anything.o): in function `c_main':
try.c: .../supercop-data/jasper/amd64/try/c/gcc_-march=native_-mtune=native_-Os_-fwrapv_-fPIC_-fPIE_-gdwarf-4_-Wall/constbranchindex/crypto_hash/sha256/rust_crypto/work/try-anything.c:331: undefined reference to `cpucycles_amd64rdpmc'
try.c: /usr/bin/ld: .../supercop-data/jasper/amd64/try/c/gcc_-march=native_-mtune=native_-Os_-fwrapv_-fPIC_-fPIE_-gdwarf-4_-Wall/constbranchindex/crypto_hash/sha256/rust_crypto/work/try-anything.c:332: undefined reference to `cpucycles_amd64rdpmc'
try.c: /usr/bin/ld: .../supercop-data/jasper/amd64/try/c/gcc_-march=native_-mtune=native_-Os_-fwrapv_-fPIC_-fPIE_-gdwarf-4_-Wall/constbranchindex/crypto_hash/sha256/rust_crypto/work/try-anything.c:333: undefined reference to `cpucycles_amd64rdpmc_persecond'
try.c: /usr/bin/ld: .../supercop-data/jasper/amd64/try/c/gcc_-march=native_-mtune=native_-Os_-fwrapv_-fPIC_-fPIE_-gdwarf-4_-Wall/constbranchindex/crypto_hash/sha256/rust_crypto/work/try-anything.c:344: undefined reference to `cpucycles_amd64rdpmc'
try.c: /usr/bin/ld: .../supercop-data/jasper/amd64/try/c/gcc_-march=native_-mtune=native_-Os_-fwrapv_-fPIC_-fPIE_-gdwarf-4_-Wall/constbranchindex/crypto_hash/sha256/rust_crypto/work/try-anything.c:346: undefined reference to `cpucycles_amd64rdpmc'
try.c: /usr/bin/ld: .../supercop-data/jasper/amd64/try/c/gcc_-march=native_-mtune=native_-Os_-fwrapv_-fPIC_-fPIE_-gdwarf-4_-Wall/constbranchindex/crypto_hash/sha256/rust_crypto/work/try-anything.c:353: undefined reference to `cpucycles_amd64rdpmc'
try.c: /usr/bin/ld: .../supercop-data/jasper/amd64/try/c/gcc_-march=native_-mtune=native_-Os_-fwrapv_-fPIC_-fPIE_-gdwarf-4_-Wall/constbranchindex/crypto_hash/sha256/rust_crypto/work/try-anything.c:356: undefined reference to `cpucycles_amd64rdpmc'
try.c: collect2: error: ld returned 1 exit status
try.c:
try.c:
try.c: error: aborting due to previous error
try.c:
try.c: error: could not compile `crypto_hash_sha256`.
try.c:
try.c: To learn more, run the command again with --verbose.
Number of similar (implementation,compiler) pairs: 1, namely:
Implementation | Compiler |
rust_crypto | gcc -march=native -mtune=native -Os -fwrapv -fPIC -fPIE -gdwarf-4 -Wall (10.2.1_20210110) |
Compiler output
try.c: error: linking with `cc` failed: exit code: 1
try.c: |
try.c: = note: "cc" "-Wl,--as-needed" "-Wl,-z,noexecstack" "-m64" "-Wl,--eh-frame-hdr" "-L" "/usr/lib/rustlib/x86_64-unknown-linux-gnu/lib" ".../supercop-data/jasper/amd64/try/c/clang_-march=native_-O2_-fwrapv_-Qunused-arguments_-fPIC_-fPIE_-gdwarf-4_-Wall/constbranchindex/crypto_hash/sha256/rust_sha2/work/target/release/deps/try_small-9e5a796331e8e781.try_small.wogv34f0-cgu.0.rcgu.o" ".../supercop-data/jasper/amd64/try/c/clang_-march=native_-O2_-fwrapv_-Qunused-arguments_-fPIC_-fPIE_-gdwarf-4_-Wall/constbranchindex/crypto_hash/sha256/rust_sha2/work/target/release/deps/try_small-9e5a796331e8e781.try_small.wogv34f0-cgu.1.rcgu.o" ".../supercop-data/jasper/amd64/try/c/clang_-march=native_-O2_-fwrapv_-Qunused-arguments_-fPIC_-fPIE_-gdwarf-4_-Wall/constbranchindex/crypto_hash/sha256/rust_sha2/work/target/release/deps/try_small-9e5a796331e8e781.try_small.wogv34f0-cgu.2.rcgu.o" ".../supercop-data/jasper/amd64/try/c/clang_-march=native_-O2_-fwrapv_-Qunused-arguments_-fPIC_-fPIE_-gdwarf-4_-Wall/constbranchindex/crypto_hash/sha256/rust_sha2/work/target/release/deps/try_small-9e5a796331e8e781.try_small.wogv34f0-cgu.3.rcgu.o" ".../supercop-data/jasper/amd64/try/c/clang_-march=native_-O2_-fwrapv_-Qunused-arguments_-fPIC_-fPIE_-gdwarf-4_-Wall/constbranchindex/crypto_hash/sha256/rust_sha2/work/target/release/deps/try_small-9e5a796331e8e781.try_small.wogv34f0-cgu.4.rcgu.o" "-o" ".../supercop-data/jasper/amd64/try/c/clang_-march=native_-O2_-fwrapv_-Qunused-arguments_-fPIC_-fPIE_-gdwarf-4_-Wall/constbranchindex/crypto_hash/sha256/rust_sha2/work/target/release/deps/try_small-9e5a796331e8e781" ".../supercop-data/jasper/amd64/try/c/clang_-march=native_-O2_-fwrapv_-Qunused-arguments_-fPIC_-fPIE_-gdwarf-4_-Wall/constbranchindex/crypto_hash/sha256/rust_sha2/work/target/release/deps/try_small-9e5a796331e8e781.1bv51pu6l67stnpc.rcgu.o" "-Wl,--gc-sections" "-pie" "-Wl,-zrelro" "-Wl,-znow" "-Wl,-O1" "-nodefaultlibs" "-L" ".../supercop-data/jasper/amd64/try/c/clang_-march=native_-O2_-fwrapv_-Qunused-arguments_-fPIC_-fPIE_-gdwarf-4_-Wall/constbranchindex/crypto_hash/sha256/rust_sha2/work/target/release/deps" "-L" ".../supercop-data/jasper/amd64/lib" "-L" ".../supercop-data/jasper/amd64/try/c/clang_-march=native_-O2_-fwrapv_-Qunused-arguments_-fPIC_-fPIE_-gdwarf-4_-Wall/constbranchindex/crypto_hash/sha256/rust_sha2/work/target/release/build/crypto_hash_sha256-5cd230be06f90398/out" "-L" "/usr/lib/rustlib/x86_64-unknown-linux-gnu/lib" "-ltry-anything" "-ltry-small" "-lsupercop" "-lkernelrandombytes" "-lcpucycles" "-lcrypto" "-lnsl" "-lm" "-Wl,-Bstatic" ".../supercop-data/jasper/amd64/try/c/clang_-march=native_-O2_-fwrapv_-Qunused-arguments_-fPIC_-fPIE_-gdwarf-4_-Wall/constbranchindex/crypto_hash/sha256/rust_sha2/work/target/release/deps/libcrypto_hash_sha256-59a535abfecfde21.rlib" ".../supercop-data/jasper/amd64/try/c/clang_-march=native_-O2_-fwrapv_-Qunused-arguments_-fPIC_-fPIE_-gdwarf-4_-Wall/constbranchindex/crypto_hash/sha256/rust_sha2/work/target/release/deps/libsha2-fee2faec0cc98b9d.rlib" ".../supercop-data/jasper/amd64/try/c/clang_-march=native_-O2_-fwrapv_-Qunused-arguments_-fPIC_-fPIE_-gdwarf-4_-Wall/constbranchindex/crypto_hash/sha256/rust_sha2/work/target/release/deps/libcpuid_bool-a511188b3e8fb9e7.rlib" ".../supercop-data/jasper/amd64/try/c/clang_-march=native_-O2_-fwrapv_-Qunused-arguments_-fPIC_-fPIE_-gdwarf-4_-Wall/constbranchindex/crypto_hash/sha256/rust_sha2/work/target/release/deps/libcfg_if-11669ae4b1851f60.rlib" ".../supercop-data/jasper/amd64/try/c/clang_-march=native_-O2_-fwrapv_-Qunused-arguments_-fPIC_-fPIE_-gdwarf-4_-Wall/constbranchindex/crypto_hash/sha256/rust_sha2/work/target/release/deps/libopaque_debug-ff52af415c56e1a8.rlib" ".../supercop-data/jasper/amd64/try/c/clang_-march=native_-O2_-fwrapv_-Qunused-arguments_-fPIC_-fPIE_-gdwarf-4_-Wall/constbranchindex/crypto_hash/sha256/rust_sha2/work/target/release/deps/libdigest-137540d47480a0cd.rlib" ".../supercop-data/jasper/amd64/try/c/clang_-march=native_-O2_-fwrapv_-Qunused-arguments_-fPIC_-fPIE_-gdwarf-4_-Wall/constbranchindex/crypto_hash/sha256/rust_sha2/work/target/release/deps/libblock_buffer-d8051f65e68b5aa7.rlib" ".../supercop-data/jasper/amd64/try/c/clang_-march=native_-O2_-fwrapv_-Qunused-arguments_-fPIC_-fPIE_-gdwarf-4_-Wall/constbranchindex/crypto_hash/sha256/rust_sha2/work/target/release/deps/libgeneric_array-6bd8cd5d26e69f54.rlib" ".../supercop-data/jasper/amd64/try/c/clang_-march=native_-O2_-fwrapv_-Qunused-arguments_-fPIC_-fPIE_-gdwarf-4_-Wall/constbranchindex/crypto_hash/sha256/rust_sha2/work/target/release/deps/libtypenum-ac0d7f64b1a84d19.rlib" "-Wl,--start-group" "/usr/lib/rustlib/x86_64-unknown-linux-gnu/lib/libstd-6bf3f16f340782ca.rlib" "/usr/lib/rustlib/x86_64-unknown-linux-gnu/lib/libpanic_unwind-13f3099d50c21bc6.rlib" "/usr/lib/rustlib/x86_64-unknown-linux-gnu/lib/libminiz_oxide-a2ba33c985785afe.rlib" "/usr/lib/rustlib/x86_64-unknown-linux-gnu/lib/libadler-3f6e9f8f4afbea6d.rlib" "/usr/lib/rustlib/x86_64-unknown-linux-gnu/lib/libobject-af517d7f13e7c960.rlib" "/usr/lib/rustlib/x86_64-unknown-linux-gnu/lib/libaddr2line-12740563628e601f.rlib" "/usr/lib/rustlib/x86_64-unknown-linux-gnu/lib/libgimli-0ac82a1e1820dd21.rlib" "/usr/lib/rustlib/x86_64-unknown-linux-gnu/lib/librustc_demangle-3ac2d0878c297d42.rlib" "/usr/lib/rustlib/x86_64-unknown-linux-gnu/lib/libhashbrown-c6632ca171f954dd.rlib" "/usr/lib/rustlib/x86_64-unknown-linux-gnu/lib/librustc_std_workspace_alloc-b5bfd0198c7b740d.rlib" "/usr/lib/rustlib/x86_64-unknown-linux-gnu/lib/libunwind-bd645b20c6c7b56d.rlib" "/usr/lib/rustlib/x86_64-unknown-linux-gnu/lib/libcfg_if-b9e1e523c0c29a77.rlib" "/usr/lib/rustlib/x86_64-unknown-linux-gnu/lib/liblibc-dfbef8c525de0186.rlib" "/usr/lib/rustlib/x86_64-unknown-linux-gnu/lib/liballoc-1ebf406bd4ea5769.rlib" "/usr/lib/rustlib/x86_64-unknown-linux-gnu/lib/librustc_std_workspace_core-5e0675f526ef5c6b.rlib" "/usr/lib/rustlib/x86_64-unknown-linux-gnu/lib/libcore-3375e4f89d420e7a.rlib" "-Wl,--end-group" "/usr/lib/rustlib/x86_64-unknown-linux-gnu/lib/libcompiler_builtins-f74b197469e67088.rlib" "-Wl,-Bdynamic" "-lgcc_s" "-lc" "-lm" "-lrt" "-lpthread" "-lutil" "-ldl" "-lutil"
try.c: = note: /usr/bin/ld: .../supercop-data/jasper/amd64/try/c/clang_-march=native_-O2_-fwrapv_-Qunused-arguments_-fPIC_-fPIE_-gdwarf-4_-Wall/constbranchindex/crypto_hash/sha256/rust_sha2/work/target/release/build/crypto_hash_sha256-5cd230be06f90398/out/libtry-anything.a(try-anything.o): in function `c_main':
try.c: .../supercop-data/jasper/amd64/try/c/clang_-march=native_-O2_-fwrapv_-Qunused-arguments_-fPIC_-fPIE_-gdwarf-4_-Wall/constbranchindex/crypto_hash/sha256/rust_sha2/work/try-anything.c:331: undefined reference to `cpucycles_amd64rdpmc'
try.c: /usr/bin/ld: .../supercop-data/jasper/amd64/try/c/clang_-march=native_-O2_-fwrapv_-Qunused-arguments_-fPIC_-fPIE_-gdwarf-4_-Wall/constbranchindex/crypto_hash/sha256/rust_sha2/work/try-anything.c:332: undefined reference to `cpucycles_amd64rdpmc'
try.c: /usr/bin/ld: .../supercop-data/jasper/amd64/try/c/clang_-march=native_-O2_-fwrapv_-Qunused-arguments_-fPIC_-fPIE_-gdwarf-4_-Wall/constbranchindex/crypto_hash/sha256/rust_sha2/work/try-anything.c:333: undefined reference to `cpucycles_amd64rdpmc_persecond'
try.c: /usr/bin/ld: .../supercop-data/jasper/amd64/try/c/clang_-march=native_-O2_-fwrapv_-Qunused-arguments_-fPIC_-fPIE_-gdwarf-4_-Wall/constbranchindex/crypto_hash/sha256/rust_sha2/work/try-anything.c:344: undefined reference to `cpucycles_amd64rdpmc'
try.c: /usr/bin/ld: .../supercop-data/jasper/amd64/try/c/clang_-march=native_-O2_-fwrapv_-Qunused-arguments_-fPIC_-fPIE_-gdwarf-4_-Wall/constbranchindex/crypto_hash/sha256/rust_sha2/work/try-anything.c:346: undefined reference to `cpucycles_amd64rdpmc'
try.c: /usr/bin/ld: .../supercop-data/jasper/amd64/try/c/clang_-march=native_-O2_-fwrapv_-Qunused-arguments_-fPIC_-fPIE_-gdwarf-4_-Wall/constbranchindex/crypto_hash/sha256/rust_sha2/work/try-anything.c:353: undefined reference to `cpucycles_amd64rdpmc'
try.c: /usr/bin/ld: .../supercop-data/jasper/amd64/try/c/clang_-march=native_-O2_-fwrapv_-Qunused-arguments_-fPIC_-fPIE_-gdwarf-4_-Wall/constbranchindex/crypto_hash/sha256/rust_sha2/work/try-anything.c:356: undefined reference to `cpucycles_amd64rdpmc'
try.c: collect2: error: ld returned 1 exit status
try.c:
try.c:
try.c: error: aborting due to previous error
try.c:
try.c: error: could not compile `crypto_hash_sha256`.
try.c:
try.c: To learn more, run the command again with --verbose.
Number of similar (implementation,compiler) pairs: 1, namely:
Implementation | Compiler |
rust_sha2 | clang -march=native -O2 -fwrapv -Qunused-arguments -fPIC -fPIE -gdwarf-4 -Wall (Debian_Clang_11.0.1) |
Compiler output
try.c: error: linking with `cc` failed: exit code: 1
try.c: |
try.c: = note: "cc" "-Wl,--as-needed" "-Wl,-z,noexecstack" "-m64" "-Wl,--eh-frame-hdr" "-L" "/usr/lib/rustlib/x86_64-unknown-linux-gnu/lib" ".../supercop-data/jasper/amd64/try/c/clang_-march=native_-O3_-fwrapv_-Qunused-arguments_-fPIC_-fPIE_-gdwarf-4_-Wall/constbranchindex/crypto_hash/sha256/rust_sha2/work/target/release/deps/try_small-9e5a796331e8e781.try_small.wogv34f0-cgu.0.rcgu.o" ".../supercop-data/jasper/amd64/try/c/clang_-march=native_-O3_-fwrapv_-Qunused-arguments_-fPIC_-fPIE_-gdwarf-4_-Wall/constbranchindex/crypto_hash/sha256/rust_sha2/work/target/release/deps/try_small-9e5a796331e8e781.try_small.wogv34f0-cgu.1.rcgu.o" ".../supercop-data/jasper/amd64/try/c/clang_-march=native_-O3_-fwrapv_-Qunused-arguments_-fPIC_-fPIE_-gdwarf-4_-Wall/constbranchindex/crypto_hash/sha256/rust_sha2/work/target/release/deps/try_small-9e5a796331e8e781.try_small.wogv34f0-cgu.2.rcgu.o" ".../supercop-data/jasper/amd64/try/c/clang_-march=native_-O3_-fwrapv_-Qunused-arguments_-fPIC_-fPIE_-gdwarf-4_-Wall/constbranchindex/crypto_hash/sha256/rust_sha2/work/target/release/deps/try_small-9e5a796331e8e781.try_small.wogv34f0-cgu.3.rcgu.o" ".../supercop-data/jasper/amd64/try/c/clang_-march=native_-O3_-fwrapv_-Qunused-arguments_-fPIC_-fPIE_-gdwarf-4_-Wall/constbranchindex/crypto_hash/sha256/rust_sha2/work/target/release/deps/try_small-9e5a796331e8e781.try_small.wogv34f0-cgu.4.rcgu.o" "-o" ".../supercop-data/jasper/amd64/try/c/clang_-march=native_-O3_-fwrapv_-Qunused-arguments_-fPIC_-fPIE_-gdwarf-4_-Wall/constbranchindex/crypto_hash/sha256/rust_sha2/work/target/release/deps/try_small-9e5a796331e8e781" ".../supercop-data/jasper/amd64/try/c/clang_-march=native_-O3_-fwrapv_-Qunused-arguments_-fPIC_-fPIE_-gdwarf-4_-Wall/constbranchindex/crypto_hash/sha256/rust_sha2/work/target/release/deps/try_small-9e5a796331e8e781.1bv51pu6l67stnpc.rcgu.o" "-Wl,--gc-sections" "-pie" "-Wl,-zrelro" "-Wl,-znow" "-Wl,-O1" "-nodefaultlibs" "-L" ".../supercop-data/jasper/amd64/try/c/clang_-march=native_-O3_-fwrapv_-Qunused-arguments_-fPIC_-fPIE_-gdwarf-4_-Wall/constbranchindex/crypto_hash/sha256/rust_sha2/work/target/release/deps" "-L" ".../supercop-data/jasper/amd64/lib" "-L" ".../supercop-data/jasper/amd64/try/c/clang_-march=native_-O3_-fwrapv_-Qunused-arguments_-fPIC_-fPIE_-gdwarf-4_-Wall/constbranchindex/crypto_hash/sha256/rust_sha2/work/target/release/build/crypto_hash_sha256-5cd230be06f90398/out" "-L" "/usr/lib/rustlib/x86_64-unknown-linux-gnu/lib" "-ltry-anything" "-ltry-small" "-lsupercop" "-lkernelrandombytes" "-lcpucycles" "-lcrypto" "-lnsl" "-lm" "-Wl,-Bstatic" ".../supercop-data/jasper/amd64/try/c/clang_-march=native_-O3_-fwrapv_-Qunused-arguments_-fPIC_-fPIE_-gdwarf-4_-Wall/constbranchindex/crypto_hash/sha256/rust_sha2/work/target/release/deps/libcrypto_hash_sha256-59a535abfecfde21.rlib" ".../supercop-data/jasper/amd64/try/c/clang_-march=native_-O3_-fwrapv_-Qunused-arguments_-fPIC_-fPIE_-gdwarf-4_-Wall/constbranchindex/crypto_hash/sha256/rust_sha2/work/target/release/deps/libsha2-fee2faec0cc98b9d.rlib" ".../supercop-data/jasper/amd64/try/c/clang_-march=native_-O3_-fwrapv_-Qunused-arguments_-fPIC_-fPIE_-gdwarf-4_-Wall/constbranchindex/crypto_hash/sha256/rust_sha2/work/target/release/deps/libcpuid_bool-a511188b3e8fb9e7.rlib" ".../supercop-data/jasper/amd64/try/c/clang_-march=native_-O3_-fwrapv_-Qunused-arguments_-fPIC_-fPIE_-gdwarf-4_-Wall/constbranchindex/crypto_hash/sha256/rust_sha2/work/target/release/deps/libcfg_if-11669ae4b1851f60.rlib" ".../supercop-data/jasper/amd64/try/c/clang_-march=native_-O3_-fwrapv_-Qunused-arguments_-fPIC_-fPIE_-gdwarf-4_-Wall/constbranchindex/crypto_hash/sha256/rust_sha2/work/target/release/deps/libopaque_debug-ff52af415c56e1a8.rlib" ".../supercop-data/jasper/amd64/try/c/clang_-march=native_-O3_-fwrapv_-Qunused-arguments_-fPIC_-fPIE_-gdwarf-4_-Wall/constbranchindex/crypto_hash/sha256/rust_sha2/work/target/release/deps/libdigest-137540d47480a0cd.rlib" ".../supercop-data/jasper/amd64/try/c/clang_-march=native_-O3_-fwrapv_-Qunused-arguments_-fPIC_-fPIE_-gdwarf-4_-Wall/constbranchindex/crypto_hash/sha256/rust_sha2/work/target/release/deps/libblock_buffer-d8051f65e68b5aa7.rlib" ".../supercop-data/jasper/amd64/try/c/clang_-march=native_-O3_-fwrapv_-Qunused-arguments_-fPIC_-fPIE_-gdwarf-4_-Wall/constbranchindex/crypto_hash/sha256/rust_sha2/work/target/release/deps/libgeneric_array-6bd8cd5d26e69f54.rlib" ".../supercop-data/jasper/amd64/try/c/clang_-march=native_-O3_-fwrapv_-Qunused-arguments_-fPIC_-fPIE_-gdwarf-4_-Wall/constbranchindex/crypto_hash/sha256/rust_sha2/work/target/release/deps/libtypenum-ac0d7f64b1a84d19.rlib" "-Wl,--start-group" "/usr/lib/rustlib/x86_64-unknown-linux-gnu/lib/libstd-6bf3f16f340782ca.rlib" "/usr/lib/rustlib/x86_64-unknown-linux-gnu/lib/libpanic_unwind-13f3099d50c21bc6.rlib" "/usr/lib/rustlib/x86_64-unknown-linux-gnu/lib/libminiz_oxide-a2ba33c985785afe.rlib" "/usr/lib/rustlib/x86_64-unknown-linux-gnu/lib/libadler-3f6e9f8f4afbea6d.rlib" "/usr/lib/rustlib/x86_64-unknown-linux-gnu/lib/libobject-af517d7f13e7c960.rlib" "/usr/lib/rustlib/x86_64-unknown-linux-gnu/lib/libaddr2line-12740563628e601f.rlib" "/usr/lib/rustlib/x86_64-unknown-linux-gnu/lib/libgimli-0ac82a1e1820dd21.rlib" "/usr/lib/rustlib/x86_64-unknown-linux-gnu/lib/librustc_demangle-3ac2d0878c297d42.rlib" "/usr/lib/rustlib/x86_64-unknown-linux-gnu/lib/libhashbrown-c6632ca171f954dd.rlib" "/usr/lib/rustlib/x86_64-unknown-linux-gnu/lib/librustc_std_workspace_alloc-b5bfd0198c7b740d.rlib" "/usr/lib/rustlib/x86_64-unknown-linux-gnu/lib/libunwind-bd645b20c6c7b56d.rlib" "/usr/lib/rustlib/x86_64-unknown-linux-gnu/lib/libcfg_if-b9e1e523c0c29a77.rlib" "/usr/lib/rustlib/x86_64-unknown-linux-gnu/lib/liblibc-dfbef8c525de0186.rlib" "/usr/lib/rustlib/x86_64-unknown-linux-gnu/lib/liballoc-1ebf406bd4ea5769.rlib" "/usr/lib/rustlib/x86_64-unknown-linux-gnu/lib/librustc_std_workspace_core-5e0675f526ef5c6b.rlib" "/usr/lib/rustlib/x86_64-unknown-linux-gnu/lib/libcore-3375e4f89d420e7a.rlib" "-Wl,--end-group" "/usr/lib/rustlib/x86_64-unknown-linux-gnu/lib/libcompiler_builtins-f74b197469e67088.rlib" "-Wl,-Bdynamic" "-lgcc_s" "-lc" "-lm" "-lrt" "-lpthread" "-lutil" "-ldl" "-lutil"
try.c: = note: /usr/bin/ld: .../supercop-data/jasper/amd64/try/c/clang_-march=native_-O3_-fwrapv_-Qunused-arguments_-fPIC_-fPIE_-gdwarf-4_-Wall/constbranchindex/crypto_hash/sha256/rust_sha2/work/target/release/build/crypto_hash_sha256-5cd230be06f90398/out/libtry-anything.a(try-anything.o): in function `c_main':
try.c: .../supercop-data/jasper/amd64/try/c/clang_-march=native_-O3_-fwrapv_-Qunused-arguments_-fPIC_-fPIE_-gdwarf-4_-Wall/constbranchindex/crypto_hash/sha256/rust_sha2/work/try-anything.c:331: undefined reference to `cpucycles_amd64rdpmc'
try.c: /usr/bin/ld: .../supercop-data/jasper/amd64/try/c/clang_-march=native_-O3_-fwrapv_-Qunused-arguments_-fPIC_-fPIE_-gdwarf-4_-Wall/constbranchindex/crypto_hash/sha256/rust_sha2/work/try-anything.c:332: undefined reference to `cpucycles_amd64rdpmc'
try.c: /usr/bin/ld: .../supercop-data/jasper/amd64/try/c/clang_-march=native_-O3_-fwrapv_-Qunused-arguments_-fPIC_-fPIE_-gdwarf-4_-Wall/constbranchindex/crypto_hash/sha256/rust_sha2/work/try-anything.c:333: undefined reference to `cpucycles_amd64rdpmc_persecond'
try.c: /usr/bin/ld: .../supercop-data/jasper/amd64/try/c/clang_-march=native_-O3_-fwrapv_-Qunused-arguments_-fPIC_-fPIE_-gdwarf-4_-Wall/constbranchindex/crypto_hash/sha256/rust_sha2/work/try-anything.c:344: undefined reference to `cpucycles_amd64rdpmc'
try.c: /usr/bin/ld: .../supercop-data/jasper/amd64/try/c/clang_-march=native_-O3_-fwrapv_-Qunused-arguments_-fPIC_-fPIE_-gdwarf-4_-Wall/constbranchindex/crypto_hash/sha256/rust_sha2/work/try-anything.c:346: undefined reference to `cpucycles_amd64rdpmc'
try.c: /usr/bin/ld: .../supercop-data/jasper/amd64/try/c/clang_-march=native_-O3_-fwrapv_-Qunused-arguments_-fPIC_-fPIE_-gdwarf-4_-Wall/constbranchindex/crypto_hash/sha256/rust_sha2/work/try-anything.c:353: undefined reference to `cpucycles_amd64rdpmc'
try.c: /usr/bin/ld: .../supercop-data/jasper/amd64/try/c/clang_-march=native_-O3_-fwrapv_-Qunused-arguments_-fPIC_-fPIE_-gdwarf-4_-Wall/constbranchindex/crypto_hash/sha256/rust_sha2/work/try-anything.c:356: undefined reference to `cpucycles_amd64rdpmc'
try.c: collect2: error: ld returned 1 exit status
try.c:
try.c:
try.c: error: aborting due to previous error
try.c:
try.c: error: could not compile `crypto_hash_sha256`.
try.c:
try.c: To learn more, run the command again with --verbose.
Number of similar (implementation,compiler) pairs: 1, namely:
Implementation | Compiler |
rust_sha2 | clang -march=native -O3 -fwrapv -Qunused-arguments -fPIC -fPIE -gdwarf-4 -Wall (Debian_Clang_11.0.1) |
Compiler output
try.c: error: linking with `cc` failed: exit code: 1
try.c: |
try.c: = note: "cc" "-Wl,--as-needed" "-Wl,-z,noexecstack" "-m64" "-Wl,--eh-frame-hdr" "-L" "/usr/lib/rustlib/x86_64-unknown-linux-gnu/lib" ".../supercop-data/jasper/amd64/try/c/clang_-march=native_-O_-fwrapv_-Qunused-arguments_-fPIC_-fPIE_-gdwarf-4_-Wall/constbranchindex/crypto_hash/sha256/rust_sha2/work/target/release/deps/try-444f87ff176ff1a2.try.eh7uyr3c-cgu.0.rcgu.o" ".../supercop-data/jasper/amd64/try/c/clang_-march=native_-O_-fwrapv_-Qunused-arguments_-fPIC_-fPIE_-gdwarf-4_-Wall/constbranchindex/crypto_hash/sha256/rust_sha2/work/target/release/deps/try-444f87ff176ff1a2.try.eh7uyr3c-cgu.1.rcgu.o" ".../supercop-data/jasper/amd64/try/c/clang_-march=native_-O_-fwrapv_-Qunused-arguments_-fPIC_-fPIE_-gdwarf-4_-Wall/constbranchindex/crypto_hash/sha256/rust_sha2/work/target/release/deps/try-444f87ff176ff1a2.try.eh7uyr3c-cgu.2.rcgu.o" ".../supercop-data/jasper/amd64/try/c/clang_-march=native_-O_-fwrapv_-Qunused-arguments_-fPIC_-fPIE_-gdwarf-4_-Wall/constbranchindex/crypto_hash/sha256/rust_sha2/work/target/release/deps/try-444f87ff176ff1a2.try.eh7uyr3c-cgu.3.rcgu.o" ".../supercop-data/jasper/amd64/try/c/clang_-march=native_-O_-fwrapv_-Qunused-arguments_-fPIC_-fPIE_-gdwarf-4_-Wall/constbranchindex/crypto_hash/sha256/rust_sha2/work/target/release/deps/try-444f87ff176ff1a2.try.eh7uyr3c-cgu.4.rcgu.o" "-o" ".../supercop-data/jasper/amd64/try/c/clang_-march=native_-O_-fwrapv_-Qunused-arguments_-fPIC_-fPIE_-gdwarf-4_-Wall/constbranchindex/crypto_hash/sha256/rust_sha2/work/target/release/deps/try-444f87ff176ff1a2" ".../supercop-data/jasper/amd64/try/c/clang_-march=native_-O_-fwrapv_-Qunused-arguments_-fPIC_-fPIE_-gdwarf-4_-Wall/constbranchindex/crypto_hash/sha256/rust_sha2/work/target/release/deps/try-444f87ff176ff1a2.4qvuycn7jdjdfii3.rcgu.o" "-Wl,--gc-sections" "-pie" "-Wl,-zrelro" "-Wl,-znow" "-Wl,-O1" "-nodefaultlibs" "-L" ".../supercop-data/jasper/amd64/try/c/clang_-march=native_-O_-fwrapv_-Qunused-arguments_-fPIC_-fPIE_-gdwarf-4_-Wall/constbranchindex/crypto_hash/sha256/rust_sha2/work/target/release/deps" "-L" ".../supercop-data/jasper/amd64/lib" "-L" ".../supercop-data/jasper/amd64/try/c/clang_-march=native_-O_-fwrapv_-Qunused-arguments_-fPIC_-fPIE_-gdwarf-4_-Wall/constbranchindex/crypto_hash/sha256/rust_sha2/work/target/release/build/crypto_hash_sha256-5cd230be06f90398/out" "-L" "/usr/lib/rustlib/x86_64-unknown-linux-gnu/lib" "-ltry-anything" "-ltry" "-lsupercop" "-lkernelrandombytes" "-lcpucycles" "-lcrypto" "-lnsl" "-lm" "-Wl,-Bstatic" ".../supercop-data/jasper/amd64/try/c/clang_-march=native_-O_-fwrapv_-Qunused-arguments_-fPIC_-fPIE_-gdwarf-4_-Wall/constbranchindex/crypto_hash/sha256/rust_sha2/work/target/release/deps/libcrypto_hash_sha256-59a535abfecfde21.rlib" ".../supercop-data/jasper/amd64/try/c/clang_-march=native_-O_-fwrapv_-Qunused-arguments_-fPIC_-fPIE_-gdwarf-4_-Wall/constbranchindex/crypto_hash/sha256/rust_sha2/work/target/release/deps/libsha2-fee2faec0cc98b9d.rlib" ".../supercop-data/jasper/amd64/try/c/clang_-march=native_-O_-fwrapv_-Qunused-arguments_-fPIC_-fPIE_-gdwarf-4_-Wall/constbranchindex/crypto_hash/sha256/rust_sha2/work/target/release/deps/libcpuid_bool-a511188b3e8fb9e7.rlib" ".../supercop-data/jasper/amd64/try/c/clang_-march=native_-O_-fwrapv_-Qunused-arguments_-fPIC_-fPIE_-gdwarf-4_-Wall/constbranchindex/crypto_hash/sha256/rust_sha2/work/target/release/deps/libcfg_if-11669ae4b1851f60.rlib" ".../supercop-data/jasper/amd64/try/c/clang_-march=native_-O_-fwrapv_-Qunused-arguments_-fPIC_-fPIE_-gdwarf-4_-Wall/constbranchindex/crypto_hash/sha256/rust_sha2/work/target/release/deps/libopaque_debug-ff52af415c56e1a8.rlib" ".../supercop-data/jasper/amd64/try/c/clang_-march=native_-O_-fwrapv_-Qunused-arguments_-fPIC_-fPIE_-gdwarf-4_-Wall/constbranchindex/crypto_hash/sha256/rust_sha2/work/target/release/deps/libdigest-137540d47480a0cd.rlib" ".../supercop-data/jasper/amd64/try/c/clang_-march=native_-O_-fwrapv_-Qunused-arguments_-fPIC_-fPIE_-gdwarf-4_-Wall/constbranchindex/crypto_hash/sha256/rust_sha2/work/target/release/deps/libblock_buffer-d8051f65e68b5aa7.rlib" ".../supercop-data/jasper/amd64/try/c/clang_-march=native_-O_-fwrapv_-Qunused-arguments_-fPIC_-fPIE_-gdwarf-4_-Wall/constbranchindex/crypto_hash/sha256/rust_sha2/work/target/release/deps/libgeneric_array-6bd8cd5d26e69f54.rlib" ".../supercop-data/jasper/amd64/try/c/clang_-march=native_-O_-fwrapv_-Qunused-arguments_-fPIC_-fPIE_-gdwarf-4_-Wall/constbranchindex/crypto_hash/sha256/rust_sha2/work/target/release/deps/libtypenum-ac0d7f64b1a84d19.rlib" "-Wl,--start-group" "/usr/lib/rustlib/x86_64-unknown-linux-gnu/lib/libstd-6bf3f16f340782ca.rlib" "/usr/lib/rustlib/x86_64-unknown-linux-gnu/lib/libpanic_unwind-13f3099d50c21bc6.rlib" "/usr/lib/rustlib/x86_64-unknown-linux-gnu/lib/libminiz_oxide-a2ba33c985785afe.rlib" "/usr/lib/rustlib/x86_64-unknown-linux-gnu/lib/libadler-3f6e9f8f4afbea6d.rlib" "/usr/lib/rustlib/x86_64-unknown-linux-gnu/lib/libobject-af517d7f13e7c960.rlib" "/usr/lib/rustlib/x86_64-unknown-linux-gnu/lib/libaddr2line-12740563628e601f.rlib" "/usr/lib/rustlib/x86_64-unknown-linux-gnu/lib/libgimli-0ac82a1e1820dd21.rlib" "/usr/lib/rustlib/x86_64-unknown-linux-gnu/lib/librustc_demangle-3ac2d0878c297d42.rlib" "/usr/lib/rustlib/x86_64-unknown-linux-gnu/lib/libhashbrown-c6632ca171f954dd.rlib" "/usr/lib/rustlib/x86_64-unknown-linux-gnu/lib/librustc_std_workspace_alloc-b5bfd0198c7b740d.rlib" "/usr/lib/rustlib/x86_64-unknown-linux-gnu/lib/libunwind-bd645b20c6c7b56d.rlib" "/usr/lib/rustlib/x86_64-unknown-linux-gnu/lib/libcfg_if-b9e1e523c0c29a77.rlib" "/usr/lib/rustlib/x86_64-unknown-linux-gnu/lib/liblibc-dfbef8c525de0186.rlib" "/usr/lib/rustlib/x86_64-unknown-linux-gnu/lib/liballoc-1ebf406bd4ea5769.rlib" "/usr/lib/rustlib/x86_64-unknown-linux-gnu/lib/librustc_std_workspace_core-5e0675f526ef5c6b.rlib" "/usr/lib/rustlib/x86_64-unknown-linux-gnu/lib/libcore-3375e4f89d420e7a.rlib" "-Wl,--end-group" "/usr/lib/rustlib/x86_64-unknown-linux-gnu/lib/libcompiler_builtins-f74b197469e67088.rlib" "-Wl,-Bdynamic" "-lgcc_s" "-lc" "-lm" "-lrt" "-lpthread" "-lutil" "-ldl" "-lutil"
try.c: = note: /usr/bin/ld: .../supercop-data/jasper/amd64/try/c/clang_-march=native_-O_-fwrapv_-Qunused-arguments_-fPIC_-fPIE_-gdwarf-4_-Wall/constbranchindex/crypto_hash/sha256/rust_sha2/work/target/release/build/crypto_hash_sha256-5cd230be06f90398/out/libtry-anything.a(try-anything.o): in function `c_main':
try.c: .../supercop-data/jasper/amd64/try/c/clang_-march=native_-O_-fwrapv_-Qunused-arguments_-fPIC_-fPIE_-gdwarf-4_-Wall/constbranchindex/crypto_hash/sha256/rust_sha2/work/try-anything.c:331: undefined reference to `cpucycles_amd64rdpmc'
try.c: /usr/bin/ld: .../supercop-data/jasper/amd64/try/c/clang_-march=native_-O_-fwrapv_-Qunused-arguments_-fPIC_-fPIE_-gdwarf-4_-Wall/constbranchindex/crypto_hash/sha256/rust_sha2/work/try-anything.c:332: undefined reference to `cpucycles_amd64rdpmc'
try.c: /usr/bin/ld: .../supercop-data/jasper/amd64/try/c/clang_-march=native_-O_-fwrapv_-Qunused-arguments_-fPIC_-fPIE_-gdwarf-4_-Wall/constbranchindex/crypto_hash/sha256/rust_sha2/work/try-anything.c:333: undefined reference to `cpucycles_amd64rdpmc_persecond'
try.c: /usr/bin/ld: .../supercop-data/jasper/amd64/try/c/clang_-march=native_-O_-fwrapv_-Qunused-arguments_-fPIC_-fPIE_-gdwarf-4_-Wall/constbranchindex/crypto_hash/sha256/rust_sha2/work/try-anything.c:344: undefined reference to `cpucycles_amd64rdpmc'
try.c: /usr/bin/ld: .../supercop-data/jasper/amd64/try/c/clang_-march=native_-O_-fwrapv_-Qunused-arguments_-fPIC_-fPIE_-gdwarf-4_-Wall/constbranchindex/crypto_hash/sha256/rust_sha2/work/try-anything.c:346: undefined reference to `cpucycles_amd64rdpmc'
try.c: /usr/bin/ld: .../supercop-data/jasper/amd64/try/c/clang_-march=native_-O_-fwrapv_-Qunused-arguments_-fPIC_-fPIE_-gdwarf-4_-Wall/constbranchindex/crypto_hash/sha256/rust_sha2/work/try-anything.c:353: undefined reference to `cpucycles_amd64rdpmc'
try.c: /usr/bin/ld: .../supercop-data/jasper/amd64/try/c/clang_-march=native_-O_-fwrapv_-Qunused-arguments_-fPIC_-fPIE_-gdwarf-4_-Wall/constbranchindex/crypto_hash/sha256/rust_sha2/work/try-anything.c:356: undefined reference to `cpucycles_amd64rdpmc'
try.c: collect2: error: ld returned 1 exit status
try.c:
try.c:
try.c: error: aborting due to previous error
try.c:
try.c: error: could not compile `crypto_hash_sha256`.
try.c:
try.c: To learn more, run the command again with --verbose.
Number of similar (implementation,compiler) pairs: 1, namely:
Implementation | Compiler |
rust_sha2 | clang -march=native -O -fwrapv -Qunused-arguments -fPIC -fPIE -gdwarf-4 -Wall (Debian_Clang_11.0.1) |
Compiler output
try.c: error: linking with `cc` failed: exit code: 1
try.c: |
try.c: = note: "cc" "-Wl,--as-needed" "-Wl,-z,noexecstack" "-m64" "-Wl,--eh-frame-hdr" "-L" "/usr/lib/rustlib/x86_64-unknown-linux-gnu/lib" ".../supercop-data/jasper/amd64/try/c/clang_-march=native_-Os_-fwrapv_-Qunused-arguments_-fPIC_-fPIE_-gdwarf-4_-Wall/constbranchindex/crypto_hash/sha256/rust_sha2/work/target/release/deps/try_small-9e5a796331e8e781.try_small.wogv34f0-cgu.0.rcgu.o" ".../supercop-data/jasper/amd64/try/c/clang_-march=native_-Os_-fwrapv_-Qunused-arguments_-fPIC_-fPIE_-gdwarf-4_-Wall/constbranchindex/crypto_hash/sha256/rust_sha2/work/target/release/deps/try_small-9e5a796331e8e781.try_small.wogv34f0-cgu.1.rcgu.o" ".../supercop-data/jasper/amd64/try/c/clang_-march=native_-Os_-fwrapv_-Qunused-arguments_-fPIC_-fPIE_-gdwarf-4_-Wall/constbranchindex/crypto_hash/sha256/rust_sha2/work/target/release/deps/try_small-9e5a796331e8e781.try_small.wogv34f0-cgu.2.rcgu.o" ".../supercop-data/jasper/amd64/try/c/clang_-march=native_-Os_-fwrapv_-Qunused-arguments_-fPIC_-fPIE_-gdwarf-4_-Wall/constbranchindex/crypto_hash/sha256/rust_sha2/work/target/release/deps/try_small-9e5a796331e8e781.try_small.wogv34f0-cgu.3.rcgu.o" ".../supercop-data/jasper/amd64/try/c/clang_-march=native_-Os_-fwrapv_-Qunused-arguments_-fPIC_-fPIE_-gdwarf-4_-Wall/constbranchindex/crypto_hash/sha256/rust_sha2/work/target/release/deps/try_small-9e5a796331e8e781.try_small.wogv34f0-cgu.4.rcgu.o" "-o" ".../supercop-data/jasper/amd64/try/c/clang_-march=native_-Os_-fwrapv_-Qunused-arguments_-fPIC_-fPIE_-gdwarf-4_-Wall/constbranchindex/crypto_hash/sha256/rust_sha2/work/target/release/deps/try_small-9e5a796331e8e781" ".../supercop-data/jasper/amd64/try/c/clang_-march=native_-Os_-fwrapv_-Qunused-arguments_-fPIC_-fPIE_-gdwarf-4_-Wall/constbranchindex/crypto_hash/sha256/rust_sha2/work/target/release/deps/try_small-9e5a796331e8e781.1bv51pu6l67stnpc.rcgu.o" "-Wl,--gc-sections" "-pie" "-Wl,-zrelro" "-Wl,-znow" "-Wl,-O1" "-nodefaultlibs" "-L" ".../supercop-data/jasper/amd64/try/c/clang_-march=native_-Os_-fwrapv_-Qunused-arguments_-fPIC_-fPIE_-gdwarf-4_-Wall/constbranchindex/crypto_hash/sha256/rust_sha2/work/target/release/deps" "-L" ".../supercop-data/jasper/amd64/lib" "-L" ".../supercop-data/jasper/amd64/try/c/clang_-march=native_-Os_-fwrapv_-Qunused-arguments_-fPIC_-fPIE_-gdwarf-4_-Wall/constbranchindex/crypto_hash/sha256/rust_sha2/work/target/release/build/crypto_hash_sha256-5cd230be06f90398/out" "-L" "/usr/lib/rustlib/x86_64-unknown-linux-gnu/lib" "-ltry-anything" "-ltry-small" "-lsupercop" "-lkernelrandombytes" "-lcpucycles" "-lcrypto" "-lnsl" "-lm" "-Wl,-Bstatic" ".../supercop-data/jasper/amd64/try/c/clang_-march=native_-Os_-fwrapv_-Qunused-arguments_-fPIC_-fPIE_-gdwarf-4_-Wall/constbranchindex/crypto_hash/sha256/rust_sha2/work/target/release/deps/libcrypto_hash_sha256-59a535abfecfde21.rlib" ".../supercop-data/jasper/amd64/try/c/clang_-march=native_-Os_-fwrapv_-Qunused-arguments_-fPIC_-fPIE_-gdwarf-4_-Wall/constbranchindex/crypto_hash/sha256/rust_sha2/work/target/release/deps/libsha2-fee2faec0cc98b9d.rlib" ".../supercop-data/jasper/amd64/try/c/clang_-march=native_-Os_-fwrapv_-Qunused-arguments_-fPIC_-fPIE_-gdwarf-4_-Wall/constbranchindex/crypto_hash/sha256/rust_sha2/work/target/release/deps/libcpuid_bool-a511188b3e8fb9e7.rlib" ".../supercop-data/jasper/amd64/try/c/clang_-march=native_-Os_-fwrapv_-Qunused-arguments_-fPIC_-fPIE_-gdwarf-4_-Wall/constbranchindex/crypto_hash/sha256/rust_sha2/work/target/release/deps/libcfg_if-11669ae4b1851f60.rlib" ".../supercop-data/jasper/amd64/try/c/clang_-march=native_-Os_-fwrapv_-Qunused-arguments_-fPIC_-fPIE_-gdwarf-4_-Wall/constbranchindex/crypto_hash/sha256/rust_sha2/work/target/release/deps/libopaque_debug-ff52af415c56e1a8.rlib" ".../supercop-data/jasper/amd64/try/c/clang_-march=native_-Os_-fwrapv_-Qunused-arguments_-fPIC_-fPIE_-gdwarf-4_-Wall/constbranchindex/crypto_hash/sha256/rust_sha2/work/target/release/deps/libdigest-137540d47480a0cd.rlib" ".../supercop-data/jasper/amd64/try/c/clang_-march=native_-Os_-fwrapv_-Qunused-arguments_-fPIC_-fPIE_-gdwarf-4_-Wall/constbranchindex/crypto_hash/sha256/rust_sha2/work/target/release/deps/libblock_buffer-d8051f65e68b5aa7.rlib" ".../supercop-data/jasper/amd64/try/c/clang_-march=native_-Os_-fwrapv_-Qunused-arguments_-fPIC_-fPIE_-gdwarf-4_-Wall/constbranchindex/crypto_hash/sha256/rust_sha2/work/target/release/deps/libgeneric_array-6bd8cd5d26e69f54.rlib" ".../supercop-data/jasper/amd64/try/c/clang_-march=native_-Os_-fwrapv_-Qunused-arguments_-fPIC_-fPIE_-gdwarf-4_-Wall/constbranchindex/crypto_hash/sha256/rust_sha2/work/target/release/deps/libtypenum-ac0d7f64b1a84d19.rlib" "-Wl,--start-group" "/usr/lib/rustlib/x86_64-unknown-linux-gnu/lib/libstd-6bf3f16f340782ca.rlib" "/usr/lib/rustlib/x86_64-unknown-linux-gnu/lib/libpanic_unwind-13f3099d50c21bc6.rlib" "/usr/lib/rustlib/x86_64-unknown-linux-gnu/lib/libminiz_oxide-a2ba33c985785afe.rlib" "/usr/lib/rustlib/x86_64-unknown-linux-gnu/lib/libadler-3f6e9f8f4afbea6d.rlib" "/usr/lib/rustlib/x86_64-unknown-linux-gnu/lib/libobject-af517d7f13e7c960.rlib" "/usr/lib/rustlib/x86_64-unknown-linux-gnu/lib/libaddr2line-12740563628e601f.rlib" "/usr/lib/rustlib/x86_64-unknown-linux-gnu/lib/libgimli-0ac82a1e1820dd21.rlib" "/usr/lib/rustlib/x86_64-unknown-linux-gnu/lib/librustc_demangle-3ac2d0878c297d42.rlib" "/usr/lib/rustlib/x86_64-unknown-linux-gnu/lib/libhashbrown-c6632ca171f954dd.rlib" "/usr/lib/rustlib/x86_64-unknown-linux-gnu/lib/librustc_std_workspace_alloc-b5bfd0198c7b740d.rlib" "/usr/lib/rustlib/x86_64-unknown-linux-gnu/lib/libunwind-bd645b20c6c7b56d.rlib" "/usr/lib/rustlib/x86_64-unknown-linux-gnu/lib/libcfg_if-b9e1e523c0c29a77.rlib" "/usr/lib/rustlib/x86_64-unknown-linux-gnu/lib/liblibc-dfbef8c525de0186.rlib" "/usr/lib/rustlib/x86_64-unknown-linux-gnu/lib/liballoc-1ebf406bd4ea5769.rlib" "/usr/lib/rustlib/x86_64-unknown-linux-gnu/lib/librustc_std_workspace_core-5e0675f526ef5c6b.rlib" "/usr/lib/rustlib/x86_64-unknown-linux-gnu/lib/libcore-3375e4f89d420e7a.rlib" "-Wl,--end-group" "/usr/lib/rustlib/x86_64-unknown-linux-gnu/lib/libcompiler_builtins-f74b197469e67088.rlib" "-Wl,-Bdynamic" "-lgcc_s" "-lc" "-lm" "-lrt" "-lpthread" "-lutil" "-ldl" "-lutil"
try.c: = note: /usr/bin/ld: .../supercop-data/jasper/amd64/try/c/clang_-march=native_-Os_-fwrapv_-Qunused-arguments_-fPIC_-fPIE_-gdwarf-4_-Wall/constbranchindex/crypto_hash/sha256/rust_sha2/work/target/release/build/crypto_hash_sha256-5cd230be06f90398/out/libtry-anything.a(try-anything.o): in function `c_main':
try.c: .../supercop-data/jasper/amd64/try/c/clang_-march=native_-Os_-fwrapv_-Qunused-arguments_-fPIC_-fPIE_-gdwarf-4_-Wall/constbranchindex/crypto_hash/sha256/rust_sha2/work/try-anything.c:331: undefined reference to `cpucycles_amd64rdpmc'
try.c: /usr/bin/ld: .../supercop-data/jasper/amd64/try/c/clang_-march=native_-Os_-fwrapv_-Qunused-arguments_-fPIC_-fPIE_-gdwarf-4_-Wall/constbranchindex/crypto_hash/sha256/rust_sha2/work/try-anything.c:332: undefined reference to `cpucycles_amd64rdpmc'
try.c: /usr/bin/ld: .../supercop-data/jasper/amd64/try/c/clang_-march=native_-Os_-fwrapv_-Qunused-arguments_-fPIC_-fPIE_-gdwarf-4_-Wall/constbranchindex/crypto_hash/sha256/rust_sha2/work/try-anything.c:333: undefined reference to `cpucycles_amd64rdpmc_persecond'
try.c: /usr/bin/ld: .../supercop-data/jasper/amd64/try/c/clang_-march=native_-Os_-fwrapv_-Qunused-arguments_-fPIC_-fPIE_-gdwarf-4_-Wall/constbranchindex/crypto_hash/sha256/rust_sha2/work/try-anything.c:344: undefined reference to `cpucycles_amd64rdpmc'
try.c: /usr/bin/ld: .../supercop-data/jasper/amd64/try/c/clang_-march=native_-Os_-fwrapv_-Qunused-arguments_-fPIC_-fPIE_-gdwarf-4_-Wall/constbranchindex/crypto_hash/sha256/rust_sha2/work/try-anything.c:346: undefined reference to `cpucycles_amd64rdpmc'
try.c: /usr/bin/ld: .../supercop-data/jasper/amd64/try/c/clang_-march=native_-Os_-fwrapv_-Qunused-arguments_-fPIC_-fPIE_-gdwarf-4_-Wall/constbranchindex/crypto_hash/sha256/rust_sha2/work/try-anything.c:353: undefined reference to `cpucycles_amd64rdpmc'
try.c: /usr/bin/ld: .../supercop-data/jasper/amd64/try/c/clang_-march=native_-Os_-fwrapv_-Qunused-arguments_-fPIC_-fPIE_-gdwarf-4_-Wall/constbranchindex/crypto_hash/sha256/rust_sha2/work/try-anything.c:356: undefined reference to `cpucycles_amd64rdpmc'
try.c: collect2: error: ld returned 1 exit status
try.c:
try.c:
try.c: error: aborting due to previous error
try.c:
try.c: error: could not compile `crypto_hash_sha256`.
try.c:
try.c: To learn more, run the command again with --verbose.
Number of similar (implementation,compiler) pairs: 1, namely:
Implementation | Compiler |
rust_sha2 | clang -march=native -Os -fwrapv -Qunused-arguments -fPIC -fPIE -gdwarf-4 -Wall (Debian_Clang_11.0.1) |
Compiler output
try.c: error: linking with `cc` failed: exit code: 1
try.c: |
try.c: = note: "cc" "-Wl,--as-needed" "-Wl,-z,noexecstack" "-m64" "-Wl,--eh-frame-hdr" "-L" "/usr/lib/rustlib/x86_64-unknown-linux-gnu/lib" ".../supercop-data/jasper/amd64/try/c/clang_-mcpu=native_-O3_-fwrapv_-Qunused-arguments_-fPIC_-fPIE_-gdwarf-4_-Wall/constbranchindex/crypto_hash/sha256/rust_sha2/work/target/release/deps/try-444f87ff176ff1a2.try.eh7uyr3c-cgu.0.rcgu.o" ".../supercop-data/jasper/amd64/try/c/clang_-mcpu=native_-O3_-fwrapv_-Qunused-arguments_-fPIC_-fPIE_-gdwarf-4_-Wall/constbranchindex/crypto_hash/sha256/rust_sha2/work/target/release/deps/try-444f87ff176ff1a2.try.eh7uyr3c-cgu.1.rcgu.o" ".../supercop-data/jasper/amd64/try/c/clang_-mcpu=native_-O3_-fwrapv_-Qunused-arguments_-fPIC_-fPIE_-gdwarf-4_-Wall/constbranchindex/crypto_hash/sha256/rust_sha2/work/target/release/deps/try-444f87ff176ff1a2.try.eh7uyr3c-cgu.2.rcgu.o" ".../supercop-data/jasper/amd64/try/c/clang_-mcpu=native_-O3_-fwrapv_-Qunused-arguments_-fPIC_-fPIE_-gdwarf-4_-Wall/constbranchindex/crypto_hash/sha256/rust_sha2/work/target/release/deps/try-444f87ff176ff1a2.try.eh7uyr3c-cgu.3.rcgu.o" ".../supercop-data/jasper/amd64/try/c/clang_-mcpu=native_-O3_-fwrapv_-Qunused-arguments_-fPIC_-fPIE_-gdwarf-4_-Wall/constbranchindex/crypto_hash/sha256/rust_sha2/work/target/release/deps/try-444f87ff176ff1a2.try.eh7uyr3c-cgu.4.rcgu.o" "-o" ".../supercop-data/jasper/amd64/try/c/clang_-mcpu=native_-O3_-fwrapv_-Qunused-arguments_-fPIC_-fPIE_-gdwarf-4_-Wall/constbranchindex/crypto_hash/sha256/rust_sha2/work/target/release/deps/try-444f87ff176ff1a2" ".../supercop-data/jasper/amd64/try/c/clang_-mcpu=native_-O3_-fwrapv_-Qunused-arguments_-fPIC_-fPIE_-gdwarf-4_-Wall/constbranchindex/crypto_hash/sha256/rust_sha2/work/target/release/deps/try-444f87ff176ff1a2.4qvuycn7jdjdfii3.rcgu.o" "-Wl,--gc-sections" "-pie" "-Wl,-zrelro" "-Wl,-znow" "-Wl,-O1" "-nodefaultlibs" "-L" ".../supercop-data/jasper/amd64/try/c/clang_-mcpu=native_-O3_-fwrapv_-Qunused-arguments_-fPIC_-fPIE_-gdwarf-4_-Wall/constbranchindex/crypto_hash/sha256/rust_sha2/work/target/release/deps" "-L" ".../supercop-data/jasper/amd64/lib" "-L" ".../supercop-data/jasper/amd64/try/c/clang_-mcpu=native_-O3_-fwrapv_-Qunused-arguments_-fPIC_-fPIE_-gdwarf-4_-Wall/constbranchindex/crypto_hash/sha256/rust_sha2/work/target/release/build/crypto_hash_sha256-5cd230be06f90398/out" "-L" "/usr/lib/rustlib/x86_64-unknown-linux-gnu/lib" "-ltry-anything" "-ltry" "-lsupercop" "-lkernelrandombytes" "-lcpucycles" "-lcrypto" "-lnsl" "-lm" "-Wl,-Bstatic" ".../supercop-data/jasper/amd64/try/c/clang_-mcpu=native_-O3_-fwrapv_-Qunused-arguments_-fPIC_-fPIE_-gdwarf-4_-Wall/constbranchindex/crypto_hash/sha256/rust_sha2/work/target/release/deps/libcrypto_hash_sha256-59a535abfecfde21.rlib" ".../supercop-data/jasper/amd64/try/c/clang_-mcpu=native_-O3_-fwrapv_-Qunused-arguments_-fPIC_-fPIE_-gdwarf-4_-Wall/constbranchindex/crypto_hash/sha256/rust_sha2/work/target/release/deps/libsha2-fee2faec0cc98b9d.rlib" ".../supercop-data/jasper/amd64/try/c/clang_-mcpu=native_-O3_-fwrapv_-Qunused-arguments_-fPIC_-fPIE_-gdwarf-4_-Wall/constbranchindex/crypto_hash/sha256/rust_sha2/work/target/release/deps/libcpuid_bool-a511188b3e8fb9e7.rlib" ".../supercop-data/jasper/amd64/try/c/clang_-mcpu=native_-O3_-fwrapv_-Qunused-arguments_-fPIC_-fPIE_-gdwarf-4_-Wall/constbranchindex/crypto_hash/sha256/rust_sha2/work/target/release/deps/libcfg_if-11669ae4b1851f60.rlib" ".../supercop-data/jasper/amd64/try/c/clang_-mcpu=native_-O3_-fwrapv_-Qunused-arguments_-fPIC_-fPIE_-gdwarf-4_-Wall/constbranchindex/crypto_hash/sha256/rust_sha2/work/target/release/deps/libopaque_debug-ff52af415c56e1a8.rlib" ".../supercop-data/jasper/amd64/try/c/clang_-mcpu=native_-O3_-fwrapv_-Qunused-arguments_-fPIC_-fPIE_-gdwarf-4_-Wall/constbranchindex/crypto_hash/sha256/rust_sha2/work/target/release/deps/libdigest-137540d47480a0cd.rlib" ".../supercop-data/jasper/amd64/try/c/clang_-mcpu=native_-O3_-fwrapv_-Qunused-arguments_-fPIC_-fPIE_-gdwarf-4_-Wall/constbranchindex/crypto_hash/sha256/rust_sha2/work/target/release/deps/libblock_buffer-d8051f65e68b5aa7.rlib" ".../supercop-data/jasper/amd64/try/c/clang_-mcpu=native_-O3_-fwrapv_-Qunused-arguments_-fPIC_-fPIE_-gdwarf-4_-Wall/constbranchindex/crypto_hash/sha256/rust_sha2/work/target/release/deps/libgeneric_array-6bd8cd5d26e69f54.rlib" ".../supercop-data/jasper/amd64/try/c/clang_-mcpu=native_-O3_-fwrapv_-Qunused-arguments_-fPIC_-fPIE_-gdwarf-4_-Wall/constbranchindex/crypto_hash/sha256/rust_sha2/work/target/release/deps/libtypenum-ac0d7f64b1a84d19.rlib" "-Wl,--start-group" "/usr/lib/rustlib/x86_64-unknown-linux-gnu/lib/libstd-6bf3f16f340782ca.rlib" "/usr/lib/rustlib/x86_64-unknown-linux-gnu/lib/libpanic_unwind-13f3099d50c21bc6.rlib" "/usr/lib/rustlib/x86_64-unknown-linux-gnu/lib/libminiz_oxide-a2ba33c985785afe.rlib" "/usr/lib/rustlib/x86_64-unknown-linux-gnu/lib/libadler-3f6e9f8f4afbea6d.rlib" "/usr/lib/rustlib/x86_64-unknown-linux-gnu/lib/libobject-af517d7f13e7c960.rlib" "/usr/lib/rustlib/x86_64-unknown-linux-gnu/lib/libaddr2line-12740563628e601f.rlib" "/usr/lib/rustlib/x86_64-unknown-linux-gnu/lib/libgimli-0ac82a1e1820dd21.rlib" "/usr/lib/rustlib/x86_64-unknown-linux-gnu/lib/librustc_demangle-3ac2d0878c297d42.rlib" "/usr/lib/rustlib/x86_64-unknown-linux-gnu/lib/libhashbrown-c6632ca171f954dd.rlib" "/usr/lib/rustlib/x86_64-unknown-linux-gnu/lib/librustc_std_workspace_alloc-b5bfd0198c7b740d.rlib" "/usr/lib/rustlib/x86_64-unknown-linux-gnu/lib/libunwind-bd645b20c6c7b56d.rlib" "/usr/lib/rustlib/x86_64-unknown-linux-gnu/lib/libcfg_if-b9e1e523c0c29a77.rlib" "/usr/lib/rustlib/x86_64-unknown-linux-gnu/lib/liblibc-dfbef8c525de0186.rlib" "/usr/lib/rustlib/x86_64-unknown-linux-gnu/lib/liballoc-1ebf406bd4ea5769.rlib" "/usr/lib/rustlib/x86_64-unknown-linux-gnu/lib/librustc_std_workspace_core-5e0675f526ef5c6b.rlib" "/usr/lib/rustlib/x86_64-unknown-linux-gnu/lib/libcore-3375e4f89d420e7a.rlib" "-Wl,--end-group" "/usr/lib/rustlib/x86_64-unknown-linux-gnu/lib/libcompiler_builtins-f74b197469e67088.rlib" "-Wl,-Bdynamic" "-lgcc_s" "-lc" "-lm" "-lrt" "-lpthread" "-lutil" "-ldl" "-lutil"
try.c: = note: /usr/bin/ld: .../supercop-data/jasper/amd64/try/c/clang_-mcpu=native_-O3_-fwrapv_-Qunused-arguments_-fPIC_-fPIE_-gdwarf-4_-Wall/constbranchindex/crypto_hash/sha256/rust_sha2/work/target/release/build/crypto_hash_sha256-5cd230be06f90398/out/libtry-anything.a(try-anything.o): in function `c_main':
try.c: .../supercop-data/jasper/amd64/try/c/clang_-mcpu=native_-O3_-fwrapv_-Qunused-arguments_-fPIC_-fPIE_-gdwarf-4_-Wall/constbranchindex/crypto_hash/sha256/rust_sha2/work/try-anything.c:331: undefined reference to `cpucycles_amd64rdpmc'
try.c: /usr/bin/ld: .../supercop-data/jasper/amd64/try/c/clang_-mcpu=native_-O3_-fwrapv_-Qunused-arguments_-fPIC_-fPIE_-gdwarf-4_-Wall/constbranchindex/crypto_hash/sha256/rust_sha2/work/try-anything.c:332: undefined reference to `cpucycles_amd64rdpmc'
try.c: /usr/bin/ld: .../supercop-data/jasper/amd64/try/c/clang_-mcpu=native_-O3_-fwrapv_-Qunused-arguments_-fPIC_-fPIE_-gdwarf-4_-Wall/constbranchindex/crypto_hash/sha256/rust_sha2/work/try-anything.c:333: undefined reference to `cpucycles_amd64rdpmc_persecond'
try.c: /usr/bin/ld: .../supercop-data/jasper/amd64/try/c/clang_-mcpu=native_-O3_-fwrapv_-Qunused-arguments_-fPIC_-fPIE_-gdwarf-4_-Wall/constbranchindex/crypto_hash/sha256/rust_sha2/work/try-anything.c:344: undefined reference to `cpucycles_amd64rdpmc'
try.c: /usr/bin/ld: .../supercop-data/jasper/amd64/try/c/clang_-mcpu=native_-O3_-fwrapv_-Qunused-arguments_-fPIC_-fPIE_-gdwarf-4_-Wall/constbranchindex/crypto_hash/sha256/rust_sha2/work/try-anything.c:346: undefined reference to `cpucycles_amd64rdpmc'
try.c: /usr/bin/ld: .../supercop-data/jasper/amd64/try/c/clang_-mcpu=native_-O3_-fwrapv_-Qunused-arguments_-fPIC_-fPIE_-gdwarf-4_-Wall/constbranchindex/crypto_hash/sha256/rust_sha2/work/try-anything.c:353: undefined reference to `cpucycles_amd64rdpmc'
try.c: /usr/bin/ld: .../supercop-data/jasper/amd64/try/c/clang_-mcpu=native_-O3_-fwrapv_-Qunused-arguments_-fPIC_-fPIE_-gdwarf-4_-Wall/constbranchindex/crypto_hash/sha256/rust_sha2/work/try-anything.c:356: undefined reference to `cpucycles_amd64rdpmc'
try.c: collect2: error: ld returned 1 exit status
try.c:
try.c:
try.c: error: aborting due to previous error
try.c:
try.c: error: could not compile `crypto_hash_sha256`.
try.c:
try.c: To learn more, run the command again with --verbose.
Number of similar (implementation,compiler) pairs: 1, namely:
Implementation | Compiler |
rust_sha2 | clang -mcpu=native -O3 -fwrapv -Qunused-arguments -fPIC -fPIE -gdwarf-4 -Wall (Debian_Clang_11.0.1) |
Compiler output
try.c: error: linking with `cc` failed: exit code: 1
try.c: |
try.c: = note: "cc" "-Wl,--as-needed" "-Wl,-z,noexecstack" "-m64" "-Wl,--eh-frame-hdr" "-L" "/usr/lib/rustlib/x86_64-unknown-linux-gnu/lib" ".../supercop-data/jasper/amd64/try/c/gcc_-march=native_-mtune=native_-O2_-fwrapv_-fPIC_-fPIE_-gdwarf-4_-Wall/constbranchindex/crypto_hash/sha256/rust_sha2/work/target/release/deps/try_small-9e5a796331e8e781.try_small.wogv34f0-cgu.0.rcgu.o" ".../supercop-data/jasper/amd64/try/c/gcc_-march=native_-mtune=native_-O2_-fwrapv_-fPIC_-fPIE_-gdwarf-4_-Wall/constbranchindex/crypto_hash/sha256/rust_sha2/work/target/release/deps/try_small-9e5a796331e8e781.try_small.wogv34f0-cgu.1.rcgu.o" ".../supercop-data/jasper/amd64/try/c/gcc_-march=native_-mtune=native_-O2_-fwrapv_-fPIC_-fPIE_-gdwarf-4_-Wall/constbranchindex/crypto_hash/sha256/rust_sha2/work/target/release/deps/try_small-9e5a796331e8e781.try_small.wogv34f0-cgu.2.rcgu.o" ".../supercop-data/jasper/amd64/try/c/gcc_-march=native_-mtune=native_-O2_-fwrapv_-fPIC_-fPIE_-gdwarf-4_-Wall/constbranchindex/crypto_hash/sha256/rust_sha2/work/target/release/deps/try_small-9e5a796331e8e781.try_small.wogv34f0-cgu.3.rcgu.o" ".../supercop-data/jasper/amd64/try/c/gcc_-march=native_-mtune=native_-O2_-fwrapv_-fPIC_-fPIE_-gdwarf-4_-Wall/constbranchindex/crypto_hash/sha256/rust_sha2/work/target/release/deps/try_small-9e5a796331e8e781.try_small.wogv34f0-cgu.4.rcgu.o" "-o" ".../supercop-data/jasper/amd64/try/c/gcc_-march=native_-mtune=native_-O2_-fwrapv_-fPIC_-fPIE_-gdwarf-4_-Wall/constbranchindex/crypto_hash/sha256/rust_sha2/work/target/release/deps/try_small-9e5a796331e8e781" ".../supercop-data/jasper/amd64/try/c/gcc_-march=native_-mtune=native_-O2_-fwrapv_-fPIC_-fPIE_-gdwarf-4_-Wall/constbranchindex/crypto_hash/sha256/rust_sha2/work/target/release/deps/try_small-9e5a796331e8e781.1bv51pu6l67stnpc.rcgu.o" "-Wl,--gc-sections" "-pie" "-Wl,-zrelro" "-Wl,-znow" "-Wl,-O1" "-nodefaultlibs" "-L" ".../supercop-data/jasper/amd64/try/c/gcc_-march=native_-mtune=native_-O2_-fwrapv_-fPIC_-fPIE_-gdwarf-4_-Wall/constbranchindex/crypto_hash/sha256/rust_sha2/work/target/release/deps" "-L" ".../supercop-data/jasper/amd64/lib" "-L" ".../supercop-data/jasper/amd64/try/c/gcc_-march=native_-mtune=native_-O2_-fwrapv_-fPIC_-fPIE_-gdwarf-4_-Wall/constbranchindex/crypto_hash/sha256/rust_sha2/work/target/release/build/crypto_hash_sha256-5cd230be06f90398/out" "-L" "/usr/lib/rustlib/x86_64-unknown-linux-gnu/lib" "-ltry-anything" "-ltry-small" "-lsupercop" "-lkernelrandombytes" "-lcpucycles" "-lcrypto" "-lnsl" "-lm" "-Wl,-Bstatic" ".../supercop-data/jasper/amd64/try/c/gcc_-march=native_-mtune=native_-O2_-fwrapv_-fPIC_-fPIE_-gdwarf-4_-Wall/constbranchindex/crypto_hash/sha256/rust_sha2/work/target/release/deps/libcrypto_hash_sha256-59a535abfecfde21.rlib" ".../supercop-data/jasper/amd64/try/c/gcc_-march=native_-mtune=native_-O2_-fwrapv_-fPIC_-fPIE_-gdwarf-4_-Wall/constbranchindex/crypto_hash/sha256/rust_sha2/work/target/release/deps/libsha2-fee2faec0cc98b9d.rlib" ".../supercop-data/jasper/amd64/try/c/gcc_-march=native_-mtune=native_-O2_-fwrapv_-fPIC_-fPIE_-gdwarf-4_-Wall/constbranchindex/crypto_hash/sha256/rust_sha2/work/target/release/deps/libcpuid_bool-a511188b3e8fb9e7.rlib" ".../supercop-data/jasper/amd64/try/c/gcc_-march=native_-mtune=native_-O2_-fwrapv_-fPIC_-fPIE_-gdwarf-4_-Wall/constbranchindex/crypto_hash/sha256/rust_sha2/work/target/release/deps/libcfg_if-11669ae4b1851f60.rlib" ".../supercop-data/jasper/amd64/try/c/gcc_-march=native_-mtune=native_-O2_-fwrapv_-fPIC_-fPIE_-gdwarf-4_-Wall/constbranchindex/crypto_hash/sha256/rust_sha2/work/target/release/deps/libopaque_debug-ff52af415c56e1a8.rlib" ".../supercop-data/jasper/amd64/try/c/gcc_-march=native_-mtune=native_-O2_-fwrapv_-fPIC_-fPIE_-gdwarf-4_-Wall/constbranchindex/crypto_hash/sha256/rust_sha2/work/target/release/deps/libdigest-137540d47480a0cd.rlib" ".../supercop-data/jasper/amd64/try/c/gcc_-march=native_-mtune=native_-O2_-fwrapv_-fPIC_-fPIE_-gdwarf-4_-Wall/constbranchindex/crypto_hash/sha256/rust_sha2/work/target/release/deps/libblock_buffer-d8051f65e68b5aa7.rlib" ".../supercop-data/jasper/amd64/try/c/gcc_-march=native_-mtune=native_-O2_-fwrapv_-fPIC_-fPIE_-gdwarf-4_-Wall/constbranchindex/crypto_hash/sha256/rust_sha2/work/target/release/deps/libgeneric_array-6bd8cd5d26e69f54.rlib" ".../supercop-data/jasper/amd64/try/c/gcc_-march=native_-mtune=native_-O2_-fwrapv_-fPIC_-fPIE_-gdwarf-4_-Wall/constbranchindex/crypto_hash/sha256/rust_sha2/work/target/release/deps/libtypenum-ac0d7f64b1a84d19.rlib" "-Wl,--start-group" "/usr/lib/rustlib/x86_64-unknown-linux-gnu/lib/libstd-6bf3f16f340782ca.rlib" "/usr/lib/rustlib/x86_64-unknown-linux-gnu/lib/libpanic_unwind-13f3099d50c21bc6.rlib" "/usr/lib/rustlib/x86_64-unknown-linux-gnu/lib/libminiz_oxide-a2ba33c985785afe.rlib" "/usr/lib/rustlib/x86_64-unknown-linux-gnu/lib/libadler-3f6e9f8f4afbea6d.rlib" "/usr/lib/rustlib/x86_64-unknown-linux-gnu/lib/libobject-af517d7f13e7c960.rlib" "/usr/lib/rustlib/x86_64-unknown-linux-gnu/lib/libaddr2line-12740563628e601f.rlib" "/usr/lib/rustlib/x86_64-unknown-linux-gnu/lib/libgimli-0ac82a1e1820dd21.rlib" "/usr/lib/rustlib/x86_64-unknown-linux-gnu/lib/librustc_demangle-3ac2d0878c297d42.rlib" "/usr/lib/rustlib/x86_64-unknown-linux-gnu/lib/libhashbrown-c6632ca171f954dd.rlib" "/usr/lib/rustlib/x86_64-unknown-linux-gnu/lib/librustc_std_workspace_alloc-b5bfd0198c7b740d.rlib" "/usr/lib/rustlib/x86_64-unknown-linux-gnu/lib/libunwind-bd645b20c6c7b56d.rlib" "/usr/lib/rustlib/x86_64-unknown-linux-gnu/lib/libcfg_if-b9e1e523c0c29a77.rlib" "/usr/lib/rustlib/x86_64-unknown-linux-gnu/lib/liblibc-dfbef8c525de0186.rlib" "/usr/lib/rustlib/x86_64-unknown-linux-gnu/lib/liballoc-1ebf406bd4ea5769.rlib" "/usr/lib/rustlib/x86_64-unknown-linux-gnu/lib/librustc_std_workspace_core-5e0675f526ef5c6b.rlib" "/usr/lib/rustlib/x86_64-unknown-linux-gnu/lib/libcore-3375e4f89d420e7a.rlib" "-Wl,--end-group" "/usr/lib/rustlib/x86_64-unknown-linux-gnu/lib/libcompiler_builtins-f74b197469e67088.rlib" "-Wl,-Bdynamic" "-lgcc_s" "-lc" "-lm" "-lrt" "-lpthread" "-lutil" "-ldl" "-lutil"
try.c: = note: /usr/bin/ld: .../supercop-data/jasper/amd64/try/c/gcc_-march=native_-mtune=native_-O2_-fwrapv_-fPIC_-fPIE_-gdwarf-4_-Wall/constbranchindex/crypto_hash/sha256/rust_sha2/work/target/release/build/crypto_hash_sha256-5cd230be06f90398/out/libtry-anything.a(try-anything.o): in function `c_main':
try.c: .../supercop-data/jasper/amd64/try/c/gcc_-march=native_-mtune=native_-O2_-fwrapv_-fPIC_-fPIE_-gdwarf-4_-Wall/constbranchindex/crypto_hash/sha256/rust_sha2/work/try-anything.c:331: undefined reference to `cpucycles_amd64rdpmc'
try.c: /usr/bin/ld: .../supercop-data/jasper/amd64/try/c/gcc_-march=native_-mtune=native_-O2_-fwrapv_-fPIC_-fPIE_-gdwarf-4_-Wall/constbranchindex/crypto_hash/sha256/rust_sha2/work/try-anything.c:332: undefined reference to `cpucycles_amd64rdpmc'
try.c: /usr/bin/ld: .../supercop-data/jasper/amd64/try/c/gcc_-march=native_-mtune=native_-O2_-fwrapv_-fPIC_-fPIE_-gdwarf-4_-Wall/constbranchindex/crypto_hash/sha256/rust_sha2/work/try-anything.c:333: undefined reference to `cpucycles_amd64rdpmc_persecond'
try.c: /usr/bin/ld: .../supercop-data/jasper/amd64/try/c/gcc_-march=native_-mtune=native_-O2_-fwrapv_-fPIC_-fPIE_-gdwarf-4_-Wall/constbranchindex/crypto_hash/sha256/rust_sha2/work/try-anything.c:344: undefined reference to `cpucycles_amd64rdpmc'
try.c: /usr/bin/ld: .../supercop-data/jasper/amd64/try/c/gcc_-march=native_-mtune=native_-O2_-fwrapv_-fPIC_-fPIE_-gdwarf-4_-Wall/constbranchindex/crypto_hash/sha256/rust_sha2/work/try-anything.c:346: undefined reference to `cpucycles_amd64rdpmc'
try.c: /usr/bin/ld: .../supercop-data/jasper/amd64/try/c/gcc_-march=native_-mtune=native_-O2_-fwrapv_-fPIC_-fPIE_-gdwarf-4_-Wall/constbranchindex/crypto_hash/sha256/rust_sha2/work/try-anything.c:353: undefined reference to `cpucycles_amd64rdpmc'
try.c: /usr/bin/ld: .../supercop-data/jasper/amd64/try/c/gcc_-march=native_-mtune=native_-O2_-fwrapv_-fPIC_-fPIE_-gdwarf-4_-Wall/constbranchindex/crypto_hash/sha256/rust_sha2/work/try-anything.c:356: undefined reference to `cpucycles_amd64rdpmc'
try.c: collect2: error: ld returned 1 exit status
try.c:
try.c:
try.c: error: aborting due to previous error
try.c:
try.c: error: could not compile `crypto_hash_sha256`.
try.c:
try.c: To learn more, run the command again with --verbose.
Number of similar (implementation,compiler) pairs: 1, namely:
Implementation | Compiler |
rust_sha2 | gcc -march=native -mtune=native -O2 -fwrapv -fPIC -fPIE -gdwarf-4 -Wall (10.2.1_20210110) |
Compiler output
try.c: error: linking with `cc` failed: exit code: 1
try.c: |
try.c: = note: "cc" "-Wl,--as-needed" "-Wl,-z,noexecstack" "-m64" "-Wl,--eh-frame-hdr" "-L" "/usr/lib/rustlib/x86_64-unknown-linux-gnu/lib" ".../supercop-data/jasper/amd64/try/c/gcc_-march=native_-mtune=native_-O3_-fwrapv_-fPIC_-fPIE_-gdwarf-4_-Wall/constbranchindex/crypto_hash/sha256/rust_sha2/work/target/release/deps/try-444f87ff176ff1a2.try.eh7uyr3c-cgu.0.rcgu.o" ".../supercop-data/jasper/amd64/try/c/gcc_-march=native_-mtune=native_-O3_-fwrapv_-fPIC_-fPIE_-gdwarf-4_-Wall/constbranchindex/crypto_hash/sha256/rust_sha2/work/target/release/deps/try-444f87ff176ff1a2.try.eh7uyr3c-cgu.1.rcgu.o" ".../supercop-data/jasper/amd64/try/c/gcc_-march=native_-mtune=native_-O3_-fwrapv_-fPIC_-fPIE_-gdwarf-4_-Wall/constbranchindex/crypto_hash/sha256/rust_sha2/work/target/release/deps/try-444f87ff176ff1a2.try.eh7uyr3c-cgu.2.rcgu.o" ".../supercop-data/jasper/amd64/try/c/gcc_-march=native_-mtune=native_-O3_-fwrapv_-fPIC_-fPIE_-gdwarf-4_-Wall/constbranchindex/crypto_hash/sha256/rust_sha2/work/target/release/deps/try-444f87ff176ff1a2.try.eh7uyr3c-cgu.3.rcgu.o" ".../supercop-data/jasper/amd64/try/c/gcc_-march=native_-mtune=native_-O3_-fwrapv_-fPIC_-fPIE_-gdwarf-4_-Wall/constbranchindex/crypto_hash/sha256/rust_sha2/work/target/release/deps/try-444f87ff176ff1a2.try.eh7uyr3c-cgu.4.rcgu.o" "-o" ".../supercop-data/jasper/amd64/try/c/gcc_-march=native_-mtune=native_-O3_-fwrapv_-fPIC_-fPIE_-gdwarf-4_-Wall/constbranchindex/crypto_hash/sha256/rust_sha2/work/target/release/deps/try-444f87ff176ff1a2" ".../supercop-data/jasper/amd64/try/c/gcc_-march=native_-mtune=native_-O3_-fwrapv_-fPIC_-fPIE_-gdwarf-4_-Wall/constbranchindex/crypto_hash/sha256/rust_sha2/work/target/release/deps/try-444f87ff176ff1a2.4qvuycn7jdjdfii3.rcgu.o" "-Wl,--gc-sections" "-pie" "-Wl,-zrelro" "-Wl,-znow" "-Wl,-O1" "-nodefaultlibs" "-L" ".../supercop-data/jasper/amd64/try/c/gcc_-march=native_-mtune=native_-O3_-fwrapv_-fPIC_-fPIE_-gdwarf-4_-Wall/constbranchindex/crypto_hash/sha256/rust_sha2/work/target/release/deps" "-L" ".../supercop-data/jasper/amd64/lib" "-L" ".../supercop-data/jasper/amd64/try/c/gcc_-march=native_-mtune=native_-O3_-fwrapv_-fPIC_-fPIE_-gdwarf-4_-Wall/constbranchindex/crypto_hash/sha256/rust_sha2/work/target/release/build/crypto_hash_sha256-5cd230be06f90398/out" "-L" "/usr/lib/rustlib/x86_64-unknown-linux-gnu/lib" "-ltry-anything" "-ltry" "-lsupercop" "-lkernelrandombytes" "-lcpucycles" "-lcrypto" "-lnsl" "-lm" "-Wl,-Bstatic" ".../supercop-data/jasper/amd64/try/c/gcc_-march=native_-mtune=native_-O3_-fwrapv_-fPIC_-fPIE_-gdwarf-4_-Wall/constbranchindex/crypto_hash/sha256/rust_sha2/work/target/release/deps/libcrypto_hash_sha256-59a535abfecfde21.rlib" ".../supercop-data/jasper/amd64/try/c/gcc_-march=native_-mtune=native_-O3_-fwrapv_-fPIC_-fPIE_-gdwarf-4_-Wall/constbranchindex/crypto_hash/sha256/rust_sha2/work/target/release/deps/libsha2-fee2faec0cc98b9d.rlib" ".../supercop-data/jasper/amd64/try/c/gcc_-march=native_-mtune=native_-O3_-fwrapv_-fPIC_-fPIE_-gdwarf-4_-Wall/constbranchindex/crypto_hash/sha256/rust_sha2/work/target/release/deps/libcpuid_bool-a511188b3e8fb9e7.rlib" ".../supercop-data/jasper/amd64/try/c/gcc_-march=native_-mtune=native_-O3_-fwrapv_-fPIC_-fPIE_-gdwarf-4_-Wall/constbranchindex/crypto_hash/sha256/rust_sha2/work/target/release/deps/libcfg_if-11669ae4b1851f60.rlib" ".../supercop-data/jasper/amd64/try/c/gcc_-march=native_-mtune=native_-O3_-fwrapv_-fPIC_-fPIE_-gdwarf-4_-Wall/constbranchindex/crypto_hash/sha256/rust_sha2/work/target/release/deps/libopaque_debug-ff52af415c56e1a8.rlib" ".../supercop-data/jasper/amd64/try/c/gcc_-march=native_-mtune=native_-O3_-fwrapv_-fPIC_-fPIE_-gdwarf-4_-Wall/constbranchindex/crypto_hash/sha256/rust_sha2/work/target/release/deps/libdigest-137540d47480a0cd.rlib" ".../supercop-data/jasper/amd64/try/c/gcc_-march=native_-mtune=native_-O3_-fwrapv_-fPIC_-fPIE_-gdwarf-4_-Wall/constbranchindex/crypto_hash/sha256/rust_sha2/work/target/release/deps/libblock_buffer-d8051f65e68b5aa7.rlib" ".../supercop-data/jasper/amd64/try/c/gcc_-march=native_-mtune=native_-O3_-fwrapv_-fPIC_-fPIE_-gdwarf-4_-Wall/constbranchindex/crypto_hash/sha256/rust_sha2/work/target/release/deps/libgeneric_array-6bd8cd5d26e69f54.rlib" ".../supercop-data/jasper/amd64/try/c/gcc_-march=native_-mtune=native_-O3_-fwrapv_-fPIC_-fPIE_-gdwarf-4_-Wall/constbranchindex/crypto_hash/sha256/rust_sha2/work/target/release/deps/libtypenum-ac0d7f64b1a84d19.rlib" "-Wl,--start-group" "/usr/lib/rustlib/x86_64-unknown-linux-gnu/lib/libstd-6bf3f16f340782ca.rlib" "/usr/lib/rustlib/x86_64-unknown-linux-gnu/lib/libpanic_unwind-13f3099d50c21bc6.rlib" "/usr/lib/rustlib/x86_64-unknown-linux-gnu/lib/libminiz_oxide-a2ba33c985785afe.rlib" "/usr/lib/rustlib/x86_64-unknown-linux-gnu/lib/libadler-3f6e9f8f4afbea6d.rlib" "/usr/lib/rustlib/x86_64-unknown-linux-gnu/lib/libobject-af517d7f13e7c960.rlib" "/usr/lib/rustlib/x86_64-unknown-linux-gnu/lib/libaddr2line-12740563628e601f.rlib" "/usr/lib/rustlib/x86_64-unknown-linux-gnu/lib/libgimli-0ac82a1e1820dd21.rlib" "/usr/lib/rustlib/x86_64-unknown-linux-gnu/lib/librustc_demangle-3ac2d0878c297d42.rlib" "/usr/lib/rustlib/x86_64-unknown-linux-gnu/lib/libhashbrown-c6632ca171f954dd.rlib" "/usr/lib/rustlib/x86_64-unknown-linux-gnu/lib/librustc_std_workspace_alloc-b5bfd0198c7b740d.rlib" "/usr/lib/rustlib/x86_64-unknown-linux-gnu/lib/libunwind-bd645b20c6c7b56d.rlib" "/usr/lib/rustlib/x86_64-unknown-linux-gnu/lib/libcfg_if-b9e1e523c0c29a77.rlib" "/usr/lib/rustlib/x86_64-unknown-linux-gnu/lib/liblibc-dfbef8c525de0186.rlib" "/usr/lib/rustlib/x86_64-unknown-linux-gnu/lib/liballoc-1ebf406bd4ea5769.rlib" "/usr/lib/rustlib/x86_64-unknown-linux-gnu/lib/librustc_std_workspace_core-5e0675f526ef5c6b.rlib" "/usr/lib/rustlib/x86_64-unknown-linux-gnu/lib/libcore-3375e4f89d420e7a.rlib" "-Wl,--end-group" "/usr/lib/rustlib/x86_64-unknown-linux-gnu/lib/libcompiler_builtins-f74b197469e67088.rlib" "-Wl,-Bdynamic" "-lgcc_s" "-lc" "-lm" "-lrt" "-lpthread" "-lutil" "-ldl" "-lutil"
try.c: = note: /usr/bin/ld: .../supercop-data/jasper/amd64/try/c/gcc_-march=native_-mtune=native_-O3_-fwrapv_-fPIC_-fPIE_-gdwarf-4_-Wall/constbranchindex/crypto_hash/sha256/rust_sha2/work/target/release/build/crypto_hash_sha256-5cd230be06f90398/out/libtry-anything.a(try-anything.o): in function `c_main':
try.c: .../supercop-data/jasper/amd64/try/c/gcc_-march=native_-mtune=native_-O3_-fwrapv_-fPIC_-fPIE_-gdwarf-4_-Wall/constbranchindex/crypto_hash/sha256/rust_sha2/work/try-anything.c:331: undefined reference to `cpucycles_amd64rdpmc'
try.c: /usr/bin/ld: .../supercop-data/jasper/amd64/try/c/gcc_-march=native_-mtune=native_-O3_-fwrapv_-fPIC_-fPIE_-gdwarf-4_-Wall/constbranchindex/crypto_hash/sha256/rust_sha2/work/try-anything.c:332: undefined reference to `cpucycles_amd64rdpmc'
try.c: /usr/bin/ld: .../supercop-data/jasper/amd64/try/c/gcc_-march=native_-mtune=native_-O3_-fwrapv_-fPIC_-fPIE_-gdwarf-4_-Wall/constbranchindex/crypto_hash/sha256/rust_sha2/work/try-anything.c:333: undefined reference to `cpucycles_amd64rdpmc_persecond'
try.c: /usr/bin/ld: .../supercop-data/jasper/amd64/try/c/gcc_-march=native_-mtune=native_-O3_-fwrapv_-fPIC_-fPIE_-gdwarf-4_-Wall/constbranchindex/crypto_hash/sha256/rust_sha2/work/try-anything.c:344: undefined reference to `cpucycles_amd64rdpmc'
try.c: /usr/bin/ld: .../supercop-data/jasper/amd64/try/c/gcc_-march=native_-mtune=native_-O3_-fwrapv_-fPIC_-fPIE_-gdwarf-4_-Wall/constbranchindex/crypto_hash/sha256/rust_sha2/work/try-anything.c:346: undefined reference to `cpucycles_amd64rdpmc'
try.c: /usr/bin/ld: .../supercop-data/jasper/amd64/try/c/gcc_-march=native_-mtune=native_-O3_-fwrapv_-fPIC_-fPIE_-gdwarf-4_-Wall/constbranchindex/crypto_hash/sha256/rust_sha2/work/try-anything.c:353: undefined reference to `cpucycles_amd64rdpmc'
try.c: /usr/bin/ld: .../supercop-data/jasper/amd64/try/c/gcc_-march=native_-mtune=native_-O3_-fwrapv_-fPIC_-fPIE_-gdwarf-4_-Wall/constbranchindex/crypto_hash/sha256/rust_sha2/work/try-anything.c:356: undefined reference to `cpucycles_amd64rdpmc'
try.c: collect2: error: ld returned 1 exit status
try.c:
try.c:
try.c: error: aborting due to previous error
try.c:
try.c: error: could not compile `crypto_hash_sha256`.
try.c:
try.c: To learn more, run the command again with --verbose.
Number of similar (implementation,compiler) pairs: 1, namely:
Implementation | Compiler |
rust_sha2 | gcc -march=native -mtune=native -O3 -fwrapv -fPIC -fPIE -gdwarf-4 -Wall (10.2.1_20210110) |
Compiler output
try.c: error: linking with `cc` failed: exit code: 1
try.c: |
try.c: = note: "cc" "-Wl,--as-needed" "-Wl,-z,noexecstack" "-m64" "-Wl,--eh-frame-hdr" "-L" "/usr/lib/rustlib/x86_64-unknown-linux-gnu/lib" ".../supercop-data/jasper/amd64/try/c/gcc_-march=native_-mtune=native_-O_-fwrapv_-fPIC_-fPIE_-gdwarf-4_-Wall/constbranchindex/crypto_hash/sha256/rust_sha2/work/target/release/deps/try-444f87ff176ff1a2.try.eh7uyr3c-cgu.0.rcgu.o" ".../supercop-data/jasper/amd64/try/c/gcc_-march=native_-mtune=native_-O_-fwrapv_-fPIC_-fPIE_-gdwarf-4_-Wall/constbranchindex/crypto_hash/sha256/rust_sha2/work/target/release/deps/try-444f87ff176ff1a2.try.eh7uyr3c-cgu.1.rcgu.o" ".../supercop-data/jasper/amd64/try/c/gcc_-march=native_-mtune=native_-O_-fwrapv_-fPIC_-fPIE_-gdwarf-4_-Wall/constbranchindex/crypto_hash/sha256/rust_sha2/work/target/release/deps/try-444f87ff176ff1a2.try.eh7uyr3c-cgu.2.rcgu.o" ".../supercop-data/jasper/amd64/try/c/gcc_-march=native_-mtune=native_-O_-fwrapv_-fPIC_-fPIE_-gdwarf-4_-Wall/constbranchindex/crypto_hash/sha256/rust_sha2/work/target/release/deps/try-444f87ff176ff1a2.try.eh7uyr3c-cgu.3.rcgu.o" ".../supercop-data/jasper/amd64/try/c/gcc_-march=native_-mtune=native_-O_-fwrapv_-fPIC_-fPIE_-gdwarf-4_-Wall/constbranchindex/crypto_hash/sha256/rust_sha2/work/target/release/deps/try-444f87ff176ff1a2.try.eh7uyr3c-cgu.4.rcgu.o" "-o" ".../supercop-data/jasper/amd64/try/c/gcc_-march=native_-mtune=native_-O_-fwrapv_-fPIC_-fPIE_-gdwarf-4_-Wall/constbranchindex/crypto_hash/sha256/rust_sha2/work/target/release/deps/try-444f87ff176ff1a2" ".../supercop-data/jasper/amd64/try/c/gcc_-march=native_-mtune=native_-O_-fwrapv_-fPIC_-fPIE_-gdwarf-4_-Wall/constbranchindex/crypto_hash/sha256/rust_sha2/work/target/release/deps/try-444f87ff176ff1a2.4qvuycn7jdjdfii3.rcgu.o" "-Wl,--gc-sections" "-pie" "-Wl,-zrelro" "-Wl,-znow" "-Wl,-O1" "-nodefaultlibs" "-L" ".../supercop-data/jasper/amd64/try/c/gcc_-march=native_-mtune=native_-O_-fwrapv_-fPIC_-fPIE_-gdwarf-4_-Wall/constbranchindex/crypto_hash/sha256/rust_sha2/work/target/release/deps" "-L" ".../supercop-data/jasper/amd64/lib" "-L" ".../supercop-data/jasper/amd64/try/c/gcc_-march=native_-mtune=native_-O_-fwrapv_-fPIC_-fPIE_-gdwarf-4_-Wall/constbranchindex/crypto_hash/sha256/rust_sha2/work/target/release/build/crypto_hash_sha256-5cd230be06f90398/out" "-L" "/usr/lib/rustlib/x86_64-unknown-linux-gnu/lib" "-ltry-anything" "-ltry" "-lsupercop" "-lkernelrandombytes" "-lcpucycles" "-lcrypto" "-lnsl" "-lm" "-Wl,-Bstatic" ".../supercop-data/jasper/amd64/try/c/gcc_-march=native_-mtune=native_-O_-fwrapv_-fPIC_-fPIE_-gdwarf-4_-Wall/constbranchindex/crypto_hash/sha256/rust_sha2/work/target/release/deps/libcrypto_hash_sha256-59a535abfecfde21.rlib" ".../supercop-data/jasper/amd64/try/c/gcc_-march=native_-mtune=native_-O_-fwrapv_-fPIC_-fPIE_-gdwarf-4_-Wall/constbranchindex/crypto_hash/sha256/rust_sha2/work/target/release/deps/libsha2-fee2faec0cc98b9d.rlib" ".../supercop-data/jasper/amd64/try/c/gcc_-march=native_-mtune=native_-O_-fwrapv_-fPIC_-fPIE_-gdwarf-4_-Wall/constbranchindex/crypto_hash/sha256/rust_sha2/work/target/release/deps/libcpuid_bool-a511188b3e8fb9e7.rlib" ".../supercop-data/jasper/amd64/try/c/gcc_-march=native_-mtune=native_-O_-fwrapv_-fPIC_-fPIE_-gdwarf-4_-Wall/constbranchindex/crypto_hash/sha256/rust_sha2/work/target/release/deps/libcfg_if-11669ae4b1851f60.rlib" ".../supercop-data/jasper/amd64/try/c/gcc_-march=native_-mtune=native_-O_-fwrapv_-fPIC_-fPIE_-gdwarf-4_-Wall/constbranchindex/crypto_hash/sha256/rust_sha2/work/target/release/deps/libopaque_debug-ff52af415c56e1a8.rlib" ".../supercop-data/jasper/amd64/try/c/gcc_-march=native_-mtune=native_-O_-fwrapv_-fPIC_-fPIE_-gdwarf-4_-Wall/constbranchindex/crypto_hash/sha256/rust_sha2/work/target/release/deps/libdigest-137540d47480a0cd.rlib" ".../supercop-data/jasper/amd64/try/c/gcc_-march=native_-mtune=native_-O_-fwrapv_-fPIC_-fPIE_-gdwarf-4_-Wall/constbranchindex/crypto_hash/sha256/rust_sha2/work/target/release/deps/libblock_buffer-d8051f65e68b5aa7.rlib" ".../supercop-data/jasper/amd64/try/c/gcc_-march=native_-mtune=native_-O_-fwrapv_-fPIC_-fPIE_-gdwarf-4_-Wall/constbranchindex/crypto_hash/sha256/rust_sha2/work/target/release/deps/libgeneric_array-6bd8cd5d26e69f54.rlib" ".../supercop-data/jasper/amd64/try/c/gcc_-march=native_-mtune=native_-O_-fwrapv_-fPIC_-fPIE_-gdwarf-4_-Wall/constbranchindex/crypto_hash/sha256/rust_sha2/work/target/release/deps/libtypenum-ac0d7f64b1a84d19.rlib" "-Wl,--start-group" "/usr/lib/rustlib/x86_64-unknown-linux-gnu/lib/libstd-6bf3f16f340782ca.rlib" "/usr/lib/rustlib/x86_64-unknown-linux-gnu/lib/libpanic_unwind-13f3099d50c21bc6.rlib" "/usr/lib/rustlib/x86_64-unknown-linux-gnu/lib/libminiz_oxide-a2ba33c985785afe.rlib" "/usr/lib/rustlib/x86_64-unknown-linux-gnu/lib/libadler-3f6e9f8f4afbea6d.rlib" "/usr/lib/rustlib/x86_64-unknown-linux-gnu/lib/libobject-af517d7f13e7c960.rlib" "/usr/lib/rustlib/x86_64-unknown-linux-gnu/lib/libaddr2line-12740563628e601f.rlib" "/usr/lib/rustlib/x86_64-unknown-linux-gnu/lib/libgimli-0ac82a1e1820dd21.rlib" "/usr/lib/rustlib/x86_64-unknown-linux-gnu/lib/librustc_demangle-3ac2d0878c297d42.rlib" "/usr/lib/rustlib/x86_64-unknown-linux-gnu/lib/libhashbrown-c6632ca171f954dd.rlib" "/usr/lib/rustlib/x86_64-unknown-linux-gnu/lib/librustc_std_workspace_alloc-b5bfd0198c7b740d.rlib" "/usr/lib/rustlib/x86_64-unknown-linux-gnu/lib/libunwind-bd645b20c6c7b56d.rlib" "/usr/lib/rustlib/x86_64-unknown-linux-gnu/lib/libcfg_if-b9e1e523c0c29a77.rlib" "/usr/lib/rustlib/x86_64-unknown-linux-gnu/lib/liblibc-dfbef8c525de0186.rlib" "/usr/lib/rustlib/x86_64-unknown-linux-gnu/lib/liballoc-1ebf406bd4ea5769.rlib" "/usr/lib/rustlib/x86_64-unknown-linux-gnu/lib/librustc_std_workspace_core-5e0675f526ef5c6b.rlib" "/usr/lib/rustlib/x86_64-unknown-linux-gnu/lib/libcore-3375e4f89d420e7a.rlib" "-Wl,--end-group" "/usr/lib/rustlib/x86_64-unknown-linux-gnu/lib/libcompiler_builtins-f74b197469e67088.rlib" "-Wl,-Bdynamic" "-lgcc_s" "-lc" "-lm" "-lrt" "-lpthread" "-lutil" "-ldl" "-lutil"
try.c: = note: /usr/bin/ld: .../supercop-data/jasper/amd64/try/c/gcc_-march=native_-mtune=native_-O_-fwrapv_-fPIC_-fPIE_-gdwarf-4_-Wall/constbranchindex/crypto_hash/sha256/rust_sha2/work/target/release/build/crypto_hash_sha256-5cd230be06f90398/out/libtry-anything.a(try-anything.o): in function `c_main':
try.c: .../supercop-data/jasper/amd64/try/c/gcc_-march=native_-mtune=native_-O_-fwrapv_-fPIC_-fPIE_-gdwarf-4_-Wall/constbranchindex/crypto_hash/sha256/rust_sha2/work/try-anything.c:331: undefined reference to `cpucycles_amd64rdpmc'
try.c: /usr/bin/ld: .../supercop-data/jasper/amd64/try/c/gcc_-march=native_-mtune=native_-O_-fwrapv_-fPIC_-fPIE_-gdwarf-4_-Wall/constbranchindex/crypto_hash/sha256/rust_sha2/work/try-anything.c:332: undefined reference to `cpucycles_amd64rdpmc'
try.c: /usr/bin/ld: .../supercop-data/jasper/amd64/try/c/gcc_-march=native_-mtune=native_-O_-fwrapv_-fPIC_-fPIE_-gdwarf-4_-Wall/constbranchindex/crypto_hash/sha256/rust_sha2/work/try-anything.c:333: undefined reference to `cpucycles_amd64rdpmc_persecond'
try.c: /usr/bin/ld: .../supercop-data/jasper/amd64/try/c/gcc_-march=native_-mtune=native_-O_-fwrapv_-fPIC_-fPIE_-gdwarf-4_-Wall/constbranchindex/crypto_hash/sha256/rust_sha2/work/try-anything.c:344: undefined reference to `cpucycles_amd64rdpmc'
try.c: /usr/bin/ld: .../supercop-data/jasper/amd64/try/c/gcc_-march=native_-mtune=native_-O_-fwrapv_-fPIC_-fPIE_-gdwarf-4_-Wall/constbranchindex/crypto_hash/sha256/rust_sha2/work/try-anything.c:346: undefined reference to `cpucycles_amd64rdpmc'
try.c: /usr/bin/ld: .../supercop-data/jasper/amd64/try/c/gcc_-march=native_-mtune=native_-O_-fwrapv_-fPIC_-fPIE_-gdwarf-4_-Wall/constbranchindex/crypto_hash/sha256/rust_sha2/work/try-anything.c:353: undefined reference to `cpucycles_amd64rdpmc'
try.c: /usr/bin/ld: .../supercop-data/jasper/amd64/try/c/gcc_-march=native_-mtune=native_-O_-fwrapv_-fPIC_-fPIE_-gdwarf-4_-Wall/constbranchindex/crypto_hash/sha256/rust_sha2/work/try-anything.c:356: undefined reference to `cpucycles_amd64rdpmc'
try.c: collect2: error: ld returned 1 exit status
try.c:
try.c:
try.c: error: aborting due to previous error
try.c:
try.c: error: could not compile `crypto_hash_sha256`.
try.c:
try.c: To learn more, run the command again with --verbose.
Number of similar (implementation,compiler) pairs: 1, namely:
Implementation | Compiler |
rust_sha2 | gcc -march=native -mtune=native -O -fwrapv -fPIC -fPIE -gdwarf-4 -Wall (10.2.1_20210110) |
Compiler output
try.c: error: linking with `cc` failed: exit code: 1
try.c: |
try.c: = note: "cc" "-Wl,--as-needed" "-Wl,-z,noexecstack" "-m64" "-Wl,--eh-frame-hdr" "-L" "/usr/lib/rustlib/x86_64-unknown-linux-gnu/lib" ".../supercop-data/jasper/amd64/try/c/gcc_-march=native_-mtune=native_-Os_-fwrapv_-fPIC_-fPIE_-gdwarf-4_-Wall/constbranchindex/crypto_hash/sha256/rust_sha2/work/target/release/deps/measure-f0421c4c732fed84.measure.5fw24wl4-cgu.0.rcgu.o" ".../supercop-data/jasper/amd64/try/c/gcc_-march=native_-mtune=native_-Os_-fwrapv_-fPIC_-fPIE_-gdwarf-4_-Wall/constbranchindex/crypto_hash/sha256/rust_sha2/work/target/release/deps/measure-f0421c4c732fed84.measure.5fw24wl4-cgu.1.rcgu.o" ".../supercop-data/jasper/amd64/try/c/gcc_-march=native_-mtune=native_-Os_-fwrapv_-fPIC_-fPIE_-gdwarf-4_-Wall/constbranchindex/crypto_hash/sha256/rust_sha2/work/target/release/deps/measure-f0421c4c732fed84.measure.5fw24wl4-cgu.2.rcgu.o" ".../supercop-data/jasper/amd64/try/c/gcc_-march=native_-mtune=native_-Os_-fwrapv_-fPIC_-fPIE_-gdwarf-4_-Wall/constbranchindex/crypto_hash/sha256/rust_sha2/work/target/release/deps/measure-f0421c4c732fed84.measure.5fw24wl4-cgu.3.rcgu.o" ".../supercop-data/jasper/amd64/try/c/gcc_-march=native_-mtune=native_-Os_-fwrapv_-fPIC_-fPIE_-gdwarf-4_-Wall/constbranchindex/crypto_hash/sha256/rust_sha2/work/target/release/deps/measure-f0421c4c732fed84.measure.5fw24wl4-cgu.4.rcgu.o" "-o" ".../supercop-data/jasper/amd64/try/c/gcc_-march=native_-mtune=native_-Os_-fwrapv_-fPIC_-fPIE_-gdwarf-4_-Wall/constbranchindex/crypto_hash/sha256/rust_sha2/work/target/release/deps/measure-f0421c4c732fed84" ".../supercop-data/jasper/amd64/try/c/gcc_-march=native_-mtune=native_-Os_-fwrapv_-fPIC_-fPIE_-gdwarf-4_-Wall/constbranchindex/crypto_hash/sha256/rust_sha2/work/target/release/deps/measure-f0421c4c732fed84.v9rqvgvkjlrpomk.rcgu.o" "-Wl,--gc-sections" "-pie" "-Wl,-zrelro" "-Wl,-znow" "-Wl,-O1" "-nodefaultlibs" "-L" ".../supercop-data/jasper/amd64/try/c/gcc_-march=native_-mtune=native_-Os_-fwrapv_-fPIC_-fPIE_-gdwarf-4_-Wall/constbranchindex/crypto_hash/sha256/rust_sha2/work/target/release/deps" "-L" ".../supercop-data/jasper/amd64/lib" "-L" ".../supercop-data/jasper/amd64/try/c/gcc_-march=native_-mtune=native_-Os_-fwrapv_-fPIC_-fPIE_-gdwarf-4_-Wall/constbranchindex/crypto_hash/sha256/rust_sha2/work/target/release/build/crypto_hash_sha256-5cd230be06f90398/out" "-L" "/usr/lib/rustlib/x86_64-unknown-linux-gnu/lib" "-lmeasure-anything" "-lmeasure" "-lsupercop" "-lkernelrandombytes" "-lcpucycles" "-lcrypto" "-lnsl" "-lm" "-Wl,-Bstatic" ".../supercop-data/jasper/amd64/try/c/gcc_-march=native_-mtune=native_-Os_-fwrapv_-fPIC_-fPIE_-gdwarf-4_-Wall/constbranchindex/crypto_hash/sha256/rust_sha2/work/target/release/deps/libcrypto_hash_sha256-59a535abfecfde21.rlib" ".../supercop-data/jasper/amd64/try/c/gcc_-march=native_-mtune=native_-Os_-fwrapv_-fPIC_-fPIE_-gdwarf-4_-Wall/constbranchindex/crypto_hash/sha256/rust_sha2/work/target/release/deps/libsha2-fee2faec0cc98b9d.rlib" ".../supercop-data/jasper/amd64/try/c/gcc_-march=native_-mtune=native_-Os_-fwrapv_-fPIC_-fPIE_-gdwarf-4_-Wall/constbranchindex/crypto_hash/sha256/rust_sha2/work/target/release/deps/libcpuid_bool-a511188b3e8fb9e7.rlib" ".../supercop-data/jasper/amd64/try/c/gcc_-march=native_-mtune=native_-Os_-fwrapv_-fPIC_-fPIE_-gdwarf-4_-Wall/constbranchindex/crypto_hash/sha256/rust_sha2/work/target/release/deps/libcfg_if-11669ae4b1851f60.rlib" ".../supercop-data/jasper/amd64/try/c/gcc_-march=native_-mtune=native_-Os_-fwrapv_-fPIC_-fPIE_-gdwarf-4_-Wall/constbranchindex/crypto_hash/sha256/rust_sha2/work/target/release/deps/libopaque_debug-ff52af415c56e1a8.rlib" ".../supercop-data/jasper/amd64/try/c/gcc_-march=native_-mtune=native_-Os_-fwrapv_-fPIC_-fPIE_-gdwarf-4_-Wall/constbranchindex/crypto_hash/sha256/rust_sha2/work/target/release/deps/libdigest-137540d47480a0cd.rlib" ".../supercop-data/jasper/amd64/try/c/gcc_-march=native_-mtune=native_-Os_-fwrapv_-fPIC_-fPIE_-gdwarf-4_-Wall/constbranchindex/crypto_hash/sha256/rust_sha2/work/target/release/deps/libblock_buffer-d8051f65e68b5aa7.rlib" ".../supercop-data/jasper/amd64/try/c/gcc_-march=native_-mtune=native_-Os_-fwrapv_-fPIC_-fPIE_-gdwarf-4_-Wall/constbranchindex/crypto_hash/sha256/rust_sha2/work/target/release/deps/libgeneric_array-6bd8cd5d26e69f54.rlib" ".../supercop-data/jasper/amd64/try/c/gcc_-march=native_-mtune=native_-Os_-fwrapv_-fPIC_-fPIE_-gdwarf-4_-Wall/constbranchindex/crypto_hash/sha256/rust_sha2/work/target/release/deps/libtypenum-ac0d7f64b1a84d19.rlib" "-Wl,--start-group" "/usr/lib/rustlib/x86_64-unknown-linux-gnu/lib/libstd-6bf3f16f340782ca.rlib" "/usr/lib/rustlib/x86_64-unknown-linux-gnu/lib/libpanic_unwind-13f3099d50c21bc6.rlib" "/usr/lib/rustlib/x86_64-unknown-linux-gnu/lib/libminiz_oxide-a2ba33c985785afe.rlib" "/usr/lib/rustlib/x86_64-unknown-linux-gnu/lib/libadler-3f6e9f8f4afbea6d.rlib" "/usr/lib/rustlib/x86_64-unknown-linux-gnu/lib/libobject-af517d7f13e7c960.rlib" "/usr/lib/rustlib/x86_64-unknown-linux-gnu/lib/libaddr2line-12740563628e601f.rlib" "/usr/lib/rustlib/x86_64-unknown-linux-gnu/lib/libgimli-0ac82a1e1820dd21.rlib" "/usr/lib/rustlib/x86_64-unknown-linux-gnu/lib/librustc_demangle-3ac2d0878c297d42.rlib" "/usr/lib/rustlib/x86_64-unknown-linux-gnu/lib/libhashbrown-c6632ca171f954dd.rlib" "/usr/lib/rustlib/x86_64-unknown-linux-gnu/lib/librustc_std_workspace_alloc-b5bfd0198c7b740d.rlib" "/usr/lib/rustlib/x86_64-unknown-linux-gnu/lib/libunwind-bd645b20c6c7b56d.rlib" "/usr/lib/rustlib/x86_64-unknown-linux-gnu/lib/libcfg_if-b9e1e523c0c29a77.rlib" "/usr/lib/rustlib/x86_64-unknown-linux-gnu/lib/liblibc-dfbef8c525de0186.rlib" "/usr/lib/rustlib/x86_64-unknown-linux-gnu/lib/liballoc-1ebf406bd4ea5769.rlib" "/usr/lib/rustlib/x86_64-unknown-linux-gnu/lib/librustc_std_workspace_core-5e0675f526ef5c6b.rlib" "/usr/lib/rustlib/x86_64-unknown-linux-gnu/lib/libcore-3375e4f89d420e7a.rlib" "-Wl,--end-group" "/usr/lib/rustlib/x86_64-unknown-linux-gnu/lib/libcompiler_builtins-f74b197469e67088.rlib" "-Wl,-Bdynamic" "-lgcc_s" "-lc" "-lm" "-lrt" "-lpthread" "-lutil" "-ldl" "-lutil"
try.c: = note: /usr/bin/ld: .../supercop-data/jasper/amd64/try/c/gcc_-march=native_-mtune=native_-Os_-fwrapv_-fPIC_-fPIE_-gdwarf-4_-Wall/constbranchindex/crypto_hash/sha256/rust_sha2/work/target/release/build/crypto_hash_sha256-5cd230be06f90398/out/libmeasure-anything.a(measure-anything.o): in function `c_main':
try.c: .../supercop-data/jasper/amd64/try/c/gcc_-march=native_-mtune=native_-Os_-fwrapv_-fPIC_-fPIE_-gdwarf-4_-Wall/constbranchindex/crypto_hash/sha256/rust_sha2/work/measure-anything.c:178: undefined reference to `cpucycles_amd64rdpmc'
try.c: /usr/bin/ld: .../supercop-data/jasper/amd64/try/c/gcc_-march=native_-mtune=native_-Os_-fwrapv_-fPIC_-fPIE_-gdwarf-4_-Wall/constbranchindex/crypto_hash/sha256/rust_sha2/work/measure-anything.c:179: undefined reference to `cpucycles_amd64rdpmc'
try.c: /usr/bin/ld: .../supercop-data/jasper/amd64/try/c/gcc_-march=native_-mtune=native_-Os_-fwrapv_-fPIC_-fPIE_-gdwarf-4_-Wall/constbranchindex/crypto_hash/sha256/rust_sha2/work/measure-anything.c:180: undefined reference to `cpucycles_amd64rdpmc_persecond'
try.c: /usr/bin/ld: .../supercop-data/jasper/amd64/try/c/gcc_-march=native_-mtune=native_-Os_-fwrapv_-fPIC_-fPIE_-gdwarf-4_-Wall/constbranchindex/crypto_hash/sha256/rust_sha2/work/target/release/build/crypto_hash_sha256-5cd230be06f90398/out/libmeasure.a(measure.o): in function `measure':
try.c: .../supercop-data/jasper/amd64/try/c/gcc_-march=native_-mtune=native_-Os_-fwrapv_-fPIC_-fPIE_-gdwarf-4_-Wall/constbranchindex/crypto_hash/sha256/rust_sha2/work/measure.c:56: undefined reference to `cpucycles_amd64rdpmc'
try.c: collect2: error: ld returned 1 exit status
try.c:
try.c:
try.c: error: aborting due to previous error
try.c:
try.c: error: could not compile `crypto_hash_sha256`.
try.c:
try.c: To learn more, run the command again with --verbose.
Number of similar (implementation,compiler) pairs: 1, namely:
Implementation | Compiler |
rust_sha2 | gcc -march=native -mtune=native -Os -fwrapv -fPIC -fPIE -gdwarf-4 -Wall (10.2.1_20210110) |
TIMECOP error (can be valgrind bug)
error 111
Process terminating with default action of signal 4 (SIGILL)
Illegal opcode at address 0x4029BD
at 0x...: _mm_sha256rnds2_epu32 (shaintrin.h:89)
by 0x...: crypto_hashblocks_sha256_dolbeau_amd64_sha_constbranchindex (blocks.c:176)
by 0x...: crypto_hash_sha256_ref_constbranchindex (hash.c:34)
by 0x...: test (try.c:90)
by 0x...: main (try-anything.c:345)
Number of similar (implementation,compiler) pairs: 1, namely:
Implementation | Compiler |
ref | clang -march=native -O2 -fwrapv -Qunused-arguments -fPIC -fPIE -gdwarf-4 -Wall (Debian_Clang_11.0.1) |
TIMECOP error (can be valgrind bug)
error 111
Process terminating with default action of signal 4 (SIGILL)
Illegal opcode at address 0x40295D
at 0x...: _mm_sha256rnds2_epu32 (shaintrin.h:89)
by 0x...: crypto_hashblocks_sha256_dolbeau_amd64_sha_constbranchindex (blocks.c:176)
by 0x...: crypto_hash_sha256_ref_constbranchindex (hash.c:34)
by 0x...: test (try.c:90)
by 0x...: main (try-anything.c:345)
Number of similar (implementation,compiler) pairs: 1, namely:
Implementation | Compiler |
ref | clang -march=native -O3 -fwrapv -Qunused-arguments -fPIC -fPIE -gdwarf-4 -Wall (Debian_Clang_11.0.1) |
TIMECOP error (can be valgrind bug)
error 111
Process terminating with default action of signal 4 (SIGILL)
Illegal opcode at address 0x40235D
at 0x...: _mm_sha256rnds2_epu32 (shaintrin.h:89)
by 0x...: crypto_hashblocks_sha256_dolbeau_amd64_sha_constbranchindex (blocks.c:176)
by 0x...: crypto_hash_sha256_ref_constbranchindex (hash.c:34)
by 0x...: test (try.c:90)
by 0x...: main (try-anything.c:345)
Number of similar (implementation,compiler) pairs: 1, namely:
Implementation | Compiler |
ref | clang -march=native -O -fwrapv -Qunused-arguments -fPIC -fPIE -gdwarf-4 -Wall (Debian_Clang_11.0.1) |
TIMECOP error (can be valgrind bug)
error 111
Process terminating with default action of signal 4 (SIGILL)
Illegal opcode at address 0x40228D
at 0x...: _mm_sha256rnds2_epu32 (shaintrin.h:89)
by 0x...: crypto_hashblocks_sha256_dolbeau_amd64_sha_constbranchindex (blocks.c:176)
by 0x...: crypto_hash_sha256_ref_constbranchindex (hash.c:34)
by 0x...: test (try.c:90)
by 0x...: main (try-anything.c:345)
Number of similar (implementation,compiler) pairs: 1, namely:
Implementation | Compiler |
ref | clang -march=native -Os -fwrapv -Qunused-arguments -fPIC -fPIE -gdwarf-4 -Wall (Debian_Clang_11.0.1) |
TIMECOP error (can be valgrind bug)
error 111
Process terminating with default action of signal 4 (SIGILL)
Illegal opcode at address 0x402A9D
at 0x...: _mm_sha256rnds2_epu32 (shaintrin.h:89)
by 0x...: crypto_hashblocks_sha256_dolbeau_amd64_sha_constbranchindex (blocks.c:176)
by 0x...: crypto_hash_sha256_ref_constbranchindex (hash.c:34)
by 0x...: test (try.c:90)
by 0x...: main (try-anything.c:345)
Number of similar (implementation,compiler) pairs: 1, namely:
Implementation | Compiler |
ref | clang -mcpu=native -O3 -fwrapv -Qunused-arguments -fPIC -fPIE -gdwarf-4 -Wall (Debian_Clang_11.0.1) |
TIMECOP error (can be valgrind bug)
error 111
Process terminating with default action of signal 4 (SIGILL)
Illegal opcode at address 0x10A69D
at 0x...: _mm_sha256rnds2_epu32 (shaintrin.h:89)
by 0x...: crypto_hashblocks_sha256_dolbeau_amd64_sha_constbranchindex (blocks.c:176)
by 0x...: crypto_hash_sha256_ref_constbranchindex (hash.c:34)
by 0x...: test (try.c:90)
by 0x...: main (try-anything.c:345)
Number of similar (implementation,compiler) pairs: 1, namely:
Implementation | Compiler |
ref | gcc -march=native -mtune=native -O2 -fwrapv -fPIC -fPIE -gdwarf-4 -Wall (10.2.1_20210110) |
TIMECOP error (can be valgrind bug)
error 111
Process terminating with default action of signal 4 (SIGILL)
Illegal opcode at address 0x10AA6D
at 0x...: _mm_sha256rnds2_epu32 (shaintrin.h:89)
by 0x...: crypto_hashblocks_sha256_dolbeau_amd64_sha_constbranchindex (blocks.c:176)
by 0x...: crypto_hash_sha256_ref_constbranchindex (hash.c:34)
by 0x...: test (try.c:90)
by 0x...: main (try-anything.c:345)
Number of similar (implementation,compiler) pairs: 1, namely:
Implementation | Compiler |
ref | gcc -march=native -mtune=native -O3 -fwrapv -fPIC -fPIE -gdwarf-4 -Wall (10.2.1_20210110) |
TIMECOP error (can be valgrind bug)
error 111
Process terminating with default action of signal 4 (SIGILL)
Illegal opcode at address 0x10A34D
at 0x...: _mm_sha256rnds2_epu32 (shaintrin.h:89)
by 0x...: crypto_hashblocks_sha256_dolbeau_amd64_sha_constbranchindex (blocks.c:176)
by 0x...: crypto_hash_sha256_ref_constbranchindex (hash.c:34)
by 0x...: test (try.c:90)
by 0x...: main (try-anything.c:345)
Number of similar (implementation,compiler) pairs: 1, namely:
Implementation | Compiler |
ref | gcc -march=native -mtune=native -O -fwrapv -fPIC -fPIE -gdwarf-4 -Wall (10.2.1_20210110) |
TIMECOP error (can be valgrind bug)
error 111
Process terminating with default action of signal 4 (SIGILL)
Illegal opcode at address 0x109FAD
at 0x...: _mm_sha256rnds2_epu32 (shaintrin.h:89)
by 0x...: crypto_hashblocks_sha256_dolbeau_amd64_sha_constbranchindex (blocks.c:176)
by 0x...: crypto_hash_sha256_ref_constbranchindex (hash.c:34)
by 0x...: test (try.c:90)
by 0x...: main (try-anything.c:345)
Number of similar (implementation,compiler) pairs: 1, namely:
Implementation | Compiler |
ref | gcc -march=native -mtune=native -Os -fwrapv -fPIC -fPIE -gdwarf-4 -Wall (10.2.1_20210110) |
Passed TIMECOP
TIMECOP iterations: 10
Number of similar (implementation,compiler) pairs: 35, namely:
Implementation | Compiler |
cryptopp | clang++ -march=native -O2 -fwrapv -Qunused-arguments -fPIC -fPIE -gdwarf-4 -Wall (Debian_Clang_11.0.1) |
cryptopp | clang++ -march=native -O3 -fwrapv -Qunused-arguments -fPIC -fPIE -gdwarf-4 -Wall (Debian_Clang_11.0.1) |
cryptopp | clang++ -march=native -O -fwrapv -Qunused-arguments -fPIC -fPIE -gdwarf-4 -Wall |
cryptopp | clang++ -march=native -Os -fwrapv -Qunused-arguments -fPIC -fPIE -gdwarf-4 -Wall (Debian_Clang_11.0.1) |
cryptopp | g++ -march=native -mtune=native -O2 -fwrapv -fPIC -fPIE -gdwarf-4 -Wall (10.2.1_20210110) |
cryptopp | g++ -march=native -mtune=native -O3 -fwrapv -fPIC -fPIE -gdwarf-4 -Wall (10.2.1_20210110) |
cryptopp | g++ -march=native -mtune=native -O -fwrapv -fPIC -fPIE -gdwarf-4 -Wall |
cryptopp | g++ -march=native -mtune=native -Os -fwrapv -fPIC -fPIE -gdwarf-4 -Wall (10.2.1_20210110) |
openssl | clang -march=native -O2 -fwrapv -Qunused-arguments -fPIC -fPIE -gdwarf-4 -Wall (Debian_Clang_11.0.1) |
openssl | clang -march=native -O3 -fwrapv -Qunused-arguments -fPIC -fPIE -gdwarf-4 -Wall (Debian_Clang_11.0.1) |
openssl | clang -march=native -O -fwrapv -Qunused-arguments -fPIC -fPIE -gdwarf-4 -Wall (Debian_Clang_11.0.1) |
openssl | clang -march=native -Os -fwrapv -Qunused-arguments -fPIC -fPIE -gdwarf-4 -Wall (Debian_Clang_11.0.1) |
openssl | clang -mcpu=native -O3 -fwrapv -Qunused-arguments -fPIC -fPIE -gdwarf-4 -Wall (Debian_Clang_11.0.1) |
openssl | gcc -march=native -mtune=native -O2 -fwrapv -fPIC -fPIE -gdwarf-4 -Wall (10.2.1_20210110) |
openssl | gcc -march=native -mtune=native -O3 -fwrapv -fPIC -fPIE -gdwarf-4 -Wall (10.2.1_20210110) |
openssl | gcc -march=native -mtune=native -O -fwrapv -fPIC -fPIE -gdwarf-4 -Wall (10.2.1_20210110) |
openssl | gcc -march=native -mtune=native -Os -fwrapv -fPIC -fPIE -gdwarf-4 -Wall (10.2.1_20210110) |
sphlib | clang -march=native -O2 -fwrapv -Qunused-arguments -fPIC -fPIE -gdwarf-4 -Wall (Debian_Clang_11.0.1) |
sphlib | clang -march=native -O3 -fwrapv -Qunused-arguments -fPIC -fPIE -gdwarf-4 -Wall (Debian_Clang_11.0.1) |
sphlib | clang -march=native -O -fwrapv -Qunused-arguments -fPIC -fPIE -gdwarf-4 -Wall (Debian_Clang_11.0.1) |
sphlib | clang -march=native -Os -fwrapv -Qunused-arguments -fPIC -fPIE -gdwarf-4 -Wall (Debian_Clang_11.0.1) |
sphlib | clang -mcpu=native -O3 -fwrapv -Qunused-arguments -fPIC -fPIE -gdwarf-4 -Wall (Debian_Clang_11.0.1) |
sphlib | gcc -march=native -mtune=native -O2 -fwrapv -fPIC -fPIE -gdwarf-4 -Wall (10.2.1_20210110) |
sphlib | gcc -march=native -mtune=native -O3 -fwrapv -fPIC -fPIE -gdwarf-4 -Wall (10.2.1_20210110) |
sphlib | gcc -march=native -mtune=native -O -fwrapv -fPIC -fPIE -gdwarf-4 -Wall (10.2.1_20210110) |
sphlib | gcc -march=native -mtune=native -Os -fwrapv -fPIC -fPIE -gdwarf-4 -Wall (10.2.1_20210110) |
sphlib-small | clang -march=native -O2 -fwrapv -Qunused-arguments -fPIC -fPIE -gdwarf-4 -Wall (Debian_Clang_11.0.1) |
sphlib-small | clang -march=native -O3 -fwrapv -Qunused-arguments -fPIC -fPIE -gdwarf-4 -Wall (Debian_Clang_11.0.1) |
sphlib-small | clang -march=native -O -fwrapv -Qunused-arguments -fPIC -fPIE -gdwarf-4 -Wall (Debian_Clang_11.0.1) |
sphlib-small | clang -march=native -Os -fwrapv -Qunused-arguments -fPIC -fPIE -gdwarf-4 -Wall (Debian_Clang_11.0.1) |
sphlib-small | clang -mcpu=native -O3 -fwrapv -Qunused-arguments -fPIC -fPIE -gdwarf-4 -Wall (Debian_Clang_11.0.1) |
sphlib-small | gcc -march=native -mtune=native -O2 -fwrapv -fPIC -fPIE -gdwarf-4 -Wall (10.2.1_20210110) |
sphlib-small | gcc -march=native -mtune=native -O3 -fwrapv -fPIC -fPIE -gdwarf-4 -Wall (10.2.1_20210110) |
sphlib-small | gcc -march=native -mtune=native -O -fwrapv -fPIC -fPIE -gdwarf-4 -Wall (10.2.1_20210110) |
sphlib-small | gcc -march=native -mtune=native -Os -fwrapv -fPIC -fPIE -gdwarf-4 -Wall (10.2.1_20210110) |