Test results for amd64, hertz, crypto_sign/ed25519

[Page version: 20250310 13:41:42]

Measurements for amd64, hertz, crypto_sign Test results for amd64, hertz, crypto_sign Test results for crypto_sign/ed25519
Computer: hertz
Microarchitecture: amd64; Zen 4 (a60f12)
Architecture: amd64
CPU ID: AuthenticAMD-00a60f12-178bfbff
SUPERCOP version: 20250307
Operation: crypto_sign
Primitive: ed25519
TimeObject sizeTest sizeImplementationCompilerBenchmark dateSUPERCOP version
22051997429 0 0107612 852 1928amd64-64-24kgcc -march=native -mtune=native -O3 -fwrapv -fPIC -fPIE -gdwarf-4 -Wall2025030820250307
22060392625 0 0102756 852 1928amd64-64-24kgcc -march=native -mtune=native -O2 -fwrapv -fPIC -fPIE -gdwarf-4 -Wall2025030820250307
22101395965 0 0111042 860 1832amd64-64-24kclang -march=native -O3 -fwrapv -Qunused-arguments -fPIC -fPIE -gdwarf-4 -Wall2025030820250307
22113888494 0 0101260 852 1832amd64-64-24kclang -march=native -Os -fwrapv -Qunused-arguments -fPIC -fPIE -gdwarf-4 -Wall2025030820250307
22146492647 0 0107674 860 1832amd64-64-24kclang -march=native -O2 -fwrapv -Qunused-arguments -fPIC -fPIE -gdwarf-4 -Wall2025030820250307
22244290378 0 0100012 844 1800amd64-64-24kgcc -march=native -mtune=native -Os -fwrapv -fPIC -fPIE -gdwarf-4 -Wall2025030820250307
22795186630 0 096340 852 1928amd64-51-30kgcc -march=native -mtune=native -O3 -fwrapv -fPIC -fPIE -gdwarf-4 -Wall2025030820250307
22804381100 0 095802 860 1832amd64-51-30kclang -march=native -O2 -fwrapv -Qunused-arguments -fPIC -fPIE -gdwarf-4 -Wall2025030820250307
22810181814 0 096578 860 1832amd64-51-30kclang -march=native -O3 -fwrapv -Qunused-arguments -fPIC -fPIE -gdwarf-4 -Wall2025030820250307
22880477494 0 089868 852 1832amd64-51-30kclang -march=native -Os -fwrapv -Qunused-arguments -fPIC -fPIE -gdwarf-4 -Wall2025030820250307
22913581840 0 091548 852 1928amd64-51-30kgcc -march=native -mtune=native -O2 -fwrapv -fPIC -fPIE -gdwarf-4 -Wall2025030820250307
23123479274 0 088700 844 1800amd64-51-30kgcc -march=native -mtune=native -Os -fwrapv -fPIC -fPIE -gdwarf-4 -Wall2025030820250307
50444455238 0 076452 852 1832ref10clang -march=native -Os -fwrapv -Qunused-arguments -fPIC -fPIE -gdwarf-4 -Wall2025030820250307
52345461848 0 086914 860 1832ref10clang -march=native -O3 -fwrapv -Qunused-arguments -fPIC -fPIE -gdwarf-4 -Wall2025030820250307
52418158721 0 083730 860 1832ref10clang -march=native -O2 -fwrapv -Qunused-arguments -fPIC -fPIE -gdwarf-4 -Wall2025030820250307
53427659056 0 077404 844 1800ref10gcc -march=native -mtune=native -Os -fwrapv -fPIC -fPIE -gdwarf-4 -Wall2025030820250307
69398761986 0 082300 852 1928ref10gcc -march=native -mtune=native -O2 -fwrapv -fPIC -fPIE -gdwarf-4 -Wall2025030820250307
69458262662 0 084740 852 1928ref10gcc -march=native -mtune=native -O3 -fwrapv -fPIC -fPIE -gdwarf-4 -Wall2025030820250307
6037624136980 0 0162826 860 1832refclang -march=native -O3 -fwrapv -Qunused-arguments -fPIC -fPIE -gdwarf-4 -Wall2025030820250307
6307021133550 0 0159346 860 1832refclang -march=native -O2 -fwrapv -Qunused-arguments -fPIC -fPIE -gdwarf-4 -Wall2025030820250307
6360659134909 0 0158612 852 1928refgcc -march=native -mtune=native -O3 -fwrapv -fPIC -fPIE -gdwarf-4 -Wall2025030820250307
6805246125595 0 0147480 852 1928refgcc -march=native -mtune=native -O2 -fwrapv -fPIC -fPIE -gdwarf-4 -Wall2025030820250307
7243198122319 0 0144284 852 1832refclang -march=native -Os -fwrapv -Qunused-arguments -fPIC -fPIE -gdwarf-4 -Wall2025030820250307
11809158121642 0 0141804 844 1800refgcc -march=native -mtune=native -Os -fwrapv -fPIC -fPIE -gdwarf-4 -Wall2025030820250307

Compiler output


ge25519_multi_scalarmult.c: ge25519_multi_scalarmult.c:61:33: warning: variable 'i' set but not used [-Wunused-but-set-variable]
ge25519_multi_scalarmult.c:    61 |   unsigned long long max1, max2,i;
ge25519_multi_scalarmult.c:       |                                 ^
ge25519_multi_scalarmult.c: 1 warning generated.
try.c: clang: error: no such file or directory: '.../supercop-data/avx/amd64/lib/timecop/cpucycles.o'

Number of similar (implementation,compiler) pairs: 6, namely:
ImplementationCompiler
amd64-51-30kclang -march=native -O2 -fwrapv -Qunused-arguments -fPIC -fPIE -gdwarf-4 -Wall (Ubuntu_Clang_19.1.1_(1ubuntu1))
amd64-51-30kclang -march=native -O3 -fwrapv -Qunused-arguments -fPIC -fPIE -gdwarf-4 -Wall (Ubuntu_Clang_19.1.1_(1ubuntu1))
amd64-51-30kclang -march=native -Os -fwrapv -Qunused-arguments -fPIC -fPIE -gdwarf-4 -Wall (Ubuntu_Clang_19.1.1_(1ubuntu1))
amd64-64-24kclang -march=native -O2 -fwrapv -Qunused-arguments -fPIC -fPIE -gdwarf-4 -Wall (Ubuntu_Clang_19.1.1_(1ubuntu1))
amd64-64-24kclang -march=native -O3 -fwrapv -Qunused-arguments -fPIC -fPIE -gdwarf-4 -Wall (Ubuntu_Clang_19.1.1_(1ubuntu1))
amd64-64-24kclang -march=native -Os -fwrapv -Qunused-arguments -fPIC -fPIE -gdwarf-4 -Wall (Ubuntu_Clang_19.1.1_(1ubuntu1))

Compiler output


try.c: In file included from try-anything-timecop.c:3:
try.c: try-anything.c:17:10: fatal error: cpucycles.h: No such file or directory
try.c:    17 | #include "cpucycles.h"
try.c:       |          ^~~~~~~~~~~~~
try.c: compilation terminated.

Number of similar (implementation,compiler) pairs: 12, namely:
ImplementationCompiler
amd64-51-30kgcc -march=native -mtune=native -O2 -fwrapv -fPIC -fPIE -gdwarf-4 -Wall (14.2.0)
amd64-51-30kgcc -march=native -mtune=native -O3 -fwrapv -fPIC -fPIE -gdwarf-4 -Wall (14.2.0)
amd64-51-30kgcc -march=native -mtune=native -Os -fwrapv -fPIC -fPIE -gdwarf-4 -Wall (14.2.0)
amd64-64-24kgcc -march=native -mtune=native -O2 -fwrapv -fPIC -fPIE -gdwarf-4 -Wall (14.2.0)
amd64-64-24kgcc -march=native -mtune=native -O3 -fwrapv -fPIC -fPIE -gdwarf-4 -Wall (14.2.0)
amd64-64-24kgcc -march=native -mtune=native -Os -fwrapv -fPIC -fPIE -gdwarf-4 -Wall (14.2.0)
refgcc -march=native -mtune=native -O2 -fwrapv -fPIC -fPIE -gdwarf-4 -Wall (14.2.0)
refgcc -march=native -mtune=native -O3 -fwrapv -fPIC -fPIE -gdwarf-4 -Wall (14.2.0)
refgcc -march=native -mtune=native -Os -fwrapv -fPIC -fPIE -gdwarf-4 -Wall (14.2.0)
ref10gcc -march=native -mtune=native -O2 -fwrapv -fPIC -fPIE -gdwarf-4 -Wall (14.2.0)
ref10gcc -march=native -mtune=native -O3 -fwrapv -fPIC -fPIE -gdwarf-4 -Wall (14.2.0)
ref10gcc -march=native -mtune=native -Os -fwrapv -fPIC -fPIE -gdwarf-4 -Wall (14.2.0)

Compiler output


try.c: clang: error: no such file or directory: '.../supercop-data/avx/amd64/lib/timecop/cpucycles.o'

Number of similar (implementation,compiler) pairs: 6, namely:
ImplementationCompiler
refclang -march=native -O2 -fwrapv -Qunused-arguments -fPIC -fPIE -gdwarf-4 -Wall (Ubuntu_Clang_19.1.1_(1ubuntu1))
refclang -march=native -O3 -fwrapv -Qunused-arguments -fPIC -fPIE -gdwarf-4 -Wall (Ubuntu_Clang_19.1.1_(1ubuntu1))
refclang -march=native -Os -fwrapv -Qunused-arguments -fPIC -fPIE -gdwarf-4 -Wall (Ubuntu_Clang_19.1.1_(1ubuntu1))
ref10clang -march=native -O2 -fwrapv -Qunused-arguments -fPIC -fPIE -gdwarf-4 -Wall (Ubuntu_Clang_19.1.1_(1ubuntu1))
ref10clang -march=native -O3 -fwrapv -Qunused-arguments -fPIC -fPIE -gdwarf-4 -Wall (Ubuntu_Clang_19.1.1_(1ubuntu1))
ref10clang -march=native -Os -fwrapv -Qunused-arguments -fPIC -fPIE -gdwarf-4 -Wall (Ubuntu_Clang_19.1.1_(1ubuntu1))

TIMECOP error (can be valgrind bug)


error 127
timeout: failed to run command 'valgrind': No such file or directory

Number of similar (implementation,compiler) pairs: 24, namely:
ImplementationCompiler
amd64-51-30kclang -march=native -O2 -fwrapv -Qunused-arguments -fPIC -fPIE -gdwarf-4 -Wall (Ubuntu_Clang_19.1.1_(1ubuntu1))
amd64-51-30kclang -march=native -O3 -fwrapv -Qunused-arguments -fPIC -fPIE -gdwarf-4 -Wall (Ubuntu_Clang_19.1.1_(1ubuntu1))
amd64-51-30kclang -march=native -Os -fwrapv -Qunused-arguments -fPIC -fPIE -gdwarf-4 -Wall (Ubuntu_Clang_19.1.1_(1ubuntu1))
amd64-51-30kgcc -march=native -mtune=native -O2 -fwrapv -fPIC -fPIE -gdwarf-4 -Wall (14.2.0)
amd64-51-30kgcc -march=native -mtune=native -O3 -fwrapv -fPIC -fPIE -gdwarf-4 -Wall (14.2.0)
amd64-51-30kgcc -march=native -mtune=native -Os -fwrapv -fPIC -fPIE -gdwarf-4 -Wall (14.2.0)
amd64-64-24kclang -march=native -O2 -fwrapv -Qunused-arguments -fPIC -fPIE -gdwarf-4 -Wall (Ubuntu_Clang_19.1.1_(1ubuntu1))
amd64-64-24kclang -march=native -O3 -fwrapv -Qunused-arguments -fPIC -fPIE -gdwarf-4 -Wall (Ubuntu_Clang_19.1.1_(1ubuntu1))
amd64-64-24kclang -march=native -Os -fwrapv -Qunused-arguments -fPIC -fPIE -gdwarf-4 -Wall (Ubuntu_Clang_19.1.1_(1ubuntu1))
amd64-64-24kgcc -march=native -mtune=native -O2 -fwrapv -fPIC -fPIE -gdwarf-4 -Wall (14.2.0)
amd64-64-24kgcc -march=native -mtune=native -O3 -fwrapv -fPIC -fPIE -gdwarf-4 -Wall (14.2.0)
amd64-64-24kgcc -march=native -mtune=native -Os -fwrapv -fPIC -fPIE -gdwarf-4 -Wall (14.2.0)
refclang -march=native -O2 -fwrapv -Qunused-arguments -fPIC -fPIE -gdwarf-4 -Wall (Ubuntu_Clang_19.1.1_(1ubuntu1))
refclang -march=native -O3 -fwrapv -Qunused-arguments -fPIC -fPIE -gdwarf-4 -Wall (Ubuntu_Clang_19.1.1_(1ubuntu1))
refclang -march=native -Os -fwrapv -Qunused-arguments -fPIC -fPIE -gdwarf-4 -Wall (Ubuntu_Clang_19.1.1_(1ubuntu1))
refgcc -march=native -mtune=native -O2 -fwrapv -fPIC -fPIE -gdwarf-4 -Wall (14.2.0)
refgcc -march=native -mtune=native -O3 -fwrapv -fPIC -fPIE -gdwarf-4 -Wall (14.2.0)
refgcc -march=native -mtune=native -Os -fwrapv -fPIC -fPIE -gdwarf-4 -Wall (14.2.0)
ref10clang -march=native -O2 -fwrapv -Qunused-arguments -fPIC -fPIE -gdwarf-4 -Wall (Ubuntu_Clang_19.1.1_(1ubuntu1))
ref10clang -march=native -O3 -fwrapv -Qunused-arguments -fPIC -fPIE -gdwarf-4 -Wall (Ubuntu_Clang_19.1.1_(1ubuntu1))
ref10clang -march=native -Os -fwrapv -Qunused-arguments -fPIC -fPIE -gdwarf-4 -Wall (Ubuntu_Clang_19.1.1_(1ubuntu1))
ref10gcc -march=native -mtune=native -O2 -fwrapv -fPIC -fPIE -gdwarf-4 -Wall (14.2.0)
ref10gcc -march=native -mtune=native -O3 -fwrapv -fPIC -fPIE -gdwarf-4 -Wall (14.2.0)
ref10gcc -march=native -mtune=native -Os -fwrapv -fPIC -fPIE -gdwarf-4 -Wall (14.2.0)