Test results for amd64, hertz, crypto_sign/dilithium5

[Page version: 20250310 13:41:42]

Measurements for amd64, hertz, crypto_sign Test results for amd64, hertz, crypto_sign Test results for crypto_sign/dilithium5
Computer: hertz
Microarchitecture: amd64; Zen 4 (a60f12)
Architecture: amd64
CPU ID: AuthenticAMD-00a60f12-178bfbff
SUPERCOP version: 20250307
Operation: crypto_sign
Primitive: dilithium5
TimeObject sizeTest sizeImplementationCompilerBenchmark dateSUPERCOP version
1020440114957 64 0138537 916 1832avx2clang -march=native -O3 -fwrapv -Qunused-arguments -fPIC -fPIE -gdwarf-4 -Wall2025030820250307
1020725106827 64 0130297 916 1832avx2clang -march=native -O2 -fwrapv -Qunused-arguments -fPIC -fPIE -gdwarf-4 -Wall2025030820250307
105565178254 64 098131 908 1832avx2clang -march=native -Os -fwrapv -Qunused-arguments -fPIC -fPIE -gdwarf-4 -Wall2025030820250307
1070066103289 64 0125996 892 1928avx2gcc -march=native -mtune=native -O3 -fwrapv -fPIC -fPIE -gdwarf-4 -Wall2025030820250307
107479061660 64 080852 884 1800avx2gcc -march=native -mtune=native -Os -fwrapv -fPIC -fPIE -gdwarf-4 -Wall2025030820250307
107953269074 64 089940 892 1928avx2gcc -march=native -mtune=native -O2 -fwrapv -fPIC -fPIE -gdwarf-4 -Wall2025030820250307
625839270157 0 093481 844 1832refclang -march=native -O3 -fwrapv -Qunused-arguments -fPIC -fPIE -gdwarf-4 -Wall2025030820250307
677718653021 0 075508 820 1928refgcc -march=native -mtune=native -O3 -fwrapv -fPIC -fPIE -gdwarf-4 -Wall2025030820250307
699973019339 0 040339 836 1832refclang -march=native -Os -fwrapv -Qunused-arguments -fPIC -fPIE -gdwarf-4 -Wall2025030820250307
701769922461 0 043108 820 1928refgcc -march=native -mtune=native -O2 -fwrapv -fPIC -fPIE -gdwarf-4 -Wall2025030820250307
725111760304 0 083497 844 1832refclang -march=native -O2 -fwrapv -Qunused-arguments -fPIC -fPIE -gdwarf-4 -Wall2025030820250307
810021918863 0 037972 812 1800refgcc -march=native -mtune=native -Os -fwrapv -fPIC -fPIE -gdwarf-4 -Wall2025030820250307

Compiler output


poly.c: poly.c:1055:52: warning: argument 'a' of type 'const uint8_t[652]' (aka 'const unsigned char[652]') with mismatched bound [-Warray-parameter]
poly.c:  1055 | void polyz_unpack(poly * restrict r, const uint8_t a[POLYZ_PACKEDBYTES+12]) {
poly.c:       |                                                    ^
poly.c: ./poly.h:111:42: note: previously declared as 'const uint8_t[654]' (aka 'const unsigned char[654]') here
poly.c:   111 | void polyz_unpack(poly *r, const uint8_t a[POLYZ_PACKEDBYTES+14]);
poly.c:       |                                          ^
poly.c: poly.c:1121:26: warning: argument 'r' of type 'uint8_t[128]' (aka 'unsigned char[128]') with mismatched bound [-Warray-parameter]
poly.c:  1121 | void polyw1_pack(uint8_t r[POLYW1_PACKEDBYTES], const poly * restrict a) {
poly.c:       |                          ^
poly.c: ./poly.h:114:26: note: previously declared as 'uint8_t[136]' (aka 'unsigned char[136]') here
poly.c:   114 | void polyw1_pack(uint8_t r[POLYW1_PACKEDBYTES+8], const poly *a);
poly.c:       |                          ^
poly.c: 2 warnings generated.
rejsample.c: rejsample.c:316:62: warning: argument 'buf' of type 'const uint8_t[168]' (aka 'const unsigned char[168]') with mismatched bound [-Warray-parameter]
rejsample.c:   316 | unsigned int rej_eta_avx(int32_t * restrict r, const uint8_t buf[REJ_UNIFORM_ETA_BUFLEN]) {
rejsample.c:       |                                                              ^
rejsample.c: ./rejsample.h:25:52: note: previously declared as 'const uint8_t[840]' (aka 'const unsigned char[840]') here
rejsample.c:    25 | unsigned int rej_eta_avx(int32_t *r, const uint8_t buf[REJ_UNIFORM_BUFLEN]);
rejsample.c:       |                                                    ^
rejsample.c: 1 warning generated.
try.c: clang: error: no such file or directory: '.../supercop-data/avx/amd64/lib/timecop/cpucycles.o'

Number of similar (implementation,compiler) pairs: 3, namely:
ImplementationCompiler
avx2clang -march=native -O2 -fwrapv -Qunused-arguments -fPIC -fPIE -gdwarf-4 -Wall (Ubuntu_Clang_19.1.1_(1ubuntu1))
avx2clang -march=native -O3 -fwrapv -Qunused-arguments -fPIC -fPIE -gdwarf-4 -Wall (Ubuntu_Clang_19.1.1_(1ubuntu1))
avx2clang -march=native -Os -fwrapv -Qunused-arguments -fPIC -fPIE -gdwarf-4 -Wall (Ubuntu_Clang_19.1.1_(1ubuntu1))

Compiler output


poly.c: poly.c:1055:52: warning: argument 2 of type 'const uint8_t[652]' {aka 'const unsigned char[652]'} with mismatched bound [-Warray-parameter=]
poly.c:  1055 | void polyz_unpack(poly * restrict r, const uint8_t a[POLYZ_PACKEDBYTES+12]) {
poly.c:       |                                      ~~~~~~~~~~~~~~^~~~~~~~~~~~~~~~~~~~~~~
poly.c: In file included from poly.c:7:
poly.c: poly.h:111:42: note: previously declared as 'const uint8_t[654]' {aka 'const unsigned char[654]'}
poly.c:   111 | void polyz_unpack(poly *r, const uint8_t a[POLYZ_PACKEDBYTES+14]);
poly.c:       |                            ~~~~~~~~~~~~~~^~~~~~~~~~~~~~~~~~~~~~~
poly.c: poly.c:1121:26: warning: argument 1 of type 'uint8_t[128]' {aka 'unsigned char[128]'} with mismatched bound [-Warray-parameter=]
poly.c:  1121 | void polyw1_pack(uint8_t r[POLYW1_PACKEDBYTES], const poly * restrict a) {
poly.c:       |                  ~~~~~~~~^~~~~~~~~~~~~~~~~~~~~
poly.c: poly.h:114:26: note: previously declared as 'uint8_t[136]' {aka 'unsigned char[136]'}
poly.c:   114 | void polyw1_pack(uint8_t r[POLYW1_PACKEDBYTES+8], const poly *a);
poly.c:       |                  ~~~~~~~~^~~~~~~~~~~~~~~~~~~~~~~
poly.c: poly.c: In function 'crypto_sign_dilithium5_avx2_constbranchindex_poly_uniform_eta_4x':
poly.c: <command-line>: warning: 'crypto_sign_dilithium5_avx2_constbranchindex_rej_eta_avx' reading 840 bytes from a region of size 768 [-Wstringop-overread]
poly.c: config.h:3:32: note: in expansion of macro 'CRYPTO_NAMESPACE'
poly.c:     3 | #define DILITHIUM_NAMESPACE(s) CRYPTO_NAMESPACE(s)
poly.c:       |                                ^~~~~~~~~~~~~~~~
poly.c: rejsample.h:24:21: note: in expansion of macro 'DILITHIUM_NAMESPACE'
poly.c:    24 | #define rej_eta_avx DILITHIUM_NAMESPACE(rej_eta_avx)
poly.c:       |                     ^~~~~~~~~~~~~~~~~~~
poly.c: poly.c:596:10: note: in expansion of macro 'rej_eta_avx'
poly.c:   596 |   ctr0 = rej_eta_avx(a0->coeffs, buf[0].coeffs);
poly.c:       |          ^~~~~~~~~~~
poly.c: <command-line>: note: referencing argument 2 of type 'const uint8_t[840]' {aka 'const unsigned char[840]'}
poly.c: ...
polyvec.c: polyvec.c: In function 'crypto_sign_dilithium5_avx2_constbranchindex_polyvecl_uniform_gamma1':
polyvec.c: <command-line>: warning: 'crypto_sign_dilithium5_avx2_constbranchindex_poly_uniform_gamma1' reading 48 bytes from a region of size 32 [-Wstringop-overread]
polyvec.c: config.h:3:32: note: in expansion of macro 'CRYPTO_NAMESPACE'
polyvec.c:     3 | #define DILITHIUM_NAMESPACE(s) CRYPTO_NAMESPACE(s)
polyvec.c:       |                                ^~~~~~~~~~~~~~~~
polyvec.c: poly.h:55:29: note: in expansion of macro 'DILITHIUM_NAMESPACE'
polyvec.c:    55 | #define poly_uniform_gamma1 DILITHIUM_NAMESPACE(poly_uniform_gamma1)
polyvec.c:       |                             ^~~~~~~~~~~~~~~~~~~
polyvec.c: polyvec.c:279:5: note: in expansion of macro 'poly_uniform_gamma1'
polyvec.c:   279 |     poly_uniform_gamma1(&v->vec[i], seed, L*nonce + i);
polyvec.c:       |     ^~~~~~~~~~~~~~~~~~~
polyvec.c: <command-line>: note: referencing argument 2 of type 'const uint8_t[48]' {aka 'const unsigned char[48]'}
polyvec.c: config.h:3:32: note: in expansion of macro 'CRYPTO_NAMESPACE'
polyvec.c:     3 | #define DILITHIUM_NAMESPACE(s) CRYPTO_NAMESPACE(s)
polyvec.c:       |                                ^~~~~~~~~~~~~~~~
polyvec.c: poly.h:55:29: note: in expansion of macro 'DILITHIUM_NAMESPACE'
polyvec.c:    55 | #define poly_uniform_gamma1 DILITHIUM_NAMESPACE(poly_uniform_gamma1)
polyvec.c:       |                             ^~~~~~~~~~~~~~~~~~~
polyvec.c: polyvec.c:279:5: note: in expansion of macro 'poly_uniform_gamma1'
polyvec.c:   279 |     poly_uniform_gamma1(&v->vec[i], seed, L*nonce + i);
polyvec.c:       |     ^~~~~~~~~~~~~~~~~~~
polyvec.c: <command-line>: note: in a call to function 'crypto_sign_dilithium5_avx2_constbranchindex_poly_uniform_gamma1'
polyvec.c: config.h:3:32: note: in expansion of macro 'CRYPTO_NAMESPACE'
polyvec.c:     3 | #define DILITHIUM_NAMESPACE(s) CRYPTO_NAMESPACE(s)
polyvec.c:       |                                ^~~~~~~~~~~~~~~~
polyvec.c: ...
rejsample.c: rejsample.c:316:62: warning: argument 2 of type 'const uint8_t[168]' {aka 'const unsigned char[168]'} with mismatched bound [-Warray-parameter=]
rejsample.c:   316 | unsigned int rej_eta_avx(int32_t * restrict r, const uint8_t buf[REJ_UNIFORM_ETA_BUFLEN]) {
rejsample.c:       |                                                ~~~~~~~~~~~~~~^~~~~~~~~~~~~~~~~~~~~~~~~~~
rejsample.c: In file included from rejsample.c:4:
rejsample.c: rejsample.h:25:52: note: previously declared as 'const uint8_t[840]' {aka 'const unsigned char[840]'}
rejsample.c:    25 | unsigned int rej_eta_avx(int32_t *r, const uint8_t buf[REJ_UNIFORM_BUFLEN]);
rejsample.c:       |                                      ~~~~~~~~~~~~~~^~~~~~~~~~~~~~~~~~~~~~~
try.c: In file included from try-anything-timecop.c:3:
try.c: try-anything.c:17:10: fatal error: cpucycles.h: No such file or directory
try.c:    17 | #include "cpucycles.h"
try.c:       |          ^~~~~~~~~~~~~
try.c: compilation terminated.

Number of similar (implementation,compiler) pairs: 3, namely:
ImplementationCompiler
avx2gcc -march=native -mtune=native -O2 -fwrapv -fPIC -fPIE -gdwarf-4 -Wall (14.2.0)
avx2gcc -march=native -mtune=native -O3 -fwrapv -fPIC -fPIE -gdwarf-4 -Wall (14.2.0)
avx2gcc -march=native -mtune=native -Os -fwrapv -fPIC -fPIE -gdwarf-4 -Wall (14.2.0)

Compiler output


try.c: clang: error: no such file or directory: '.../supercop-data/avx/amd64/lib/timecop/cpucycles.o'

Number of similar (implementation,compiler) pairs: 3, namely:
ImplementationCompiler
refclang -march=native -O2 -fwrapv -Qunused-arguments -fPIC -fPIE -gdwarf-4 -Wall (Ubuntu_Clang_19.1.1_(1ubuntu1))
refclang -march=native -O3 -fwrapv -Qunused-arguments -fPIC -fPIE -gdwarf-4 -Wall (Ubuntu_Clang_19.1.1_(1ubuntu1))
refclang -march=native -Os -fwrapv -Qunused-arguments -fPIC -fPIE -gdwarf-4 -Wall (Ubuntu_Clang_19.1.1_(1ubuntu1))

Compiler output


polyvec.c: polyvec.c: In function 'crypto_sign_dilithium5_ref_constbranchindex_polyvecl_uniform_gamma1':
polyvec.c: <command-line>: warning: 'crypto_sign_dilithium5_ref_constbranchindex_poly_uniform_gamma1' reading 48 bytes from a region of size 32 [-Wstringop-overread]
polyvec.c: config.h:3:32: note: in expansion of macro 'CRYPTO_NAMESPACE'
polyvec.c:     3 | #define DILITHIUM_NAMESPACE(s) CRYPTO_NAMESPACE(s)
polyvec.c:       |                                ^~~~~~~~~~~~~~~~
polyvec.c: poly.h:51:29: note: in expansion of macro 'DILITHIUM_NAMESPACE'
polyvec.c:    51 | #define poly_uniform_gamma1 DILITHIUM_NAMESPACE(poly_uniform_gamma1)
polyvec.c:       |                             ^~~~~~~~~~~~~~~~~~~
polyvec.c: polyvec.c:47:5: note: in expansion of macro 'poly_uniform_gamma1'
polyvec.c:    47 |     poly_uniform_gamma1(&v->vec[i], seed, L*nonce + i);
polyvec.c:       |     ^~~~~~~~~~~~~~~~~~~
polyvec.c: <command-line>: note: referencing argument 2 of type 'const uint8_t[48]' {aka 'const unsigned char[48]'}
polyvec.c: config.h:3:32: note: in expansion of macro 'CRYPTO_NAMESPACE'
polyvec.c:     3 | #define DILITHIUM_NAMESPACE(s) CRYPTO_NAMESPACE(s)
polyvec.c:       |                                ^~~~~~~~~~~~~~~~
polyvec.c: poly.h:51:29: note: in expansion of macro 'DILITHIUM_NAMESPACE'
polyvec.c:    51 | #define poly_uniform_gamma1 DILITHIUM_NAMESPACE(poly_uniform_gamma1)
polyvec.c:       |                             ^~~~~~~~~~~~~~~~~~~
polyvec.c: polyvec.c:47:5: note: in expansion of macro 'poly_uniform_gamma1'
polyvec.c:    47 |     poly_uniform_gamma1(&v->vec[i], seed, L*nonce + i);
polyvec.c:       |     ^~~~~~~~~~~~~~~~~~~
polyvec.c: <command-line>: note: in a call to function 'crypto_sign_dilithium5_ref_constbranchindex_poly_uniform_gamma1'
polyvec.c: config.h:3:32: note: in expansion of macro 'CRYPTO_NAMESPACE'
polyvec.c:     3 | #define DILITHIUM_NAMESPACE(s) CRYPTO_NAMESPACE(s)
polyvec.c:       |                                ^~~~~~~~~~~~~~~~
polyvec.c: ...
try.c: In file included from try-anything-timecop.c:3:
try.c: try-anything.c:17:10: fatal error: cpucycles.h: No such file or directory
try.c:    17 | #include "cpucycles.h"
try.c:       |          ^~~~~~~~~~~~~
try.c: compilation terminated.

Number of similar (implementation,compiler) pairs: 3, namely:
ImplementationCompiler
refgcc -march=native -mtune=native -O2 -fwrapv -fPIC -fPIE -gdwarf-4 -Wall (14.2.0)
refgcc -march=native -mtune=native -O3 -fwrapv -fPIC -fPIE -gdwarf-4 -Wall (14.2.0)
refgcc -march=native -mtune=native -Os -fwrapv -fPIC -fPIE -gdwarf-4 -Wall (14.2.0)

TIMECOP error (can be valgrind bug)


error 127
timeout: failed to run command 'valgrind': No such file or directory

Number of similar (implementation,compiler) pairs: 12, namely:
ImplementationCompiler
avx2clang -march=native -O2 -fwrapv -Qunused-arguments -fPIC -fPIE -gdwarf-4 -Wall (Ubuntu_Clang_19.1.1_(1ubuntu1))
avx2clang -march=native -O3 -fwrapv -Qunused-arguments -fPIC -fPIE -gdwarf-4 -Wall (Ubuntu_Clang_19.1.1_(1ubuntu1))
avx2clang -march=native -Os -fwrapv -Qunused-arguments -fPIC -fPIE -gdwarf-4 -Wall (Ubuntu_Clang_19.1.1_(1ubuntu1))
avx2gcc -march=native -mtune=native -O2 -fwrapv -fPIC -fPIE -gdwarf-4 -Wall (14.2.0)
avx2gcc -march=native -mtune=native -O3 -fwrapv -fPIC -fPIE -gdwarf-4 -Wall (14.2.0)
avx2gcc -march=native -mtune=native -Os -fwrapv -fPIC -fPIE -gdwarf-4 -Wall (14.2.0)
refclang -march=native -O2 -fwrapv -Qunused-arguments -fPIC -fPIE -gdwarf-4 -Wall (Ubuntu_Clang_19.1.1_(1ubuntu1))
refclang -march=native -O3 -fwrapv -Qunused-arguments -fPIC -fPIE -gdwarf-4 -Wall (Ubuntu_Clang_19.1.1_(1ubuntu1))
refclang -march=native -Os -fwrapv -Qunused-arguments -fPIC -fPIE -gdwarf-4 -Wall (Ubuntu_Clang_19.1.1_(1ubuntu1))
refgcc -march=native -mtune=native -O2 -fwrapv -fPIC -fPIE -gdwarf-4 -Wall (14.2.0)
refgcc -march=native -mtune=native -O3 -fwrapv -fPIC -fPIE -gdwarf-4 -Wall (14.2.0)
refgcc -march=native -mtune=native -Os -fwrapv -fPIC -fPIE -gdwarf-4 -Wall (14.2.0)