Test results for armeabi, berry0, crypto_stream/dragon

[Page version: 20250206 00:27:24]

Measurements for armeabi, berry0, crypto_stream Test results for armeabi, berry0, crypto_stream Test results for crypto_stream/dragon
Computer: berry0
Microarchitecture: armeabi; ARM1176 (410fb767)
Architecture: armeabi
CPU ID: unknown CPU ID
SUPERCOP version: 20240909
Operation: crypto_stream
Primitive: dragon

Compiler output


dragon.c: In file included from dragon.c:1:
dragon.c: ./e/dragon.c:284:22: warning: implicit declaration of function 'U32TO32_BIG' is invalid in C99 [-Wimplicit-function-declaration]
dragon.c:         *(k_ptr++) = U32TO32_BIG(a);
dragon.c:                      ^
dragon.c: ./e/dragon.c:315:20: warning: implicit declaration of function 'U32TO32_BIG' is invalid in C99 [-Wimplicit-function-declaration]
dragon.c:         *(out++) = U32TO32_BIG(a) ^ *(in++);
dragon.c:                    ^
dragon.c: 2 warnings generated.
try.c: /usr/bin/ld: libcrypto_stream_dragon.a(dragon.o): in function `crypto_stream_dragon_e_submissions_dragon_timingleaks_ECRYPT_keystream_blocks':
try.c: .../supercop-data/berry0/armeabi/try/c/clang_-march=native_-O2_-fwrapv_-Qunused-arguments_-fPIC_-fPIE_-gdwarf-4_-Wall/timingleaks/crypto_stream/dragon/e/submissions/dragon/work/./e/dragon.c:284: undefined reference to `U32TO32_BIG'
try.c: /usr/bin/ld: .../supercop-data/berry0/armeabi/try/c/clang_-march=native_-O2_-fwrapv_-Qunused-arguments_-fPIC_-fPIE_-gdwarf-4_-Wall/timingleaks/crypto_stream/dragon/e/submissions/dragon/work/./e/dragon.c:285: undefined reference to `U32TO32_BIG'
try.c: /usr/bin/ld: libcrypto_stream_dragon.a(dragon.o): in function `crypto_stream_dragon_e_submissions_dragon_timingleaks_ECRYPT_process_blocks':
try.c: .../supercop-data/berry0/armeabi/try/c/clang_-march=native_-O2_-fwrapv_-Qunused-arguments_-fPIC_-fPIE_-gdwarf-4_-Wall/timingleaks/crypto_stream/dragon/e/submissions/dragon/work/./e/dragon.c:315: undefined reference to `U32TO32_BIG'
try.c: /usr/bin/ld: .../supercop-data/berry0/armeabi/try/c/clang_-march=native_-O2_-fwrapv_-Qunused-arguments_-fPIC_-fPIE_-gdwarf-4_-Wall/timingleaks/crypto_stream/dragon/e/submissions/dragon/work/./e/dragon.c:316: undefined reference to `U32TO32_BIG'
try.c: clang: error: linker command failed with exit code 1 (use -v to see invocation)

Number of similar (implementation,compiler) pairs: 1, namely:
ImplementationCompiler
T:e/submissions/dragonclang -march=native -O2 -fwrapv -Qunused-arguments -fPIC -fPIE -gdwarf-4 -Wall (Raspbian_Clang_11.0.1)

Compiler output


dragon.c: In file included from dragon.c:1:
dragon.c: ./e/dragon.c:284:22: warning: implicit declaration of function 'U32TO32_BIG' is invalid in C99 [-Wimplicit-function-declaration]
dragon.c:         *(k_ptr++) = U32TO32_BIG(a);
dragon.c:                      ^
dragon.c: ./e/dragon.c:315:20: warning: implicit declaration of function 'U32TO32_BIG' is invalid in C99 [-Wimplicit-function-declaration]
dragon.c:         *(out++) = U32TO32_BIG(a) ^ *(in++);
dragon.c:                    ^
dragon.c: 2 warnings generated.
try.c: /usr/bin/ld: libcrypto_stream_dragon.a(dragon.o): in function `crypto_stream_dragon_e_submissions_dragon_timingleaks_ECRYPT_keystream_blocks':
try.c: .../supercop-data/berry0/armeabi/try/c/clang_-march=native_-O3_-fwrapv_-Qunused-arguments_-fPIC_-fPIE_-gdwarf-4_-Wall/timingleaks/crypto_stream/dragon/e/submissions/dragon/work/./e/dragon.c:284: undefined reference to `U32TO32_BIG'
try.c: /usr/bin/ld: .../supercop-data/berry0/armeabi/try/c/clang_-march=native_-O3_-fwrapv_-Qunused-arguments_-fPIC_-fPIE_-gdwarf-4_-Wall/timingleaks/crypto_stream/dragon/e/submissions/dragon/work/./e/dragon.c:285: undefined reference to `U32TO32_BIG'
try.c: /usr/bin/ld: libcrypto_stream_dragon.a(dragon.o): in function `crypto_stream_dragon_e_submissions_dragon_timingleaks_ECRYPT_process_blocks':
try.c: .../supercop-data/berry0/armeabi/try/c/clang_-march=native_-O3_-fwrapv_-Qunused-arguments_-fPIC_-fPIE_-gdwarf-4_-Wall/timingleaks/crypto_stream/dragon/e/submissions/dragon/work/./e/dragon.c:315: undefined reference to `U32TO32_BIG'
try.c: /usr/bin/ld: .../supercop-data/berry0/armeabi/try/c/clang_-march=native_-O3_-fwrapv_-Qunused-arguments_-fPIC_-fPIE_-gdwarf-4_-Wall/timingleaks/crypto_stream/dragon/e/submissions/dragon/work/./e/dragon.c:316: undefined reference to `U32TO32_BIG'
try.c: clang: error: linker command failed with exit code 1 (use -v to see invocation)

Number of similar (implementation,compiler) pairs: 1, namely:
ImplementationCompiler
T:e/submissions/dragonclang -march=native -O3 -fwrapv -Qunused-arguments -fPIC -fPIE -gdwarf-4 -Wall (Raspbian_Clang_11.0.1)

Compiler output


dragon.c: In file included from dragon.c:1:
dragon.c: ./e/dragon.c:284:22: warning: implicit declaration of function 'U32TO32_BIG' is invalid in C99 [-Wimplicit-function-declaration]
dragon.c:         *(k_ptr++) = U32TO32_BIG(a);
dragon.c:                      ^
dragon.c: ./e/dragon.c:315:20: warning: implicit declaration of function 'U32TO32_BIG' is invalid in C99 [-Wimplicit-function-declaration]
dragon.c:         *(out++) = U32TO32_BIG(a) ^ *(in++);
dragon.c:                    ^
dragon.c: 2 warnings generated.
try.c: /usr/bin/ld: libcrypto_stream_dragon.a(dragon.o): in function `crypto_stream_dragon_e_submissions_dragon_timingleaks_ECRYPT_keystream_blocks':
try.c: .../supercop-data/berry0/armeabi/try/c/clang_-march=native_-O_-fwrapv_-Qunused-arguments_-fPIC_-fPIE_-gdwarf-4_-Wall/timingleaks/crypto_stream/dragon/e/submissions/dragon/work/./e/dragon.c:284: undefined reference to `U32TO32_BIG'
try.c: /usr/bin/ld: .../supercop-data/berry0/armeabi/try/c/clang_-march=native_-O_-fwrapv_-Qunused-arguments_-fPIC_-fPIE_-gdwarf-4_-Wall/timingleaks/crypto_stream/dragon/e/submissions/dragon/work/./e/dragon.c:285: undefined reference to `U32TO32_BIG'
try.c: /usr/bin/ld: libcrypto_stream_dragon.a(dragon.o): in function `crypto_stream_dragon_e_submissions_dragon_timingleaks_ECRYPT_process_blocks':
try.c: .../supercop-data/berry0/armeabi/try/c/clang_-march=native_-O_-fwrapv_-Qunused-arguments_-fPIC_-fPIE_-gdwarf-4_-Wall/timingleaks/crypto_stream/dragon/e/submissions/dragon/work/./e/dragon.c:315: undefined reference to `U32TO32_BIG'
try.c: /usr/bin/ld: .../supercop-data/berry0/armeabi/try/c/clang_-march=native_-O_-fwrapv_-Qunused-arguments_-fPIC_-fPIE_-gdwarf-4_-Wall/timingleaks/crypto_stream/dragon/e/submissions/dragon/work/./e/dragon.c:316: undefined reference to `U32TO32_BIG'
try.c: clang: error: linker command failed with exit code 1 (use -v to see invocation)

Number of similar (implementation,compiler) pairs: 1, namely:
ImplementationCompiler
T:e/submissions/dragonclang -march=native -O -fwrapv -Qunused-arguments -fPIC -fPIE -gdwarf-4 -Wall (Raspbian_Clang_11.0.1)

Compiler output


dragon.c: In file included from dragon.c:1:
dragon.c: ./e/dragon.c:284:22: warning: implicit declaration of function 'U32TO32_BIG' is invalid in C99 [-Wimplicit-function-declaration]
dragon.c:         *(k_ptr++) = U32TO32_BIG(a);
dragon.c:                      ^
dragon.c: ./e/dragon.c:315:20: warning: implicit declaration of function 'U32TO32_BIG' is invalid in C99 [-Wimplicit-function-declaration]
dragon.c:         *(out++) = U32TO32_BIG(a) ^ *(in++);
dragon.c:                    ^
dragon.c: 2 warnings generated.
try.c: /usr/bin/ld: libcrypto_stream_dragon.a(dragon.o): in function `crypto_stream_dragon_e_submissions_dragon_timingleaks_ECRYPT_keystream_blocks':
try.c: .../supercop-data/berry0/armeabi/try/c/clang_-march=native_-Os_-fwrapv_-Qunused-arguments_-fPIC_-fPIE_-gdwarf-4_-Wall/timingleaks/crypto_stream/dragon/e/submissions/dragon/work/./e/dragon.c:284: undefined reference to `U32TO32_BIG'
try.c: /usr/bin/ld: .../supercop-data/berry0/armeabi/try/c/clang_-march=native_-Os_-fwrapv_-Qunused-arguments_-fPIC_-fPIE_-gdwarf-4_-Wall/timingleaks/crypto_stream/dragon/e/submissions/dragon/work/./e/dragon.c:285: undefined reference to `U32TO32_BIG'
try.c: /usr/bin/ld: libcrypto_stream_dragon.a(dragon.o): in function `crypto_stream_dragon_e_submissions_dragon_timingleaks_ECRYPT_process_blocks':
try.c: .../supercop-data/berry0/armeabi/try/c/clang_-march=native_-Os_-fwrapv_-Qunused-arguments_-fPIC_-fPIE_-gdwarf-4_-Wall/timingleaks/crypto_stream/dragon/e/submissions/dragon/work/./e/dragon.c:315: undefined reference to `U32TO32_BIG'
try.c: /usr/bin/ld: .../supercop-data/berry0/armeabi/try/c/clang_-march=native_-Os_-fwrapv_-Qunused-arguments_-fPIC_-fPIE_-gdwarf-4_-Wall/timingleaks/crypto_stream/dragon/e/submissions/dragon/work/./e/dragon.c:316: undefined reference to `U32TO32_BIG'
try.c: clang: error: linker command failed with exit code 1 (use -v to see invocation)

Number of similar (implementation,compiler) pairs: 1, namely:
ImplementationCompiler
T:e/submissions/dragonclang -march=native -Os -fwrapv -Qunused-arguments -fPIC -fPIE -gdwarf-4 -Wall (Raspbian_Clang_11.0.1)

Compiler output


dragon.c: In file included from dragon.c:1:
dragon.c: ./e/dragon.c:284:22: warning: implicit declaration of function 'U32TO32_BIG' is invalid in C99 [-Wimplicit-function-declaration]
dragon.c:         *(k_ptr++) = U32TO32_BIG(a);
dragon.c:                      ^
dragon.c: ./e/dragon.c:315:20: warning: implicit declaration of function 'U32TO32_BIG' is invalid in C99 [-Wimplicit-function-declaration]
dragon.c:         *(out++) = U32TO32_BIG(a) ^ *(in++);
dragon.c:                    ^
dragon.c: 2 warnings generated.
try.c: /usr/bin/ld: libcrypto_stream_dragon.a(dragon.o): in function `crypto_stream_dragon_e_submissions_dragon_timingleaks_ECRYPT_keystream_blocks':
try.c: .../supercop-data/berry0/armeabi/try/c/clang_-mcpu=native_-O3_-fwrapv_-Qunused-arguments_-fPIC_-fPIE_-gdwarf-4_-Wall/timingleaks/crypto_stream/dragon/e/submissions/dragon/work/./e/dragon.c:284: undefined reference to `U32TO32_BIG'
try.c: /usr/bin/ld: .../supercop-data/berry0/armeabi/try/c/clang_-mcpu=native_-O3_-fwrapv_-Qunused-arguments_-fPIC_-fPIE_-gdwarf-4_-Wall/timingleaks/crypto_stream/dragon/e/submissions/dragon/work/./e/dragon.c:285: undefined reference to `U32TO32_BIG'
try.c: /usr/bin/ld: libcrypto_stream_dragon.a(dragon.o): in function `crypto_stream_dragon_e_submissions_dragon_timingleaks_ECRYPT_process_blocks':
try.c: .../supercop-data/berry0/armeabi/try/c/clang_-mcpu=native_-O3_-fwrapv_-Qunused-arguments_-fPIC_-fPIE_-gdwarf-4_-Wall/timingleaks/crypto_stream/dragon/e/submissions/dragon/work/./e/dragon.c:315: undefined reference to `U32TO32_BIG'
try.c: /usr/bin/ld: .../supercop-data/berry0/armeabi/try/c/clang_-mcpu=native_-O3_-fwrapv_-Qunused-arguments_-fPIC_-fPIE_-gdwarf-4_-Wall/timingleaks/crypto_stream/dragon/e/submissions/dragon/work/./e/dragon.c:316: undefined reference to `U32TO32_BIG'
try.c: clang: error: linker command failed with exit code 1 (use -v to see invocation)

Number of similar (implementation,compiler) pairs: 1, namely:
ImplementationCompiler
T:e/submissions/dragonclang -mcpu=native -O3 -fwrapv -Qunused-arguments -fPIC -fPIE -gdwarf-4 -Wall (Raspbian_Clang_11.0.1)

Compiler output


dragon.c: In file included from dragon.c:1:
dragon.c: e/dragon.c: In function 'crypto_stream_dragon_e_submissions_dragon_timingleaks_ECRYPT_keystream_blocks':
dragon.c: e/dragon.c:284:22: warning: implicit declaration of function 'U32TO32_BIG'; did you mean 'U8TO32_BIG'? [-Wimplicit-function-declaration]
dragon.c:   284 |         *(k_ptr++) = U32TO32_BIG(a);
dragon.c:       |                      ^~~~~~~~~~~
dragon.c:       |                      U8TO32_BIG
try.c: /usr/bin/ld: libcrypto_stream_dragon.a(dragon.o): in function `crypto_stream_dragon_e_submissions_dragon_timingleaks_ECRYPT_keystream_blocks':
try.c: .../supercop-data/berry0/armeabi/try/c/gcc_-march=native_-mtune=native_-O2_-fwrapv_-fPIC_-fPIE_-gdwarf-4_-Wall/timingleaks/crypto_stream/dragon/e/submissions/dragon/work/e/dragon.c:284: undefined reference to `U32TO32_BIG'
try.c: /usr/bin/ld: .../supercop-data/berry0/armeabi/try/c/gcc_-march=native_-mtune=native_-O2_-fwrapv_-fPIC_-fPIE_-gdwarf-4_-Wall/timingleaks/crypto_stream/dragon/e/submissions/dragon/work/e/dragon.c:285: undefined reference to `U32TO32_BIG'
try.c: /usr/bin/ld: libcrypto_stream_dragon.a(dragon.o): in function `crypto_stream_dragon_e_submissions_dragon_timingleaks_ECRYPT_process_blocks':
try.c: .../supercop-data/berry0/armeabi/try/c/gcc_-march=native_-mtune=native_-O2_-fwrapv_-fPIC_-fPIE_-gdwarf-4_-Wall/timingleaks/crypto_stream/dragon/e/submissions/dragon/work/e/dragon.c:315: undefined reference to `U32TO32_BIG'
try.c: /usr/bin/ld: .../supercop-data/berry0/armeabi/try/c/gcc_-march=native_-mtune=native_-O2_-fwrapv_-fPIC_-fPIE_-gdwarf-4_-Wall/timingleaks/crypto_stream/dragon/e/submissions/dragon/work/e/dragon.c:316: undefined reference to `U32TO32_BIG'
try.c: collect2: error: ld returned 1 exit status

Number of similar (implementation,compiler) pairs: 1, namely:
ImplementationCompiler
T:e/submissions/dragongcc -march=native -mtune=native -O2 -fwrapv -fPIC -fPIE -gdwarf-4 -Wall (10.2.1_20210110)

Compiler output


dragon.c: In file included from dragon.c:1:
dragon.c: e/dragon.c: In function 'crypto_stream_dragon_e_submissions_dragon_timingleaks_ECRYPT_keystream_blocks':
dragon.c: e/dragon.c:284:22: warning: implicit declaration of function 'U32TO32_BIG'; did you mean 'U8TO32_BIG'? [-Wimplicit-function-declaration]
dragon.c:   284 |         *(k_ptr++) = U32TO32_BIG(a);
dragon.c:       |                      ^~~~~~~~~~~
dragon.c:       |                      U8TO32_BIG
try.c: /usr/bin/ld: libcrypto_stream_dragon.a(dragon.o): in function `crypto_stream_dragon_e_submissions_dragon_timingleaks_ECRYPT_keystream_blocks':
try.c: .../supercop-data/berry0/armeabi/try/c/gcc_-march=native_-mtune=native_-O3_-fwrapv_-fPIC_-fPIE_-gdwarf-4_-Wall/timingleaks/crypto_stream/dragon/e/submissions/dragon/work/e/dragon.c:284: undefined reference to `U32TO32_BIG'
try.c: /usr/bin/ld: .../supercop-data/berry0/armeabi/try/c/gcc_-march=native_-mtune=native_-O3_-fwrapv_-fPIC_-fPIE_-gdwarf-4_-Wall/timingleaks/crypto_stream/dragon/e/submissions/dragon/work/e/dragon.c:285: undefined reference to `U32TO32_BIG'
try.c: /usr/bin/ld: libcrypto_stream_dragon.a(dragon.o): in function `crypto_stream_dragon_e_submissions_dragon_timingleaks_ECRYPT_process_blocks':
try.c: .../supercop-data/berry0/armeabi/try/c/gcc_-march=native_-mtune=native_-O3_-fwrapv_-fPIC_-fPIE_-gdwarf-4_-Wall/timingleaks/crypto_stream/dragon/e/submissions/dragon/work/e/dragon.c:315: undefined reference to `U32TO32_BIG'
try.c: /usr/bin/ld: .../supercop-data/berry0/armeabi/try/c/gcc_-march=native_-mtune=native_-O3_-fwrapv_-fPIC_-fPIE_-gdwarf-4_-Wall/timingleaks/crypto_stream/dragon/e/submissions/dragon/work/e/dragon.c:316: undefined reference to `U32TO32_BIG'
try.c: /usr/bin/ld: libcrypto_stream_dragon.a(dragon.o): in function `crypto_stream_dragon_e_submissions_dragon_timingleaks_ECRYPT_keystream_blocks':
try.c: .../supercop-data/berry0/armeabi/try/c/gcc_-march=native_-mtune=native_-O3_-fwrapv_-fPIC_-fPIE_-gdwarf-4_-Wall/timingleaks/crypto_stream/dragon/e/submissions/dragon/work/e/dragon.c:284: undefined reference to `U32TO32_BIG'
try.c: /usr/bin/ld: libcrypto_stream_dragon.a(dragon.o):.../supercop-data/berry0/armeabi/try/c/gcc_-march=native_-mtune=native_-O3_-fwrapv_-fPIC_-fPIE_-gdwarf-4_-Wall/timingleaks/crypto_stream/dragon/e/submissions/dragon/work/e/dragon.c:285: more undefined references to `U32TO32_BIG' follow
try.c: collect2: error: ld returned 1 exit status

Number of similar (implementation,compiler) pairs: 1, namely:
ImplementationCompiler
T:e/submissions/dragongcc -march=native -mtune=native -O3 -fwrapv -fPIC -fPIE -gdwarf-4 -Wall (10.2.1_20210110)

Compiler output


dragon.c: In file included from dragon.c:1:
dragon.c: e/dragon.c: In function 'crypto_stream_dragon_e_submissions_dragon_timingleaks_ECRYPT_keystream_blocks':
dragon.c: e/dragon.c:284:22: warning: implicit declaration of function 'U32TO32_BIG'; did you mean 'U8TO32_BIG'? [-Wimplicit-function-declaration]
dragon.c:   284 |         *(k_ptr++) = U32TO32_BIG(a);
dragon.c:       |                      ^~~~~~~~~~~
dragon.c:       |                      U8TO32_BIG
try.c: /usr/bin/ld: libcrypto_stream_dragon.a(dragon.o): in function `crypto_stream_dragon_e_submissions_dragon_timingleaks_ECRYPT_keystream_blocks':
try.c: .../supercop-data/berry0/armeabi/try/c/gcc_-march=native_-mtune=native_-O_-fwrapv_-fPIC_-fPIE_-gdwarf-4_-Wall/timingleaks/crypto_stream/dragon/e/submissions/dragon/work/e/dragon.c:284: undefined reference to `U32TO32_BIG'
try.c: /usr/bin/ld: .../supercop-data/berry0/armeabi/try/c/gcc_-march=native_-mtune=native_-O_-fwrapv_-fPIC_-fPIE_-gdwarf-4_-Wall/timingleaks/crypto_stream/dragon/e/submissions/dragon/work/e/dragon.c:285: undefined reference to `U32TO32_BIG'
try.c: /usr/bin/ld: libcrypto_stream_dragon.a(dragon.o): in function `crypto_stream_dragon_e_submissions_dragon_timingleaks_ECRYPT_process_blocks':
try.c: .../supercop-data/berry0/armeabi/try/c/gcc_-march=native_-mtune=native_-O_-fwrapv_-fPIC_-fPIE_-gdwarf-4_-Wall/timingleaks/crypto_stream/dragon/e/submissions/dragon/work/e/dragon.c:315: undefined reference to `U32TO32_BIG'
try.c: /usr/bin/ld: .../supercop-data/berry0/armeabi/try/c/gcc_-march=native_-mtune=native_-O_-fwrapv_-fPIC_-fPIE_-gdwarf-4_-Wall/timingleaks/crypto_stream/dragon/e/submissions/dragon/work/e/dragon.c:316: undefined reference to `U32TO32_BIG'
try.c: collect2: error: ld returned 1 exit status

Number of similar (implementation,compiler) pairs: 1, namely:
ImplementationCompiler
T:e/submissions/dragongcc -march=native -mtune=native -O -fwrapv -fPIC -fPIE -gdwarf-4 -Wall (10.2.1_20210110)

Compiler output


dragon.c: In file included from dragon.c:1:
dragon.c: e/dragon.c: In function 'crypto_stream_dragon_e_submissions_dragon_timingleaks_ECRYPT_keystream_blocks':
dragon.c: e/dragon.c:284:22: warning: implicit declaration of function 'U32TO32_BIG'; did you mean 'U8TO32_BIG'? [-Wimplicit-function-declaration]
dragon.c:   284 |         *(k_ptr++) = U32TO32_BIG(a);
dragon.c:       |                      ^~~~~~~~~~~
dragon.c:       |                      U8TO32_BIG
try.c: /usr/bin/ld: libcrypto_stream_dragon.a(dragon.o): in function `crypto_stream_dragon_e_submissions_dragon_timingleaks_ECRYPT_keystream_blocks':
try.c: .../supercop-data/berry0/armeabi/try/c/gcc_-march=native_-mtune=native_-Os_-fwrapv_-fPIC_-fPIE_-gdwarf-4_-Wall/timingleaks/crypto_stream/dragon/e/submissions/dragon/work/e/dragon.c:284: undefined reference to `U32TO32_BIG'
try.c: /usr/bin/ld: .../supercop-data/berry0/armeabi/try/c/gcc_-march=native_-mtune=native_-Os_-fwrapv_-fPIC_-fPIE_-gdwarf-4_-Wall/timingleaks/crypto_stream/dragon/e/submissions/dragon/work/e/dragon.c:285: undefined reference to `U32TO32_BIG'
try.c: /usr/bin/ld: libcrypto_stream_dragon.a(dragon.o): in function `crypto_stream_dragon_e_submissions_dragon_timingleaks_ECRYPT_process_blocks':
try.c: .../supercop-data/berry0/armeabi/try/c/gcc_-march=native_-mtune=native_-Os_-fwrapv_-fPIC_-fPIE_-gdwarf-4_-Wall/timingleaks/crypto_stream/dragon/e/submissions/dragon/work/e/dragon.c:315: undefined reference to `U32TO32_BIG'
try.c: /usr/bin/ld: .../supercop-data/berry0/armeabi/try/c/gcc_-march=native_-mtune=native_-Os_-fwrapv_-fPIC_-fPIE_-gdwarf-4_-Wall/timingleaks/crypto_stream/dragon/e/submissions/dragon/work/e/dragon.c:316: undefined reference to `U32TO32_BIG'
try.c: collect2: error: ld returned 1 exit status

Number of similar (implementation,compiler) pairs: 1, namely:
ImplementationCompiler
T:e/submissions/dragongcc -march=native -mtune=native -Os -fwrapv -fPIC -fPIE -gdwarf-4 -Wall (10.2.1_20210110)