Test results for amd64, wolfdale, crypto_kem/ntruhps4096821

[Page version: 20250403 07:18:08]

Measurements for amd64, wolfdale, crypto_kem Test results for amd64, wolfdale, crypto_kem Test results for crypto_kem/ntruhps4096821
Computer: wolfdale
Microarchitecture: amd64; Core 2 45nm (1067a)
Architecture: amd64
CPU ID: GenuineIntel-0001067a-bfebfbff
SUPERCOP version: 20250307
Operation: crypto_kem
Primitive: ntruhps4096821
TimeObject sizeTest sizeImplementationCompilerBenchmark dateSUPERCOP version
393782323158 0 0121784 820 1720compactclang -march=native -O2 -fwrapv -Qunused-arguments -fPIC -fPIE -gdwarf-4 -Wall2025032820250307
395269832788 0 0132216 820 1720compactclang -march=native -O3 -fwrapv -Qunused-arguments -fPIC -fPIE -gdwarf-4 -Wall2025032820250307
399729832788 0 0125064 820 1720T:compactclang -march=native -O3 -fwrapv -Qunused-arguments -fPIC -fPIE -gdwarf-4 -Wall2025032820250307
414109823158 0 0114632 820 1720T:compactclang -march=native -O2 -fwrapv -Qunused-arguments -fPIC -fPIE -gdwarf-4 -Wall2025032820250307
448939030333 0 0122392 820 1720T:compactclang -mcpu=native -O3 -fwrapv -Qunused-arguments -fPIC -fPIE -gdwarf-4 -Wall2025032820250307
452873630333 0 0129544 820 1720compactclang -mcpu=native -O3 -fwrapv -Qunused-arguments -fPIC -fPIE -gdwarf-4 -Wall2025032820250307
138303265590 0 095006 812 1720T:refclang -march=native -Os -fwrapv -Qunused-arguments -fPIC -fPIE -gdwarf-4 -Wall2025032820250307
1386616312567 0 0104144 820 1720T:refclang -march=native -O2 -fwrapv -Qunused-arguments -fPIC -fPIE -gdwarf-4 -Wall2025032820250307
1387489817831 0 0110240 820 1720T:refclang -march=native -O3 -fwrapv -Qunused-arguments -fPIC -fPIE -gdwarf-4 -Wall2025032820250307
138878345590 0 0102158 812 1720refclang -march=native -Os -fwrapv -Qunused-arguments -fPIC -fPIE -gdwarf-4 -Wall2025032820250307
1392306212567 0 0111296 820 1720refclang -march=native -O2 -fwrapv -Qunused-arguments -fPIC -fPIE -gdwarf-4 -Wall2025032820250307
1392501117831 0 0117392 820 1720refclang -march=native -O3 -fwrapv -Qunused-arguments -fPIC -fPIE -gdwarf-4 -Wall2025032820250307
1424138817706 0 0109840 820 1720T:refclang -mcpu=native -O3 -fwrapv -Qunused-arguments -fPIC -fPIE -gdwarf-4 -Wall2025032820250307
1431597117706 0 0116992 820 1720refclang -mcpu=native -O3 -fwrapv -Qunused-arguments -fPIC -fPIE -gdwarf-4 -Wall2025032820250307
144076714740 0 094254 812 1720T:compactclang -march=native -Os -fwrapv -Qunused-arguments -fPIC -fPIE -gdwarf-4 -Wall2025032820250307
144528944740 0 0101406 812 1720compactclang -march=native -Os -fwrapv -Qunused-arguments -fPIC -fPIE -gdwarf-4 -Wall2025032820250307
167760476604 0 096710 812 1720T:refclang -march=native -O -fwrapv -Qunused-arguments -fPIC -fPIE -gdwarf-4 -Wall2025032820250307
168179386604 0 0103814 812 1720refclang -march=native -O -fwrapv -Qunused-arguments -fPIC -fPIE -gdwarf-4 -Wall2025032820250307
177776646304 0 096582 812 1720T:compactclang -march=native -O -fwrapv -Qunused-arguments -fPIC -fPIE -gdwarf-4 -Wall2025032820250307
178211986304 0 0103686 812 1720compactclang -march=native -O -fwrapv -Qunused-arguments -fPIC -fPIE -gdwarf-4 -Wall2025032820250307

Compiler output


poly_s3_inv.c: poly_s3_inv.c:418:11: error: always_inline function '_mm256_set_epi32' requires target feature 'avx', but would be inlined into function '__poly_S3_inv' that is compiled without support for 'avx'
poly_s3_inv.c:   F0[0] = _mm256_set_epi32(-1,-1,-1,-1,-1,-1,-1,-1);
poly_s3_inv.c:           ^
poly_s3_inv.c: poly_s3_inv.c:418:11: error: AVX vector return of type '__m256i' (vector of 4 'long long' values) without 'avx' enabled changes the ABI
poly_s3_inv.c: poly_s3_inv.c:419:11: error: always_inline function '_mm256_set_epi32' requires target feature 'avx', but would be inlined into function '__poly_S3_inv' that is compiled without support for 'avx'
poly_s3_inv.c:   F0[1] = _mm256_set_epi32(-1,-1,-1,-1,-1,-1,-1,-1);
poly_s3_inv.c:           ^
poly_s3_inv.c: poly_s3_inv.c:419:11: error: AVX vector return of type '__m256i' (vector of 4 'long long' values) without 'avx' enabled changes the ABI
poly_s3_inv.c: poly_s3_inv.c:420:11: error: always_inline function '_mm256_set_epi32' requires target feature 'avx', but would be inlined into function '__poly_S3_inv' that is compiled without support for 'avx'
poly_s3_inv.c:   F0[2] = _mm256_set_epi32(-1,-1,-1,-1,-1,-1,-1,-1);
poly_s3_inv.c:           ^
poly_s3_inv.c: poly_s3_inv.c:420:11: error: AVX vector return of type '__m256i' (vector of 4 'long long' values) without 'avx' enabled changes the ABI
poly_s3_inv.c: poly_s3_inv.c:421:11: error: always_inline function '_mm256_set_epi32' requires target feature 'avx', but would be inlined into function '__poly_S3_inv' that is compiled without support for 'avx'
poly_s3_inv.c:   F0[3] = _mm256_set_epi32(0,8191,0,8191,0,8191,0,16383);
poly_s3_inv.c:           ^
poly_s3_inv.c: poly_s3_inv.c:421:11: error: AVX vector return of type '__m256i' (vector of 4 'long long' values) without 'avx' enabled changes the ABI
poly_s3_inv.c: poly_s3_inv.c:422:11: error: always_inline function '_mm256_set1_epi32' requires target feature 'avx', but would be inlined into function '__poly_S3_inv' that is compiled without support for 'avx'
poly_s3_inv.c:   F1[0] = _mm256_set1_epi32(0);
poly_s3_inv.c:           ^
poly_s3_inv.c: poly_s3_inv.c:422:11: error: AVX vector return of type '__m256i' (vector of 4 'long long' values) without 'avx' enabled changes the ABI
poly_s3_inv.c: poly_s3_inv.c:423:11: error: always_inline function '_mm256_set1_epi32' requires target feature 'avx', but would be inlined into function '__poly_S3_inv' that is compiled without support for 'avx'
poly_s3_inv.c:   F1[1] = _mm256_set1_epi32(0);
poly_s3_inv.c:           ^
poly_s3_inv.c: poly_s3_inv.c:423:11: error: AVX vector return of type '__m256i' (vector of 4 'long long' values) without 'avx' enabled changes the ABI
poly_s3_inv.c: poly_s3_inv.c:424:11: error: always_inline function '_mm256_set1_epi32' requires target feature 'avx', but would be inlined into function '__poly_S3_inv' that is compiled without support for 'avx'
poly_s3_inv.c: ...

Number of similar (implementation,compiler) pairs: 10, namely:
ImplementationCompiler
avx2clang -march=native -O2 -fwrapv -Qunused-arguments -fPIC -fPIE -gdwarf-4 -Wall (Debian_Clang_11.0.1)
T:avx2clang -march=native -O2 -fwrapv -Qunused-arguments -fPIC -fPIE -gdwarf-4 -Wall (Debian_Clang_11.0.1)
avx2clang -march=native -O3 -fwrapv -Qunused-arguments -fPIC -fPIE -gdwarf-4 -Wall (Debian_Clang_11.0.1)
T:avx2clang -march=native -O3 -fwrapv -Qunused-arguments -fPIC -fPIE -gdwarf-4 -Wall (Debian_Clang_11.0.1)
avx2clang -march=native -O -fwrapv -Qunused-arguments -fPIC -fPIE -gdwarf-4 -Wall (Debian_Clang_11.0.1)
T:avx2clang -march=native -O -fwrapv -Qunused-arguments -fPIC -fPIE -gdwarf-4 -Wall (Debian_Clang_11.0.1)
avx2clang -march=native -Os -fwrapv -Qunused-arguments -fPIC -fPIE -gdwarf-4 -Wall (Debian_Clang_11.0.1)
T:avx2clang -march=native -Os -fwrapv -Qunused-arguments -fPIC -fPIE -gdwarf-4 -Wall (Debian_Clang_11.0.1)
avx2clang -mcpu=native -O3 -fwrapv -Qunused-arguments -fPIC -fPIE -gdwarf-4 -Wall (Debian_Clang_11.0.1)
T:avx2clang -mcpu=native -O3 -fwrapv -Qunused-arguments -fPIC -fPIE -gdwarf-4 -Wall (Debian_Clang_11.0.1)

Compiler output


poly_s3_inv.c: poly_s3_inv.c: In function '__poly_S3_inv':
poly_s3_inv.c: poly_s3_inv.c:418:9: warning: AVX vector return without AVX enabled changes the ABI [-Wpsabi]
poly_s3_inv.c:   418 |   F0[0] = _mm256_set_epi32(-1,-1,-1,-1,-1,-1,-1,-1);
poly_s3_inv.c:       |   ~~~~~~^~~~~~~~~~~~~~~~~~~~~~~~~~~~~~~~~~~~~~~~~~~
poly_s3_inv.c: poly_s3_inv.c: In function 'vec256_swap':
poly_s3_inv.c: poly_s3_inv.c:178:20: note: the ABI for passing parameters with 32-byte alignment has changed in GCC 4.6
poly_s3_inv.c:   178 | static inline void vec256_swap(vec256 *f,vec256 *g,int len,vec256 mask)
poly_s3_inv.c:       |                    ^~~~~~~~~~~
poly_s3_inv.c: In file included from /usr/lib/gcc/x86_64-linux-gnu/10/include/immintrin.h:53,
poly_s3_inv.c:                  from poly.h:4,
poly_s3_inv.c:                  from poly_s3_inv.c:2:
poly_s3_inv.c: poly_s3_inv.c: In function 'vec256_frombits':
poly_s3_inv.c: /usr/lib/gcc/x86_64-linux-gnu/10/include/avx2intrin.h:597:1: error: inlining failed in call to 'always_inline' '_mm256_shuffle_epi32': target specific option mismatch
poly_s3_inv.c:   597 | _mm256_shuffle_epi32 (__m256i __A, const int __mask)
poly_s3_inv.c:       | ^~~~~~~~~~~~~~~~~~~~
poly_s3_inv.c: poly_s3_inv.c:69:9: note: called from here
poly_s3_inv.c:    69 |     h = _mm256_shuffle_epi32(h,0xd8);
poly_s3_inv.c:       |         ^~~~~~~~~~~~~~~~~~~~~~~~~~~~
poly_s3_inv.c: In file included from /usr/lib/gcc/x86_64-linux-gnu/10/include/immintrin.h:53,
poly_s3_inv.c:                  from poly.h:4,
poly_s3_inv.c:                  from poly_s3_inv.c:2:
poly_s3_inv.c: /usr/lib/gcc/x86_64-linux-gnu/10/include/avx2intrin.h:1068:1: error: inlining failed in call to 'always_inline' '_mm256_permute4x64_epi64': target specific option mismatch
poly_s3_inv.c:  1068 | _mm256_permute4x64_epi64 (__m256i __X, const int __M)
poly_s3_inv.c:       | ^~~~~~~~~~~~~~~~~~~~~~~~
poly_s3_inv.c: poly_s3_inv.c:68:9: note: called from here
poly_s3_inv.c: ...

Number of similar (implementation,compiler) pairs: 8, namely:
ImplementationCompiler
avx2gcc -march=native -mtune=native -O2 -fwrapv -fPIC -fPIE -gdwarf-4 -Wall (10.2.1_20210110)
T:avx2gcc -march=native -mtune=native -O2 -fwrapv -fPIC -fPIE -gdwarf-4 -Wall (10.2.1_20210110)
avx2gcc -march=native -mtune=native -O3 -fwrapv -fPIC -fPIE -gdwarf-4 -Wall (10.2.1_20210110)
T:avx2gcc -march=native -mtune=native -O3 -fwrapv -fPIC -fPIE -gdwarf-4 -Wall (10.2.1_20210110)
avx2gcc -march=native -mtune=native -O -fwrapv -fPIC -fPIE -gdwarf-4 -Wall (10.2.1_20210110)
T:avx2gcc -march=native -mtune=native -O -fwrapv -fPIC -fPIE -gdwarf-4 -Wall (10.2.1_20210110)
avx2gcc -march=native -mtune=native -Os -fwrapv -fPIC -fPIE -gdwarf-4 -Wall (10.2.1_20210110)
T:avx2gcc -march=native -mtune=native -Os -fwrapv -fPIC -fPIE -gdwarf-4 -Wall (10.2.1_20210110)

Compiler output


try.c: /usr/bin/ld: .../supercop-data/wolfdale/amd64/lib/libsupercop.a(crypto_core_keccakf160064bits_optimized1600AsmX86_64_constbranchindex-KeccakP-1600-x86-64-gas.o): relocation R_X86_64_32S against `.text' can not be used when making a PIE object; recompile with -fPIE
try.c: collect2: error: ld returned 1 exit status

Number of similar (implementation,compiler) pairs: 16, namely:
ImplementationCompiler
compactgcc -march=native -mtune=native -O2 -fwrapv -fPIC -fPIE -gdwarf-4 -Wall (10.2.1_20210110)
T:compactgcc -march=native -mtune=native -O2 -fwrapv -fPIC -fPIE -gdwarf-4 -Wall (10.2.1_20210110)
compactgcc -march=native -mtune=native -O3 -fwrapv -fPIC -fPIE -gdwarf-4 -Wall (10.2.1_20210110)
T:compactgcc -march=native -mtune=native -O3 -fwrapv -fPIC -fPIE -gdwarf-4 -Wall (10.2.1_20210110)
compactgcc -march=native -mtune=native -O -fwrapv -fPIC -fPIE -gdwarf-4 -Wall (10.2.1_20210110)
T:compactgcc -march=native -mtune=native -O -fwrapv -fPIC -fPIE -gdwarf-4 -Wall (10.2.1_20210110)
compactgcc -march=native -mtune=native -Os -fwrapv -fPIC -fPIE -gdwarf-4 -Wall (10.2.1_20210110)
T:compactgcc -march=native -mtune=native -Os -fwrapv -fPIC -fPIE -gdwarf-4 -Wall (10.2.1_20210110)
refgcc -march=native -mtune=native -O2 -fwrapv -fPIC -fPIE -gdwarf-4 -Wall (10.2.1_20210110)
T:refgcc -march=native -mtune=native -O2 -fwrapv -fPIC -fPIE -gdwarf-4 -Wall (10.2.1_20210110)
refgcc -march=native -mtune=native -O3 -fwrapv -fPIC -fPIE -gdwarf-4 -Wall (10.2.1_20210110)
T:refgcc -march=native -mtune=native -O3 -fwrapv -fPIC -fPIE -gdwarf-4 -Wall (10.2.1_20210110)
refgcc -march=native -mtune=native -O -fwrapv -fPIC -fPIE -gdwarf-4 -Wall (10.2.1_20210110)
T:refgcc -march=native -mtune=native -O -fwrapv -fPIC -fPIE -gdwarf-4 -Wall (10.2.1_20210110)
refgcc -march=native -mtune=native -Os -fwrapv -fPIC -fPIE -gdwarf-4 -Wall (10.2.1_20210110)
T:refgcc -march=native -mtune=native -Os -fwrapv -fPIC -fPIE -gdwarf-4 -Wall (10.2.1_20210110)

Passed TIMECOP


TIMECOP iterations: 1

Number of similar (implementation,compiler) pairs: 10, namely:
ImplementationCompiler
compactclang -march=native -O2 -fwrapv -Qunused-arguments -fPIC -fPIE -gdwarf-4 -Wall (Debian_Clang_11.0.1)
compactclang -march=native -O3 -fwrapv -Qunused-arguments -fPIC -fPIE -gdwarf-4 -Wall (Debian_Clang_11.0.1)
compactclang -march=native -O -fwrapv -Qunused-arguments -fPIC -fPIE -gdwarf-4 -Wall (Debian_Clang_11.0.1)
compactclang -march=native -Os -fwrapv -Qunused-arguments -fPIC -fPIE -gdwarf-4 -Wall (Debian_Clang_11.0.1)
compactclang -mcpu=native -O3 -fwrapv -Qunused-arguments -fPIC -fPIE -gdwarf-4 -Wall (Debian_Clang_11.0.1)
refclang -march=native -O2 -fwrapv -Qunused-arguments -fPIC -fPIE -gdwarf-4 -Wall (Debian_Clang_11.0.1)
refclang -march=native -O3 -fwrapv -Qunused-arguments -fPIC -fPIE -gdwarf-4 -Wall (Debian_Clang_11.0.1)
refclang -march=native -O -fwrapv -Qunused-arguments -fPIC -fPIE -gdwarf-4 -Wall (Debian_Clang_11.0.1)
refclang -march=native -Os -fwrapv -Qunused-arguments -fPIC -fPIE -gdwarf-4 -Wall (Debian_Clang_11.0.1)
refclang -mcpu=native -O3 -fwrapv -Qunused-arguments -fPIC -fPIE -gdwarf-4 -Wall (Debian_Clang_11.0.1)