Test results for amd64, wolfdale, crypto_kem/ntruhps2048677
[Page version: 20250403 07:18:08]
Measurements for amd64, wolfdale, crypto_kem
Test results for amd64, wolfdale, crypto_kem
Test results for crypto_kem/ntruhps2048677
Computer: wolfdale
Microarchitecture: amd64; Core 2 45nm (1067a)
Architecture: amd64
CPU ID: GenuineIntel-0001067a-bfebfbff
SUPERCOP version: 20250307
Operation: crypto_kem
Primitive: ntruhps2048677
Time | Object size | Test size | Implementation | Compiler | Benchmark date | SUPERCOP version |
2711605 | 35402 0 0 | 127672 820 1720 | T:compact | clang -march=native -O3 -fwrapv -Qunused-arguments -fPIC -fPIE -gdwarf-4 -Wall | 20250328 | 20250307 |
2727211 | 25402 0 0 | 116856 820 1720 | T:compact | clang -march=native -O2 -fwrapv -Qunused-arguments -fPIC -fPIE -gdwarf-4 -Wall | 20250328 | 20250307 |
2757562 | 25402 0 0 | 124008 820 1720 | compact | clang -march=native -O2 -fwrapv -Qunused-arguments -fPIC -fPIE -gdwarf-4 -Wall | 20250328 | 20250307 |
2942483 | 33072 0 0 | 125128 820 1720 | T:compact | clang -mcpu=native -O3 -fwrapv -Qunused-arguments -fPIC -fPIE -gdwarf-4 -Wall | 20250328 | 20250307 |
3039129 | 35402 0 0 | 134824 820 1720 | compact | clang -march=native -O3 -fwrapv -Qunused-arguments -fPIC -fPIE -gdwarf-4 -Wall | 20250328 | 20250307 |
3338465 | 33072 0 0 | 132280 820 1720 | compact | clang -mcpu=native -O3 -fwrapv -Qunused-arguments -fPIC -fPIE -gdwarf-4 -Wall | 20250328 | 20250307 |
9446513 | 6162 0 0 | 95550 812 1720 | T:ref | clang -march=native -Os -fwrapv -Qunused-arguments -fPIC -fPIE -gdwarf-4 -Wall | 20250328 | 20250307 |
9476434 | 22283 0 0 | 114696 820 1720 | T:ref | clang -march=native -O3 -fwrapv -Qunused-arguments -fPIC -fPIE -gdwarf-4 -Wall | 20250328 | 20250307 |
9490405 | 14851 0 0 | 106424 820 1720 | T:ref | clang -march=native -O2 -fwrapv -Qunused-arguments -fPIC -fPIE -gdwarf-4 -Wall | 20250328 | 20250307 |
9511368 | 6162 0 0 | 102702 812 1720 | ref | clang -march=native -Os -fwrapv -Qunused-arguments -fPIC -fPIE -gdwarf-4 -Wall | 20250328 | 20250307 |
9530200 | 22283 0 0 | 121848 820 1720 | ref | clang -march=native -O3 -fwrapv -Qunused-arguments -fPIC -fPIE -gdwarf-4 -Wall | 20250328 | 20250307 |
9548821 | 14851 0 0 | 113576 820 1720 | ref | clang -march=native -O2 -fwrapv -Qunused-arguments -fPIC -fPIE -gdwarf-4 -Wall | 20250328 | 20250307 |
9733541 | 22213 0 0 | 114360 820 1720 | T:ref | clang -mcpu=native -O3 -fwrapv -Qunused-arguments -fPIC -fPIE -gdwarf-4 -Wall | 20250328 | 20250307 |
9795256 | 22213 0 0 | 121512 820 1720 | ref | clang -mcpu=native -O3 -fwrapv -Qunused-arguments -fPIC -fPIE -gdwarf-4 -Wall | 20250328 | 20250307 |
9904641 | 4867 0 0 | 94382 812 1720 | T:compact | clang -march=native -Os -fwrapv -Qunused-arguments -fPIC -fPIE -gdwarf-4 -Wall | 20250328 | 20250307 |
9951203 | 4867 0 0 | 101534 812 1720 | compact | clang -march=native -Os -fwrapv -Qunused-arguments -fPIC -fPIE -gdwarf-4 -Wall | 20250328 | 20250307 |
11445385 | 7130 0 0 | 97222 812 1720 | T:ref | clang -march=native -O -fwrapv -Qunused-arguments -fPIC -fPIE -gdwarf-4 -Wall | 20250328 | 20250307 |
11499720 | 7130 0 0 | 104390 812 1720 | ref | clang -march=native -O -fwrapv -Qunused-arguments -fPIC -fPIE -gdwarf-4 -Wall | 20250328 | 20250307 |
12244235 | 6272 0 0 | 96518 812 1720 | T:compact | clang -march=native -O -fwrapv -Qunused-arguments -fPIC -fPIE -gdwarf-4 -Wall | 20250328 | 20250307 |
12278671 | 6272 0 0 | 103686 812 1720 | compact | clang -march=native -O -fwrapv -Qunused-arguments -fPIC -fPIE -gdwarf-4 -Wall | 20250328 | 20250307 |
Compiler output
poly_s3_inv.c: poly_s3_inv.c:362:11: error: always_inline function '_mm256_set_epi32' requires target feature 'avx', but would be inlined into function '__poly_S3_inv' that is compiled without support for 'avx'
poly_s3_inv.c: F0[0] = _mm256_set_epi32(-1,-1,-1,-1,-1,-1,-1,-1);
poly_s3_inv.c: ^
poly_s3_inv.c: poly_s3_inv.c:362:11: error: AVX vector return of type '__m256i' (vector of 4 'long long' values) without 'avx' enabled changes the ABI
poly_s3_inv.c: poly_s3_inv.c:363:11: error: always_inline function '_mm256_set_epi32' requires target feature 'avx', but would be inlined into function '__poly_S3_inv' that is compiled without support for 'avx'
poly_s3_inv.c: F0[1] = _mm256_set_epi32(-1,-1,-1,-1,-1,-1,-1,-1);
poly_s3_inv.c: ^
poly_s3_inv.c: poly_s3_inv.c:363:11: error: AVX vector return of type '__m256i' (vector of 4 'long long' values) without 'avx' enabled changes the ABI
poly_s3_inv.c: poly_s3_inv.c:364:11: error: always_inline function '_mm256_set_epi32' requires target feature 'avx', but would be inlined into function '__poly_S3_inv' that is compiled without support for 'avx'
poly_s3_inv.c: F0[2] = _mm256_set_epi32(511,-1,511,-1,511,-1,1023,-1);
poly_s3_inv.c: ^
poly_s3_inv.c: poly_s3_inv.c:364:11: error: AVX vector return of type '__m256i' (vector of 4 'long long' values) without 'avx' enabled changes the ABI
poly_s3_inv.c: poly_s3_inv.c:365:11: error: always_inline function '_mm256_set1_epi32' requires target feature 'avx', but would be inlined into function '__poly_S3_inv' that is compiled without support for 'avx'
poly_s3_inv.c: F1[0] = _mm256_set1_epi32(0);
poly_s3_inv.c: ^
poly_s3_inv.c: poly_s3_inv.c:365:11: error: AVX vector return of type '__m256i' (vector of 4 'long long' values) without 'avx' enabled changes the ABI
poly_s3_inv.c: poly_s3_inv.c:366:11: error: always_inline function '_mm256_set1_epi32' requires target feature 'avx', but would be inlined into function '__poly_S3_inv' that is compiled without support for 'avx'
poly_s3_inv.c: F1[1] = _mm256_set1_epi32(0);
poly_s3_inv.c: ^
poly_s3_inv.c: poly_s3_inv.c:366:11: error: AVX vector return of type '__m256i' (vector of 4 'long long' values) without 'avx' enabled changes the ABI
poly_s3_inv.c: poly_s3_inv.c:367:11: error: always_inline function '_mm256_set1_epi32' requires target feature 'avx', but would be inlined into function '__poly_S3_inv' that is compiled without support for 'avx'
poly_s3_inv.c: F1[2] = _mm256_set1_epi32(0);
poly_s3_inv.c: ^
poly_s3_inv.c: poly_s3_inv.c:367:11: error: AVX vector return of type '__m256i' (vector of 4 'long long' values) without 'avx' enabled changes the ABI
poly_s3_inv.c: poly_s3_inv.c:369:11: error: always_inline function '_mm256_set1_epi32' requires target feature 'avx', but would be inlined into function '__poly_S3_inv' that is compiled without support for 'avx'
poly_s3_inv.c: ...
Number of similar (implementation,compiler) pairs: 10, namely:
Implementation | Compiler |
avx2 | clang -march=native -O2 -fwrapv -Qunused-arguments -fPIC -fPIE -gdwarf-4 -Wall (Debian_Clang_11.0.1) |
T:avx2 | clang -march=native -O2 -fwrapv -Qunused-arguments -fPIC -fPIE -gdwarf-4 -Wall (Debian_Clang_11.0.1) |
avx2 | clang -march=native -O3 -fwrapv -Qunused-arguments -fPIC -fPIE -gdwarf-4 -Wall (Debian_Clang_11.0.1) |
T:avx2 | clang -march=native -O3 -fwrapv -Qunused-arguments -fPIC -fPIE -gdwarf-4 -Wall (Debian_Clang_11.0.1) |
avx2 | clang -march=native -O -fwrapv -Qunused-arguments -fPIC -fPIE -gdwarf-4 -Wall (Debian_Clang_11.0.1) |
T:avx2 | clang -march=native -O -fwrapv -Qunused-arguments -fPIC -fPIE -gdwarf-4 -Wall (Debian_Clang_11.0.1) |
avx2 | clang -march=native -Os -fwrapv -Qunused-arguments -fPIC -fPIE -gdwarf-4 -Wall (Debian_Clang_11.0.1) |
T:avx2 | clang -march=native -Os -fwrapv -Qunused-arguments -fPIC -fPIE -gdwarf-4 -Wall (Debian_Clang_11.0.1) |
avx2 | clang -mcpu=native -O3 -fwrapv -Qunused-arguments -fPIC -fPIE -gdwarf-4 -Wall (Debian_Clang_11.0.1) |
T:avx2 | clang -mcpu=native -O3 -fwrapv -Qunused-arguments -fPIC -fPIE -gdwarf-4 -Wall (Debian_Clang_11.0.1) |
Compiler output
poly_s3_inv.c: poly_s3_inv.c: In function '__poly_S3_inv':
poly_s3_inv.c: poly_s3_inv.c:362:9: warning: AVX vector return without AVX enabled changes the ABI [-Wpsabi]
poly_s3_inv.c: 362 | F0[0] = _mm256_set_epi32(-1,-1,-1,-1,-1,-1,-1,-1);
poly_s3_inv.c: | ~~~~~~^~~~~~~~~~~~~~~~~~~~~~~~~~~~~~~~~~~~~~~~~~~
poly_s3_inv.c: poly_s3_inv.c: In function 'vec256_swap':
poly_s3_inv.c: poly_s3_inv.c:178:20: note: the ABI for passing parameters with 32-byte alignment has changed in GCC 4.6
poly_s3_inv.c: 178 | static inline void vec256_swap(vec256 *f,vec256 *g,int len,vec256 mask)
poly_s3_inv.c: | ^~~~~~~~~~~
poly_s3_inv.c: In file included from /usr/lib/gcc/x86_64-linux-gnu/10/include/immintrin.h:53,
poly_s3_inv.c: from poly.h:4,
poly_s3_inv.c: from poly_s3_inv.c:2:
poly_s3_inv.c: poly_s3_inv.c: In function 'vec256_frombits':
poly_s3_inv.c: /usr/lib/gcc/x86_64-linux-gnu/10/include/avx2intrin.h:597:1: error: inlining failed in call to 'always_inline' '_mm256_shuffle_epi32': target specific option mismatch
poly_s3_inv.c: 597 | _mm256_shuffle_epi32 (__m256i __A, const int __mask)
poly_s3_inv.c: | ^~~~~~~~~~~~~~~~~~~~
poly_s3_inv.c: poly_s3_inv.c:69:9: note: called from here
poly_s3_inv.c: 69 | h = _mm256_shuffle_epi32(h,0xd8);
poly_s3_inv.c: | ^~~~~~~~~~~~~~~~~~~~~~~~~~~~
poly_s3_inv.c: In file included from /usr/lib/gcc/x86_64-linux-gnu/10/include/immintrin.h:53,
poly_s3_inv.c: from poly.h:4,
poly_s3_inv.c: from poly_s3_inv.c:2:
poly_s3_inv.c: /usr/lib/gcc/x86_64-linux-gnu/10/include/avx2intrin.h:1068:1: error: inlining failed in call to 'always_inline' '_mm256_permute4x64_epi64': target specific option mismatch
poly_s3_inv.c: 1068 | _mm256_permute4x64_epi64 (__m256i __X, const int __M)
poly_s3_inv.c: | ^~~~~~~~~~~~~~~~~~~~~~~~
poly_s3_inv.c: poly_s3_inv.c:68:9: note: called from here
poly_s3_inv.c: ...
Number of similar (implementation,compiler) pairs: 8, namely:
Implementation | Compiler |
avx2 | gcc -march=native -mtune=native -O2 -fwrapv -fPIC -fPIE -gdwarf-4 -Wall (10.2.1_20210110) |
T:avx2 | gcc -march=native -mtune=native -O2 -fwrapv -fPIC -fPIE -gdwarf-4 -Wall (10.2.1_20210110) |
avx2 | gcc -march=native -mtune=native -O3 -fwrapv -fPIC -fPIE -gdwarf-4 -Wall (10.2.1_20210110) |
T:avx2 | gcc -march=native -mtune=native -O3 -fwrapv -fPIC -fPIE -gdwarf-4 -Wall (10.2.1_20210110) |
avx2 | gcc -march=native -mtune=native -O -fwrapv -fPIC -fPIE -gdwarf-4 -Wall (10.2.1_20210110) |
T:avx2 | gcc -march=native -mtune=native -O -fwrapv -fPIC -fPIE -gdwarf-4 -Wall (10.2.1_20210110) |
avx2 | gcc -march=native -mtune=native -Os -fwrapv -fPIC -fPIE -gdwarf-4 -Wall (10.2.1_20210110) |
T:avx2 | gcc -march=native -mtune=native -Os -fwrapv -fPIC -fPIE -gdwarf-4 -Wall (10.2.1_20210110) |
Compiler output
try.c: /usr/bin/ld: .../supercop-data/wolfdale/amd64/lib/libsupercop.a(crypto_core_keccakf160064bits_optimized1600AsmX86_64_constbranchindex-KeccakP-1600-x86-64-gas.o): relocation R_X86_64_32S against `.text' can not be used when making a PIE object; recompile with -fPIE
try.c: collect2: error: ld returned 1 exit status
Number of similar (implementation,compiler) pairs: 16, namely:
Implementation | Compiler |
compact | gcc -march=native -mtune=native -O2 -fwrapv -fPIC -fPIE -gdwarf-4 -Wall (10.2.1_20210110) |
T:compact | gcc -march=native -mtune=native -O2 -fwrapv -fPIC -fPIE -gdwarf-4 -Wall (10.2.1_20210110) |
compact | gcc -march=native -mtune=native -O3 -fwrapv -fPIC -fPIE -gdwarf-4 -Wall (10.2.1_20210110) |
T:compact | gcc -march=native -mtune=native -O3 -fwrapv -fPIC -fPIE -gdwarf-4 -Wall (10.2.1_20210110) |
compact | gcc -march=native -mtune=native -O -fwrapv -fPIC -fPIE -gdwarf-4 -Wall (10.2.1_20210110) |
T:compact | gcc -march=native -mtune=native -O -fwrapv -fPIC -fPIE -gdwarf-4 -Wall (10.2.1_20210110) |
compact | gcc -march=native -mtune=native -Os -fwrapv -fPIC -fPIE -gdwarf-4 -Wall (10.2.1_20210110) |
T:compact | gcc -march=native -mtune=native -Os -fwrapv -fPIC -fPIE -gdwarf-4 -Wall (10.2.1_20210110) |
ref | gcc -march=native -mtune=native -O2 -fwrapv -fPIC -fPIE -gdwarf-4 -Wall (10.2.1_20210110) |
T:ref | gcc -march=native -mtune=native -O2 -fwrapv -fPIC -fPIE -gdwarf-4 -Wall (10.2.1_20210110) |
ref | gcc -march=native -mtune=native -O3 -fwrapv -fPIC -fPIE -gdwarf-4 -Wall (10.2.1_20210110) |
T:ref | gcc -march=native -mtune=native -O3 -fwrapv -fPIC -fPIE -gdwarf-4 -Wall (10.2.1_20210110) |
ref | gcc -march=native -mtune=native -O -fwrapv -fPIC -fPIE -gdwarf-4 -Wall (10.2.1_20210110) |
T:ref | gcc -march=native -mtune=native -O -fwrapv -fPIC -fPIE -gdwarf-4 -Wall (10.2.1_20210110) |
ref | gcc -march=native -mtune=native -Os -fwrapv -fPIC -fPIE -gdwarf-4 -Wall (10.2.1_20210110) |
T:ref | gcc -march=native -mtune=native -Os -fwrapv -fPIC -fPIE -gdwarf-4 -Wall (10.2.1_20210110) |
Passed TIMECOP
TIMECOP iterations: 1
Number of similar (implementation,compiler) pairs: 10, namely:
Implementation | Compiler |
compact | clang -march=native -O2 -fwrapv -Qunused-arguments -fPIC -fPIE -gdwarf-4 -Wall (Debian_Clang_11.0.1) |
compact | clang -march=native -O3 -fwrapv -Qunused-arguments -fPIC -fPIE -gdwarf-4 -Wall (Debian_Clang_11.0.1) |
compact | clang -march=native -O -fwrapv -Qunused-arguments -fPIC -fPIE -gdwarf-4 -Wall (Debian_Clang_11.0.1) |
compact | clang -march=native -Os -fwrapv -Qunused-arguments -fPIC -fPIE -gdwarf-4 -Wall (Debian_Clang_11.0.1) |
compact | clang -mcpu=native -O3 -fwrapv -Qunused-arguments -fPIC -fPIE -gdwarf-4 -Wall (Debian_Clang_11.0.1) |
ref | clang -march=native -O2 -fwrapv -Qunused-arguments -fPIC -fPIE -gdwarf-4 -Wall (Debian_Clang_11.0.1) |
ref | clang -march=native -O3 -fwrapv -Qunused-arguments -fPIC -fPIE -gdwarf-4 -Wall (Debian_Clang_11.0.1) |
ref | clang -march=native -O -fwrapv -Qunused-arguments -fPIC -fPIE -gdwarf-4 -Wall (Debian_Clang_11.0.1) |
ref | clang -march=native -Os -fwrapv -Qunused-arguments -fPIC -fPIE -gdwarf-4 -Wall (Debian_Clang_11.0.1) |
ref | clang -mcpu=native -O3 -fwrapv -Qunused-arguments -fPIC -fPIE -gdwarf-4 -Wall (Debian_Clang_11.0.1) |