Test results for amd64, wolfdale, crypto_kem/ntruhps2048509

[Page version: 20250403 07:18:08]

Measurements for amd64, wolfdale, crypto_kem Test results for amd64, wolfdale, crypto_kem Test results for crypto_kem/ntruhps2048509
Computer: wolfdale
Microarchitecture: amd64; Core 2 45nm (1067a)
Architecture: amd64
CPU ID: GenuineIntel-0001067a-bfebfbff
SUPERCOP version: 20250307
Operation: crypto_kem
Primitive: ntruhps2048509
TimeObject sizeTest sizeImplementationCompilerBenchmark dateSUPERCOP version
169826928849 0 0120312 820 1720T:compactclang -march=native -O2 -fwrapv -Qunused-arguments -fPIC -fPIE -gdwarf-4 -Wall2025032820250307
170777928849 0 0127464 820 1720compactclang -march=native -O2 -fwrapv -Qunused-arguments -fPIC -fPIE -gdwarf-4 -Wall2025032820250307
179323441910 0 0134200 820 1720T:compactclang -march=native -O3 -fwrapv -Qunused-arguments -fPIC -fPIE -gdwarf-4 -Wall2025032820250307
183232241910 0 0141352 820 1720compactclang -march=native -O3 -fwrapv -Qunused-arguments -fPIC -fPIE -gdwarf-4 -Wall2025032820250307
186586237641 0 0129736 820 1720T:compactclang -mcpu=native -O3 -fwrapv -Qunused-arguments -fPIC -fPIE -gdwarf-4 -Wall2025032820250307
186748437641 0 0136888 820 1720compactclang -mcpu=native -O3 -fwrapv -Qunused-arguments -fPIC -fPIE -gdwarf-4 -Wall2025032820250307
54049786171 0 095550 812 1720T:refclang -march=native -Os -fwrapv -Qunused-arguments -fPIC -fPIE -gdwarf-4 -Wall2025032820250307
541055416094 0 0107704 820 1720T:refclang -march=native -O2 -fwrapv -Qunused-arguments -fPIC -fPIE -gdwarf-4 -Wall2025032820250307
542191325882 0 0118288 820 1720T:refclang -march=native -O3 -fwrapv -Qunused-arguments -fPIC -fPIE -gdwarf-4 -Wall2025032820250307
54277356171 0 0102702 812 1720refclang -march=native -Os -fwrapv -Qunused-arguments -fPIC -fPIE -gdwarf-4 -Wall2025032820250307
542791525882 0 0125440 820 1720refclang -march=native -O3 -fwrapv -Qunused-arguments -fPIC -fPIE -gdwarf-4 -Wall2025032820250307
543348216094 0 0114792 820 1720refclang -march=native -O2 -fwrapv -Qunused-arguments -fPIC -fPIE -gdwarf-4 -Wall2025032820250307
555090224582 0 0116736 820 1720T:refclang -mcpu=native -O3 -fwrapv -Qunused-arguments -fPIC -fPIE -gdwarf-4 -Wall2025032820250307
559367324582 0 0123888 820 1720refclang -mcpu=native -O3 -fwrapv -Qunused-arguments -fPIC -fPIE -gdwarf-4 -Wall2025032820250307
57295884666 0 094166 812 1720T:compactclang -march=native -Os -fwrapv -Qunused-arguments -fPIC -fPIE -gdwarf-4 -Wall2025032820250307
57675164666 0 0101318 812 1720compactclang -march=native -Os -fwrapv -Qunused-arguments -fPIC -fPIE -gdwarf-4 -Wall2025032820250307
66366607179 0 097286 812 1720T:refclang -march=native -O -fwrapv -Qunused-arguments -fPIC -fPIE -gdwarf-4 -Wall2025032820250307
66693167179 0 0104390 812 1720refclang -march=native -O -fwrapv -Qunused-arguments -fPIC -fPIE -gdwarf-4 -Wall2025032820250307
72128976320 0 096582 812 1720T:compactclang -march=native -O -fwrapv -Qunused-arguments -fPIC -fPIE -gdwarf-4 -Wall2025032820250307
72464206320 0 0103750 812 1720compactclang -march=native -O -fwrapv -Qunused-arguments -fPIC -fPIE -gdwarf-4 -Wall2025032820250307

Compiler output


poly_r2_inv.c: poly_r2_inv.c:19:14: error: always_inline function '_pext_u64' requires target feature 'bmi2', but would be inlined into function 'crypto_kem_ntruhps2048509_avx2_constbranchindex_poly_R2_tobytes' that is compiled without support for 'bmi2'
poly_r2_inv.c:     out[i] = _pext_u64(coeff_pointer[2*i], 0x1000100010001);
poly_r2_inv.c:              ^
poly_r2_inv.c: poly_r2_inv.c:20:15: error: always_inline function '_pext_u64' requires target feature 'bmi2', but would be inlined into function 'crypto_kem_ntruhps2048509_avx2_constbranchindex_poly_R2_tobytes' that is compiled without support for 'bmi2'
poly_r2_inv.c:     out[i] |= _pext_u64(coeff_pointer[2*i+1], 0x1000100010001) << 4;
poly_r2_inv.c:               ^
poly_r2_inv.c: poly_r2_inv.c:22:12: error: always_inline function '_pext_u64' requires target feature 'bmi2', but would be inlined into function 'crypto_kem_ntruhps2048509_avx2_constbranchindex_poly_R2_tobytes' that is compiled without support for 'bmi2'
poly_r2_inv.c:   out[i] = _pext_u64(coeff_pointer[2*63], 0x1000100010001);
poly_r2_inv.c:            ^
poly_r2_inv.c: poly_r2_inv.c:23:13: error: always_inline function '_pext_u64' requires target feature 'bmi2', but would be inlined into function 'crypto_kem_ntruhps2048509_avx2_constbranchindex_poly_R2_tobytes' that is compiled without support for 'bmi2'
poly_r2_inv.c:   out[i] |= _pext_u64(coeff_pointer[2*63+1], 0x1) << 4;
poly_r2_inv.c:             ^
poly_r2_inv.c: 4 errors generated.

Number of similar (implementation,compiler) pairs: 5, namely:
ImplementationCompiler
avx2clang -march=native -O2 -fwrapv -Qunused-arguments -fPIC -fPIE -gdwarf-4 -Wall (Debian_Clang_11.0.1)
avx2clang -march=native -O3 -fwrapv -Qunused-arguments -fPIC -fPIE -gdwarf-4 -Wall (Debian_Clang_11.0.1)
avx2clang -march=native -O -fwrapv -Qunused-arguments -fPIC -fPIE -gdwarf-4 -Wall (Debian_Clang_11.0.1)
avx2clang -march=native -Os -fwrapv -Qunused-arguments -fPIC -fPIE -gdwarf-4 -Wall (Debian_Clang_11.0.1)
avx2clang -mcpu=native -O3 -fwrapv -Qunused-arguments -fPIC -fPIE -gdwarf-4 -Wall (Debian_Clang_11.0.1)

Compiler output


poly_r2_inv.c: poly_r2_inv.c:19:14: error: always_inline function '_pext_u64' requires target feature 'bmi2', but would be inlined into function 'crypto_kem_ntruhps2048509_avx2_timingleaks_poly_R2_tobytes' that is compiled without support for 'bmi2'
poly_r2_inv.c:     out[i] = _pext_u64(coeff_pointer[2*i], 0x1000100010001);
poly_r2_inv.c:              ^
poly_r2_inv.c: poly_r2_inv.c:20:15: error: always_inline function '_pext_u64' requires target feature 'bmi2', but would be inlined into function 'crypto_kem_ntruhps2048509_avx2_timingleaks_poly_R2_tobytes' that is compiled without support for 'bmi2'
poly_r2_inv.c:     out[i] |= _pext_u64(coeff_pointer[2*i+1], 0x1000100010001) << 4;
poly_r2_inv.c:               ^
poly_r2_inv.c: poly_r2_inv.c:22:12: error: always_inline function '_pext_u64' requires target feature 'bmi2', but would be inlined into function 'crypto_kem_ntruhps2048509_avx2_timingleaks_poly_R2_tobytes' that is compiled without support for 'bmi2'
poly_r2_inv.c:   out[i] = _pext_u64(coeff_pointer[2*63], 0x1000100010001);
poly_r2_inv.c:            ^
poly_r2_inv.c: poly_r2_inv.c:23:13: error: always_inline function '_pext_u64' requires target feature 'bmi2', but would be inlined into function 'crypto_kem_ntruhps2048509_avx2_timingleaks_poly_R2_tobytes' that is compiled without support for 'bmi2'
poly_r2_inv.c:   out[i] |= _pext_u64(coeff_pointer[2*63+1], 0x1) << 4;
poly_r2_inv.c:             ^
poly_r2_inv.c: 4 errors generated.

Number of similar (implementation,compiler) pairs: 5, namely:
ImplementationCompiler
T:avx2clang -march=native -O2 -fwrapv -Qunused-arguments -fPIC -fPIE -gdwarf-4 -Wall (Debian_Clang_11.0.1)
T:avx2clang -march=native -O3 -fwrapv -Qunused-arguments -fPIC -fPIE -gdwarf-4 -Wall (Debian_Clang_11.0.1)
T:avx2clang -march=native -O -fwrapv -Qunused-arguments -fPIC -fPIE -gdwarf-4 -Wall (Debian_Clang_11.0.1)
T:avx2clang -march=native -Os -fwrapv -Qunused-arguments -fPIC -fPIE -gdwarf-4 -Wall (Debian_Clang_11.0.1)
T:avx2clang -mcpu=native -O3 -fwrapv -Qunused-arguments -fPIC -fPIE -gdwarf-4 -Wall (Debian_Clang_11.0.1)

Compiler output


poly_r2_inv.c: In file included from /usr/lib/gcc/x86_64-linux-gnu/10/include/immintrin.h:109,
poly_r2_inv.c:                  from poly_r2_inv.c:1:
poly_r2_inv.c: poly_r2_inv.c: In function 'crypto_kem_ntruhps2048509_avx2_constbranchindex_poly_R2_tobytes':
poly_r2_inv.c: /usr/lib/gcc/x86_64-linux-gnu/10/include/bmi2intrin.h:76:1: error: inlining failed in call to 'always_inline' '_pext_u64': target specific option mismatch
poly_r2_inv.c:    76 | _pext_u64 (unsigned long long __X, unsigned long long __Y)
poly_r2_inv.c:       | ^~~~~~~~~
poly_r2_inv.c: poly_r2_inv.c:20:15: note: called from here
poly_r2_inv.c:    20 |     out[i] |= _pext_u64(coeff_pointer[2*i+1], 0x1000100010001) << 4;
poly_r2_inv.c:       |               ^~~~~~~~~~~~~~~~~~~~~~~~~~~~~~~~~~~~~~~~~~~~~~~~
poly_r2_inv.c: In file included from /usr/lib/gcc/x86_64-linux-gnu/10/include/immintrin.h:109,
poly_r2_inv.c:                  from poly_r2_inv.c:1:
poly_r2_inv.c: /usr/lib/gcc/x86_64-linux-gnu/10/include/bmi2intrin.h:76:1: error: inlining failed in call to 'always_inline' '_pext_u64': target specific option mismatch
poly_r2_inv.c:    76 | _pext_u64 (unsigned long long __X, unsigned long long __Y)
poly_r2_inv.c:       | ^~~~~~~~~
poly_r2_inv.c: poly_r2_inv.c:19:14: note: called from here
poly_r2_inv.c:    19 |     out[i] = _pext_u64(coeff_pointer[2*i], 0x1000100010001);
poly_r2_inv.c:       |              ^~~~~~~~~~~~~~~~~~~~~~~~~~~~~~~~~~~~~~~~~~~~~~
poly_r2_inv.c: In file included from /usr/lib/gcc/x86_64-linux-gnu/10/include/immintrin.h:109,
poly_r2_inv.c:                  from poly_r2_inv.c:1:
poly_r2_inv.c: /usr/lib/gcc/x86_64-linux-gnu/10/include/bmi2intrin.h:76:1: error: inlining failed in call to 'always_inline' '_pext_u64': target specific option mismatch
poly_r2_inv.c:    76 | _pext_u64 (unsigned long long __X, unsigned long long __Y)
poly_r2_inv.c:       | ^~~~~~~~~
poly_r2_inv.c: poly_r2_inv.c:23:13: note: called from here
poly_r2_inv.c:    23 |   out[i] |= _pext_u64(coeff_pointer[2*63+1], 0x1) << 4;
poly_r2_inv.c:       |             ^~~~~~~~~~~~~~~~~~~~~~~~~~~~~~~~~~~~~
poly_r2_inv.c: ...

Number of similar (implementation,compiler) pairs: 4, namely:
ImplementationCompiler
avx2gcc -march=native -mtune=native -O2 -fwrapv -fPIC -fPIE -gdwarf-4 -Wall (10.2.1_20210110)
avx2gcc -march=native -mtune=native -O3 -fwrapv -fPIC -fPIE -gdwarf-4 -Wall (10.2.1_20210110)
avx2gcc -march=native -mtune=native -O -fwrapv -fPIC -fPIE -gdwarf-4 -Wall (10.2.1_20210110)
avx2gcc -march=native -mtune=native -Os -fwrapv -fPIC -fPIE -gdwarf-4 -Wall (10.2.1_20210110)

Compiler output


poly_r2_inv.c: In file included from /usr/lib/gcc/x86_64-linux-gnu/10/include/immintrin.h:109,
poly_r2_inv.c:                  from poly_r2_inv.c:1:
poly_r2_inv.c: poly_r2_inv.c: In function 'crypto_kem_ntruhps2048509_avx2_timingleaks_poly_R2_tobytes':
poly_r2_inv.c: /usr/lib/gcc/x86_64-linux-gnu/10/include/bmi2intrin.h:76:1: error: inlining failed in call to 'always_inline' '_pext_u64': target specific option mismatch
poly_r2_inv.c:    76 | _pext_u64 (unsigned long long __X, unsigned long long __Y)
poly_r2_inv.c:       | ^~~~~~~~~
poly_r2_inv.c: poly_r2_inv.c:20:15: note: called from here
poly_r2_inv.c:    20 |     out[i] |= _pext_u64(coeff_pointer[2*i+1], 0x1000100010001) << 4;
poly_r2_inv.c:       |               ^~~~~~~~~~~~~~~~~~~~~~~~~~~~~~~~~~~~~~~~~~~~~~~~
poly_r2_inv.c: In file included from /usr/lib/gcc/x86_64-linux-gnu/10/include/immintrin.h:109,
poly_r2_inv.c:                  from poly_r2_inv.c:1:
poly_r2_inv.c: /usr/lib/gcc/x86_64-linux-gnu/10/include/bmi2intrin.h:76:1: error: inlining failed in call to 'always_inline' '_pext_u64': target specific option mismatch
poly_r2_inv.c:    76 | _pext_u64 (unsigned long long __X, unsigned long long __Y)
poly_r2_inv.c:       | ^~~~~~~~~
poly_r2_inv.c: poly_r2_inv.c:19:14: note: called from here
poly_r2_inv.c:    19 |     out[i] = _pext_u64(coeff_pointer[2*i], 0x1000100010001);
poly_r2_inv.c:       |              ^~~~~~~~~~~~~~~~~~~~~~~~~~~~~~~~~~~~~~~~~~~~~~
poly_r2_inv.c: In file included from /usr/lib/gcc/x86_64-linux-gnu/10/include/immintrin.h:109,
poly_r2_inv.c:                  from poly_r2_inv.c:1:
poly_r2_inv.c: /usr/lib/gcc/x86_64-linux-gnu/10/include/bmi2intrin.h:76:1: error: inlining failed in call to 'always_inline' '_pext_u64': target specific option mismatch
poly_r2_inv.c:    76 | _pext_u64 (unsigned long long __X, unsigned long long __Y)
poly_r2_inv.c:       | ^~~~~~~~~
poly_r2_inv.c: poly_r2_inv.c:23:13: note: called from here
poly_r2_inv.c:    23 |   out[i] |= _pext_u64(coeff_pointer[2*63+1], 0x1) << 4;
poly_r2_inv.c:       |             ^~~~~~~~~~~~~~~~~~~~~~~~~~~~~~~~~~~~~
poly_r2_inv.c: ...

Number of similar (implementation,compiler) pairs: 4, namely:
ImplementationCompiler
T:avx2gcc -march=native -mtune=native -O2 -fwrapv -fPIC -fPIE -gdwarf-4 -Wall (10.2.1_20210110)
T:avx2gcc -march=native -mtune=native -O3 -fwrapv -fPIC -fPIE -gdwarf-4 -Wall (10.2.1_20210110)
T:avx2gcc -march=native -mtune=native -O -fwrapv -fPIC -fPIE -gdwarf-4 -Wall (10.2.1_20210110)
T:avx2gcc -march=native -mtune=native -Os -fwrapv -fPIC -fPIE -gdwarf-4 -Wall (10.2.1_20210110)

Compiler output


try.c: /usr/bin/ld: .../supercop-data/wolfdale/amd64/lib/libsupercop.a(crypto_core_keccakf160064bits_optimized1600AsmX86_64_constbranchindex-KeccakP-1600-x86-64-gas.o): relocation R_X86_64_32S against `.text' can not be used when making a PIE object; recompile with -fPIE
try.c: collect2: error: ld returned 1 exit status

Number of similar (implementation,compiler) pairs: 16, namely:
ImplementationCompiler
compactgcc -march=native -mtune=native -O2 -fwrapv -fPIC -fPIE -gdwarf-4 -Wall (10.2.1_20210110)
T:compactgcc -march=native -mtune=native -O2 -fwrapv -fPIC -fPIE -gdwarf-4 -Wall (10.2.1_20210110)
compactgcc -march=native -mtune=native -O3 -fwrapv -fPIC -fPIE -gdwarf-4 -Wall (10.2.1_20210110)
T:compactgcc -march=native -mtune=native -O3 -fwrapv -fPIC -fPIE -gdwarf-4 -Wall (10.2.1_20210110)
compactgcc -march=native -mtune=native -O -fwrapv -fPIC -fPIE -gdwarf-4 -Wall (10.2.1_20210110)
T:compactgcc -march=native -mtune=native -O -fwrapv -fPIC -fPIE -gdwarf-4 -Wall (10.2.1_20210110)
compactgcc -march=native -mtune=native -Os -fwrapv -fPIC -fPIE -gdwarf-4 -Wall (10.2.1_20210110)
T:compactgcc -march=native -mtune=native -Os -fwrapv -fPIC -fPIE -gdwarf-4 -Wall (10.2.1_20210110)
refgcc -march=native -mtune=native -O2 -fwrapv -fPIC -fPIE -gdwarf-4 -Wall (10.2.1_20210110)
T:refgcc -march=native -mtune=native -O2 -fwrapv -fPIC -fPIE -gdwarf-4 -Wall (10.2.1_20210110)
refgcc -march=native -mtune=native -O3 -fwrapv -fPIC -fPIE -gdwarf-4 -Wall (10.2.1_20210110)
T:refgcc -march=native -mtune=native -O3 -fwrapv -fPIC -fPIE -gdwarf-4 -Wall (10.2.1_20210110)
refgcc -march=native -mtune=native -O -fwrapv -fPIC -fPIE -gdwarf-4 -Wall (10.2.1_20210110)
T:refgcc -march=native -mtune=native -O -fwrapv -fPIC -fPIE -gdwarf-4 -Wall (10.2.1_20210110)
refgcc -march=native -mtune=native -Os -fwrapv -fPIC -fPIE -gdwarf-4 -Wall (10.2.1_20210110)
T:refgcc -march=native -mtune=native -Os -fwrapv -fPIC -fPIE -gdwarf-4 -Wall (10.2.1_20210110)

Passed TIMECOP


TIMECOP iterations: 1

Number of similar (implementation,compiler) pairs: 10, namely:
ImplementationCompiler
compactclang -march=native -O2 -fwrapv -Qunused-arguments -fPIC -fPIE -gdwarf-4 -Wall (Debian_Clang_11.0.1)
compactclang -march=native -O3 -fwrapv -Qunused-arguments -fPIC -fPIE -gdwarf-4 -Wall (Debian_Clang_11.0.1)
compactclang -march=native -O -fwrapv -Qunused-arguments -fPIC -fPIE -gdwarf-4 -Wall (Debian_Clang_11.0.1)
compactclang -march=native -Os -fwrapv -Qunused-arguments -fPIC -fPIE -gdwarf-4 -Wall (Debian_Clang_11.0.1)
compactclang -mcpu=native -O3 -fwrapv -Qunused-arguments -fPIC -fPIE -gdwarf-4 -Wall (Debian_Clang_11.0.1)
refclang -march=native -O2 -fwrapv -Qunused-arguments -fPIC -fPIE -gdwarf-4 -Wall (Debian_Clang_11.0.1)
refclang -march=native -O3 -fwrapv -Qunused-arguments -fPIC -fPIE -gdwarf-4 -Wall (Debian_Clang_11.0.1)
refclang -march=native -O -fwrapv -Qunused-arguments -fPIC -fPIE -gdwarf-4 -Wall (Debian_Clang_11.0.1)
refclang -march=native -Os -fwrapv -Qunused-arguments -fPIC -fPIE -gdwarf-4 -Wall (Debian_Clang_11.0.1)
refclang -mcpu=native -O3 -fwrapv -Qunused-arguments -fPIC -fPIE -gdwarf-4 -Wall (Debian_Clang_11.0.1)