Test results for amd64, tripwire, crypto_sign/mqsignrr25614896
[Page version: 20261004 16:18:08]
Measurements for amd64, tripwire, crypto_sign
Test results for amd64, tripwire, crypto_sign
Test results for crypto_sign/mqsignrr25614896
Computer: tripwire
Microarchitecture: amd64; Zen 5 (b00f21)
Architecture: amd64
CPU ID: AuthenticAMD-00b00f21-178bfbff
SUPERCOP version: 20260831
Operation: crypto_sign
Primitive: mqsignrr25614896
| Time | Object size | Test size | Implementation | Compiler | Benchmark date | SUPERCOP version |
| 563071 | 81046 8 524372 | 106367 1320 526904 | T:avx2 | gcc -march=native -mtune=native -O3 -fwrapv -fPIC -fPIE -gdwarf-4 -Wall | 20260930 | 20260831 |
| 585376 | 82120 8 524372 | 107455 1320 526904 | avx2ct | gcc -march=native -mtune=native -O3 -fwrapv -fPIC -fPIE -gdwarf-4 -Wall | 20260930 | 20260831 |
| 781975 | 47317 8 524372 | 80039 1320 526936 | T:avx2 | gcc -march=native -mtune=native -O2 -fwrapv -fPIC -fPIE -gdwarf-4 -Wall | 20260930 | 20260831 |
| 792001 | 47895 8 524372 | 80607 1320 526936 | avx2ct | gcc -march=native -mtune=native -O2 -fwrapv -fPIC -fPIE -gdwarf-4 -Wall | 20260930 | 20260831 |
| 795029 | 44129 8 524372 | 76751 1320 526840 | T:avx2 | gcc -march=native -mtune=native -O -fwrapv -fPIC -fPIE -gdwarf-4 -Wall | 20260930 | 20260831 |
| 807288 | 44490 8 524372 | 77119 1320 526840 | avx2ct | gcc -march=native -mtune=native -O -fwrapv -fPIC -fPIE -gdwarf-4 -Wall | 20260930 | 20260831 |
| 819728 | 34127 8 524372 | 66265 1312 526808 | T:avx2 | gcc -march=native -mtune=native -Os -fwrapv -fPIC -fPIE -gdwarf-4 -Wall | 20260930 | 20260831 |
| 846289 | 34417 8 524372 | 66577 1312 526808 | avx2ct | gcc -march=native -mtune=native -Os -fwrapv -fPIC -fPIE -gdwarf-4 -Wall | 20260930 | 20260831 |
| 25675611 | 85382 0 524372 | 110637 1312 526904 | ref | gcc -march=native -mtune=native -O3 -fwrapv -fPIC -fPIE -gdwarf-4 -Wall | 20260930 | 20260831 |
| 29377125 | 44228 0 524372 | 77045 1312 526936 | ref | gcc -march=native -mtune=native -O2 -fwrapv -fPIC -fPIE -gdwarf-4 -Wall | 20260930 | 20260831 |
| 31723031 | 41407 0 524372 | 74037 1312 526840 | ref | gcc -march=native -mtune=native -O -fwrapv -fPIC -fPIE -gdwarf-4 -Wall | 20260930 | 20260831 |
| 46246277 | 24213 0 524372 | 56487 1304 526808 | ref | gcc -march=native -mtune=native -Os -fwrapv -fPIC -fPIE -gdwarf-4 -Wall | 20260930 | 20260831 |
Compiler output
blas_matrix_avx2.c: blas_matrix_avx2.c: In function 'gf256mat_solve_linear_eq_avx2':
blas_matrix_avx2.c: blas_matrix_avx2.c:494:15: warning: '<unknown>' may be used uninitialized [-Wmaybe-uninitialized]
blas_matrix_avx2.c: 494 | rr &= gf256mat_inv_avx2(A_inv, A, H_half);
blas_matrix_avx2.c: | ^~~~~~~~~~~~~~~~~~~~~~~~~~~~~~~~~~~
blas_matrix_avx2.c: blas_matrix_avx2.c:410:10: note: by argument 2 of type 'const uint8_t *' {aka 'const unsigned char *'} to 'gf256mat_inv_avx2' declared here
blas_matrix_avx2.c: 410 | unsigned gf256mat_inv_avx2(uint8_t* inv_a, const uint8_t* mat_a, const unsigned h)
blas_matrix_avx2.c: | ^~~~~~~~~~~~~~~~~
Number of similar (implementation,compiler) pairs: 3, namely:
| Implementation | Compiler |
| T:avx2 | gcc -march=native -mtune=native -O2 -fwrapv -fPIC -fPIE -gdwarf-4 -Wall (14.2.0) |
| T:avx2 | gcc -march=native -mtune=native -O3 -fwrapv -fPIC -fPIE -gdwarf-4 -Wall (14.2.0) |
| T:avx2 | gcc -march=native -mtune=native -O -fwrapv -fPIC -fPIE -gdwarf-4 -Wall (14.2.0) |
Compiler output
blas_matrix_avx2.c: blas_matrix_avx2.c: In function 'gf256mat_solve_linear_eq_avx2':
blas_matrix_avx2.c: blas_matrix_avx2.c:494:15: warning: '<unknown>' may be used uninitialized [-Wmaybe-uninitialized]
blas_matrix_avx2.c: 494 | rr &= gf256mat_inv_avx2(A_inv, A, H_half);
blas_matrix_avx2.c: | ^~~~~~~~~~~~~~~~~~~~~~~~~~~~~~~~~~~
blas_matrix_avx2.c: blas_matrix_avx2.c:410:10: note: by argument 2 of type 'const uint8_t *' {aka 'const unsigned char *'} to 'gf256mat_inv_avx2' declared here
blas_matrix_avx2.c: 410 | unsigned gf256mat_inv_avx2(uint8_t* inv_a, const uint8_t* mat_a, const unsigned h)
blas_matrix_avx2.c: | ^~~~~~~~~~~~~~~~~
try.c: In file included from try-anything-timecop.c:3:
try.c: try-anything.c:26:10: fatal error: valgrind/memcheck.h: No such file or directory
try.c: 26 | #include <valgrind/memcheck.h>
try.c: | ^~~~~~~~~~~~~~~~~~~~~
try.c: compilation terminated.
Number of similar (implementation,compiler) pairs: 3, namely:
| Implementation | Compiler |
| avx2ct | gcc -march=native -mtune=native -O2 -fwrapv -fPIC -fPIE -gdwarf-4 -Wall (14.2.0) |
| avx2ct | gcc -march=native -mtune=native -O3 -fwrapv -fPIC -fPIE -gdwarf-4 -Wall (14.2.0) |
| avx2ct | gcc -march=native -mtune=native -O -fwrapv -fPIC -fPIE -gdwarf-4 -Wall (14.2.0) |
Compiler output
try.c: In file included from try-anything-timecop.c:3:
try.c: try-anything.c:26:10: fatal error: valgrind/memcheck.h: No such file or directory
try.c: 26 | #include <valgrind/memcheck.h>
try.c: | ^~~~~~~~~~~~~~~~~~~~~
try.c: compilation terminated.
Number of similar (implementation,compiler) pairs: 2, namely:
| Implementation | Compiler |
| avx2ct | gcc -march=native -mtune=native -Os -fwrapv -fPIC -fPIE -gdwarf-4 -Wall (14.2.0) |
| ref | gcc -march=native -mtune=native -Os -fwrapv -fPIC -fPIE -gdwarf-4 -Wall (14.2.0) |
Compiler output
blas_matrix_ref.c: blas_matrix_ref.c: In function 'gf256mat_solve_linear_eq_ref':
blas_matrix_ref.c: blas_matrix_ref.c:199:15: warning: '<unknown>' may be used uninitialized [-Wmaybe-uninitialized]
blas_matrix_ref.c: 199 | rr &= gf256mat_inv_ref(A_inv, A, H_half);
blas_matrix_ref.c: | ^~~~~~~~~~~~~~~~~~~~~~~~~~~~~~~~~~
blas_matrix_ref.c: blas_matrix_ref.c:134:10: note: by argument 2 of type 'const uint8_t *' {aka 'const unsigned char *'} to 'gf256mat_inv_ref' declared here
blas_matrix_ref.c: 134 | unsigned gf256mat_inv_ref(uint8_t* inv_a, const uint8_t* a, unsigned h)
blas_matrix_ref.c: | ^~~~~~~~~~~~~~~~
try.c: In file included from try-anything-timecop.c:3:
try.c: try-anything.c:26:10: fatal error: valgrind/memcheck.h: No such file or directory
try.c: 26 | #include <valgrind/memcheck.h>
try.c: | ^~~~~~~~~~~~~~~~~~~~~
try.c: compilation terminated.
Number of similar (implementation,compiler) pairs: 3, namely:
| Implementation | Compiler |
| ref | gcc -march=native -mtune=native -O2 -fwrapv -fPIC -fPIE -gdwarf-4 -Wall (14.2.0) |
| ref | gcc -march=native -mtune=native -O3 -fwrapv -fPIC -fPIE -gdwarf-4 -Wall (14.2.0) |
| ref | gcc -march=native -mtune=native -O -fwrapv -fPIC -fPIE -gdwarf-4 -Wall (14.2.0) |
Namespace violations
aes.o AES_256_Key_Expansion T
aes.o AES_ECB_encrypt T
blas_comm.o gf256v_is_zero T
blas_comm.o gf256v_set_zero T
blas_matrix.o gf256mat_mul T
blas_matrix.o gf256mat_prod T
blas_matrix.o gf256mat_prod_multab T
blas_matrix.o gf256mat_solve_linear_eq T
blas_matrix_avx2.o gf256mat_back_substitute_avx2 T
blas_matrix_avx2.o gf256mat_gaussian_elim_avx2 T
blas_matrix_avx2.o gf256mat_inv_avx2 T
blas_matrix_avx2.o gf256mat_mul_avx2 T
blas_matrix_avx2.o gf256mat_prod_avx2 T
blas_matrix_avx2.o gf256mat_prod_multab_avx2 T
blas_matrix_avx2.o gf256mat_prod_multabs_avx2 T
blas_matrix_avx2.o gf256mat_solve_linear_CORE T
blas_matrix_avx2.o gf256mat_solve_linear_eq_avx2 T
blas_matrix_avx2.o gf256mat_solve_linear_eq_avx2_modify T
blas_matrix_sse.o gf256mat_prod_add_multab_sse T
blas_matrix_sse.o gf256mat_prod_add_sse T
blas_matrix_sse.o gf256mat_prod_sse T
fips202.o KeccakF_RoundConstants R
fips202.o sha3_256 T
fips202.o sha3_512 T
fips202.o shake128 T
fips202.o shake128_absorb T
fips202.o shake128_absorb_once T
fips202.o shake128_finalize T
fips202.o shake128_init T
fips202.o shake128_squeeze T
fips202.o shake128_squeezeblocks T
fips202.o shake256 T
fips202.o shake256_absorb T
fips202.o shake256_absorb_once T
fips202.o shake256_finalize T
fips202.o shake256_init T
fips202.o shake256_squeeze T
fips202.o shake256_squeezeblocks T
gf16.o __gf16_exp R
gf16.o __gf16_inv R
gf16.o __gf16_log R
gf16.o __gf16_mul D
gf16.o __gf16_mulx2 R
gf16.o __gf16_squ R
gf16.o __gf16_squ_sl4 R
gf16.o __gf16_squ_x8 R
gf16.o __gf256_mul R
gf16.o __mask_0x55 R
gf16.o __mask_16 R
gf16.o __mask_low R
mqs_keypair.o generate_keypair_mqrr T
mqs_keypair_computation.o cal_ext_pk_mqrr T
mqs_keypair_computation.o extpk_to_pk T
mqs_keypair_computation_simd.o cal_ext_pk_mqrr_simd T
mqs_simd.o mqrr_sign T
mqs_simd.o mqrr_verify T
parallel_matrix_op.o UpperTrianglize T
parallel_matrix_op_avx2.o batch_matTr_madd_multab_gf256_avx2 T
parallel_matrix_op_avx2.o batch_quad_trimat_eval_multab_gf256_avx2 T
parallel_matrix_op_avx2.o batch_trimatTr_madd_multab_gf256_avx2 T
parallel_matrix_op_avx2.o batch_trimat_madd_multab_gf256_avx2 T
rng.o AES256_CTR_DRBG_Update T
rng.o AES256_ECB T
rng.o DRBG_ctx B
rng.o handleErrors T
rng.o randombytes_init T
rng.o randombytes_init_with_state T
rng.o randombytes_with_state T
rng.o seedexpander T
rng.o seedexpander_init T
rng.o unused_randombytes T
utils_hash.o hash_msg T
utils_prng.o prng_dump T
utils_prng.o prng_dump_set T
utils_prng.o prng_expand_buffer T
utils_prng.o prng_gen T
utils_prng.o prng_set T
utils_prng.o userrand_dump_generated T
utils_prng.o userrand_source_file T
Number of similar (implementation,compiler) pairs: 8, namely:
| Implementation | Compiler |
| T:avx2 | gcc -march=native -mtune=native -O2 -fwrapv -fPIC -fPIE -gdwarf-4 -Wall (14.2.0) |
| T:avx2 | gcc -march=native -mtune=native -O3 -fwrapv -fPIC -fPIE -gdwarf-4 -Wall (14.2.0) |
| T:avx2 | gcc -march=native -mtune=native -O -fwrapv -fPIC -fPIE -gdwarf-4 -Wall (14.2.0) |
| T:avx2 | gcc -march=native -mtune=native -Os -fwrapv -fPIC -fPIE -gdwarf-4 -Wall (14.2.0) |
| avx2ct | gcc -march=native -mtune=native -O2 -fwrapv -fPIC -fPIE -gdwarf-4 -Wall (14.2.0) |
| avx2ct | gcc -march=native -mtune=native -O3 -fwrapv -fPIC -fPIE -gdwarf-4 -Wall (14.2.0) |
| avx2ct | gcc -march=native -mtune=native -O -fwrapv -fPIC -fPIE -gdwarf-4 -Wall (14.2.0) |
| avx2ct | gcc -march=native -mtune=native -Os -fwrapv -fPIC -fPIE -gdwarf-4 -Wall (14.2.0) |
Namespace violations
aes.o aes128_ctr T
aes.o aes128_ctr_keyexp T
aes.o aes128_ctx_release T
aes.o aes128_ecb T
aes.o aes128_ecb_keyexp T
aes.o aes192_ctr T
aes.o aes192_ctr_keyexp T
aes.o aes192_ctx_release T
aes.o aes192_ecb T
aes.o aes192_ecb_keyexp T
aes.o aes256_ctr T
aes.o aes256_ctr_keyexp T
aes.o aes256_ctx_release T
aes.o aes256_ecb T
aes.o aes256_ecb_keyexp T
aes.o aes256ctr_init T
aes.o aes256ctr_prf T
aes.o aes256ctr_squeezeblocks T
blas_comm.o gf256v_is_zero T
blas_comm.o gf256v_set_zero T
blas_matrix.o gf256mat_back_substitute T
blas_matrix.o gf256mat_gaussian_elim T
blas_matrix.o gf256mat_inv T
blas_matrix.o gf256mat_mul T
blas_matrix.o gf256mat_prod T
blas_matrix.o gf256mat_solve_linear_eq T
blas_matrix_ref.o gf256mat_back_substitute_ref T
blas_matrix_ref.o gf256mat_gaussian_elim_ref T
blas_matrix_ref.o gf256mat_inv_ref T
blas_matrix_ref.o gf256mat_mul_ref T
blas_matrix_ref.o gf256mat_prod_ref T
blas_matrix_ref.o gf256mat_solve_linear_CORE_ref T
blas_matrix_ref.o gf256mat_solve_linear_eq_ref T
blas_matrix_ref.o gf256mat_solve_linear_eq_ref_modify T
blas_matrix_ref.o gf256mat_submat T
fips202.o KeccakF_RoundConstants R
fips202.o sha3_256 T
fips202.o sha3_512 T
fips202.o shake128 T
fips202.o shake128_absorb T
fips202.o shake128_absorb_once T
fips202.o shake128_finalize T
fips202.o shake128_init T
fips202.o shake128_squeeze T
fips202.o shake128_squeezeblocks T
fips202.o shake256 T
fips202.o shake256_absorb T
fips202.o shake256_absorb_once T
fips202.o shake256_finalize T
fips202.o shake256_init T
fips202.o shake256_squeeze T
fips202.o shake256_squeezeblocks T
mqs.o mqrr_sign T
mqs.o mqrr_verify T
mqs_keypair.o generate_keypair_mqrr T
mqs_keypair_computation.o cal_ext_pk_mqrr T
mqs_keypair_computation.o cal_ext_pk_mqrr_ref T
mqs_keypair_computation.o extpk_to_pk T
parallel_matrix_op.o batch_quad_trimat_eval_gf256 T
parallel_matrix_op.o batch_trimatTr_madd_gf256 T
parallel_matrix_op.o batch_trimat_madd_gf256 T
parallel_matrix_op.o batch_upper_matTr_x_mat_gf256 T
rng.o AES256_CTR_DRBG_Update T
rng.o AES256_ECB T
rng.o DRBG_ctx B
rng.o handleErrors T
rng.o randombytes_init T
rng.o randombytes_init_with_state T
rng.o randombytes_with_state T
rng.o seedexpander T
rng.o seedexpander_init T
rng.o unused_randombytes T
utils_hash.o hash_msg T
utils_prng.o prng_dump T
utils_prng.o prng_dump_set T
utils_prng.o prng_expand_buffer T
utils_prng.o prng_gen T
utils_prng.o prng_set T
utils_prng.o userrand_dump_generated T
utils_prng.o userrand_source_file T
Number of similar (implementation,compiler) pairs: 4, namely:
| Implementation | Compiler |
| ref | gcc -march=native -mtune=native -O2 -fwrapv -fPIC -fPIE -gdwarf-4 -Wall (14.2.0) |
| ref | gcc -march=native -mtune=native -O3 -fwrapv -fPIC -fPIE -gdwarf-4 -Wall (14.2.0) |
| ref | gcc -march=native -mtune=native -O -fwrapv -fPIC -fPIE -gdwarf-4 -Wall (14.2.0) |
| ref | gcc -march=native -mtune=native -Os -fwrapv -fPIC -fPIE -gdwarf-4 -Wall (14.2.0) |
TIMECOP error (can be valgrind bug)
error 127
timeout: failed to run command 'valgrind': No such file or directory
Number of similar (implementation,compiler) pairs: 8, namely:
| Implementation | Compiler |
| avx2ct | gcc -march=native -mtune=native -O2 -fwrapv -fPIC -fPIE -gdwarf-4 -Wall (14.2.0) |
| avx2ct | gcc -march=native -mtune=native -O3 -fwrapv -fPIC -fPIE -gdwarf-4 -Wall (14.2.0) |
| avx2ct | gcc -march=native -mtune=native -O -fwrapv -fPIC -fPIE -gdwarf-4 -Wall (14.2.0) |
| avx2ct | gcc -march=native -mtune=native -Os -fwrapv -fPIC -fPIE -gdwarf-4 -Wall (14.2.0) |
| ref | gcc -march=native -mtune=native -O2 -fwrapv -fPIC -fPIE -gdwarf-4 -Wall (14.2.0) |
| ref | gcc -march=native -mtune=native -O3 -fwrapv -fPIC -fPIE -gdwarf-4 -Wall (14.2.0) |
| ref | gcc -march=native -mtune=native -O -fwrapv -fPIC -fPIE -gdwarf-4 -Wall (14.2.0) |
| ref | gcc -march=native -mtune=native -Os -fwrapv -fPIC -fPIE -gdwarf-4 -Wall (14.2.0) |