Test results for amd64, tripwire, crypto_kem/timer
[Page version: 20261004 16:18:08]
Measurements for amd64, tripwire, crypto_kem
Test results for amd64, tripwire, crypto_kem
Test results for crypto_kem/timer
Computer: tripwire
Microarchitecture: amd64; Zen 5 (b00f21)
Architecture: amd64
CPU ID: AuthenticAMD-00b00f21-178bfbff
SUPERCOP version: 20260831
Operation: crypto_kem
Primitive: timer
| Time | Object size | Test size | Implementation | Compiler | Benchmark date | SUPERCOP version |
| 48581 | 142501 512 0 | 184506 1768 2456 | avx2 | gcc -march=native -mtune=native -O3 -fwrapv -fPIC -fPIE -gdwarf-4 -Wall | 20260930 | 20260831 |
| 56042 | 107226 512 0 | 144802 1768 2456 | avx2 | gcc -march=native -mtune=native -O2 -fwrapv -fPIC -fPIE -gdwarf-4 -Wall | 20260930 | 20260831 |
| 64079 | 102378 512 0 | 139490 1768 2424 | avx2 | gcc -march=native -mtune=native -O -fwrapv -fPIC -fPIE -gdwarf-4 -Wall | 20260930 | 20260831 |
| 92475 | 55910 0 0 | 97602 1248 2456 | ref | gcc -march=native -mtune=native -O3 -fwrapv -fPIC -fPIE -gdwarf-4 -Wall | 20260930 | 20260831 |
| 309012 | 21065 0 0 | 58434 1248 2456 | ref | gcc -march=native -mtune=native -O2 -fwrapv -fPIC -fPIE -gdwarf-4 -Wall | 20260930 | 20260831 |
| 393986 | 18307 0 0 | 55066 1248 2424 | ref | gcc -march=native -mtune=native -O -fwrapv -fPIC -fPIE -gdwarf-4 -Wall | 20260930 | 20260831 |
Compiler output
try.c: In file included from try-anything-timecop.c:3:
try.c: try-anything.c:26:10: fatal error: valgrind/memcheck.h: No such file or directory
try.c: 26 | #include <valgrind/memcheck.h>
try.c: | ^~~~~~~~~~~~~~~~~~~~~
try.c: compilation terminated.
Number of similar (implementation,compiler) pairs: 6, namely:
| Implementation | Compiler |
| avx2 | gcc -march=native -mtune=native -O2 -fwrapv -fPIC -fPIE -gdwarf-4 -Wall (14.2.0) |
| avx2 | gcc -march=native -mtune=native -O3 -fwrapv -fPIC -fPIE -gdwarf-4 -Wall (14.2.0) |
| avx2 | gcc -march=native -mtune=native -O -fwrapv -fPIC -fPIE -gdwarf-4 -Wall (14.2.0) |
| ref | gcc -march=native -mtune=native -O2 -fwrapv -fPIC -fPIE -gdwarf-4 -Wall (14.2.0) |
| ref | gcc -march=native -mtune=native -O3 -fwrapv -fPIC -fPIE -gdwarf-4 -Wall (14.2.0) |
| ref | gcc -march=native -mtune=native -O -fwrapv -fPIC -fPIE -gdwarf-4 -Wall (14.2.0) |
Compiler output
try.c: /usr/bin/ld: libcrypto_kem_timer.a(poly.o): in function `TiMER1_vec_vec_mult_add_p':
try.c: .../supercop-data/tripwire/amd64/try/c/gcc_-march=native_-mtune=native_-Os_-fwrapv_-fPIC_-fPIE_-gdwarf-4_-Wall/constbranchindex/crypto_kem/timer/avx2/work/poly.c:120:(.text+0x...): undefined reference to `poly_add'
try.c: /usr/bin/ld: libcrypto_kem_timer.a(poly.o): in function `TiMER1_vec_vec_mult_add_q':
try.c: .../supercop-data/tripwire/amd64/try/c/gcc_-march=native_-mtune=native_-Os_-fwrapv_-fPIC_-fPIE_-gdwarf-4_-Wall/constbranchindex/crypto_kem/timer/avx2/work/poly.c:136:(.text+0x...): undefined reference to `poly_add'
try.c: /usr/bin/ld: libcrypto_kem_timer.a(poly.o): in function `TiMER1_matrix_vec_mult_sub':
try.c: .../supercop-data/tripwire/amd64/try/c/gcc_-march=native_-mtune=native_-Os_-fwrapv_-fPIC_-fPIE_-gdwarf-4_-Wall/constbranchindex/crypto_kem/timer/avx2/work/poly.c:198:(.text+0x...): undefined reference to `poly_sub'
try.c: /usr/bin/ld: .../supercop-data/tripwire/amd64/try/c/gcc_-march=native_-mtune=native_-Os_-fwrapv_-fPIC_-fPIE_-gdwarf-4_-Wall/constbranchindex/crypto_kem/timer/avx2/work/poly.c:198:(.text+0x...): undefined reference to `poly_sub'
try.c: collect2: error: ld returned 1 exit status
Number of similar (implementation,compiler) pairs: 1, namely:
| Implementation | Compiler |
| avx2 | gcc -march=native -mtune=native -Os -fwrapv -fPIC -fPIE -gdwarf-4 -Wall (14.2.0) |
Compiler output
try.c: /usr/bin/ld: libcrypto_kem_timer.a(poly.o): in function `TiMER1_vec_vec_mult_add':
try.c: .../supercop-data/tripwire/amd64/try/c/gcc_-march=native_-mtune=native_-Os_-fwrapv_-fPIC_-fPIE_-gdwarf-4_-Wall/constbranchindex/crypto_kem/timer/ref/work/poly.c:139:(.text+0x...): undefined reference to `poly_add'
try.c: /usr/bin/ld: libcrypto_kem_timer.a(poly.o): in function `TiMER1_matrix_vec_mult_sub':
try.c: .../supercop-data/tripwire/amd64/try/c/gcc_-march=native_-mtune=native_-Os_-fwrapv_-fPIC_-fPIE_-gdwarf-4_-Wall/constbranchindex/crypto_kem/timer/ref/work/poly.c:194:(.text+0x...): undefined reference to `poly_sub'
try.c: collect2: error: ld returned 1 exit status
Number of similar (implementation,compiler) pairs: 1, namely:
| Implementation | Compiler |
| ref | gcc -march=native -mtune=native -Os -fwrapv -fPIC -fPIE -gdwarf-4 -Wall (14.2.0) |
Namespace violations
KeccakP-1600-AVX2.o ALLON a
KeccakP-1600-AVX2.o KeccakF1600_FastLoop_Absorb_avx2 T
KeccakP-1600-AVX2.o KeccakP1600_12rounds_FastLoop_Absorb_avx2 T
KeccakP-1600-AVX2.o KeccakP1600_AddByte_avx2 T
KeccakP-1600-AVX2.o KeccakP1600_AddBytes_avx2 T
KeccakP-1600-AVX2.o KeccakP1600_ExtractAndAddBytes_avx2 T
KeccakP-1600-AVX2.o KeccakP1600_ExtractBytes_avx2 T
KeccakP-1600-AVX2.o KeccakP1600_Initialize_avx2 T
KeccakP-1600-AVX2.o KeccakP1600_OverwriteBytes_avx2 T
KeccakP-1600-AVX2.o KeccakP1600_OverwriteWithZeroes_avx2 T
KeccakP-1600-AVX2.o KeccakP1600_Permute_12rounds_avx2 T
KeccakP-1600-AVX2.o KeccakP1600_Permute_24rounds_avx2 T
KeccakP-1600-AVX2.o KeccakP1600_Permute_Nrounds_avx2 T
KeccakP-1600-AVX2.o _KeccakF1600_FastLoop_Absorb_avx2 T
KeccakP-1600-AVX2.o _KeccakP1600_12rounds_FastLoop_Absorb_avx2 T
KeccakP-1600-AVX2.o _KeccakP1600_AddByte_avx2 T
KeccakP-1600-AVX2.o _KeccakP1600_AddBytes_avx2 T
KeccakP-1600-AVX2.o _KeccakP1600_ExtractAndAddBytes_avx2 T
KeccakP-1600-AVX2.o _KeccakP1600_ExtractBytes_avx2 T
KeccakP-1600-AVX2.o _KeccakP1600_Initialize_avx2 T
KeccakP-1600-AVX2.o _KeccakP1600_OverwriteBytes_avx2 T
KeccakP-1600-AVX2.o _KeccakP1600_OverwriteWithZeroes_avx2 T
KeccakP-1600-AVX2.o _KeccakP1600_Permute_12rounds_avx2 T
KeccakP-1600-AVX2.o _KeccakP1600_Permute_24rounds_avx2 T
KeccakP-1600-AVX2.o _KeccakP1600_Permute_Nrounds_avx2 T
KeccakP-1600-times4-SIMD256.o fips202x4_KeccakF1600times4_FastLoop_Absorb T
KeccakP-1600-times4-SIMD256.o fips202x4_KeccakP1600times4_12rounds_FastLoop_Absorb T
KeccakP-1600-times4-SIMD256.o fips202x4_KeccakP1600times4_AddBytes T
KeccakP-1600-times4-SIMD256.o fips202x4_KeccakP1600times4_AddLanesAll T
KeccakP-1600-times4-SIMD256.o fips202x4_KeccakP1600times4_ExtractAndAddBytes T
KeccakP-1600-times4-SIMD256.o fips202x4_KeccakP1600times4_ExtractAndAddLanesAll T
KeccakP-1600-times4-SIMD256.o fips202x4_KeccakP1600times4_ExtractBytes T
KeccakP-1600-times4-SIMD256.o fips202x4_KeccakP1600times4_ExtractLanesAll T
KeccakP-1600-times4-SIMD256.o fips202x4_KeccakP1600times4_InitializeAll T
KeccakP-1600-times4-SIMD256.o fips202x4_KeccakP1600times4_OverwriteBytes T
KeccakP-1600-times4-SIMD256.o fips202x4_KeccakP1600times4_OverwriteLanesAll T
KeccakP-1600-times4-SIMD256.o fips202x4_KeccakP1600times4_OverwriteWithZeroes T
KeccakP-1600-times4-SIMD256.o fips202x4_KeccakP1600times4_PermuteAll_12rounds T
KeccakP-1600-times4-SIMD256.o fips202x4_KeccakP1600times4_PermuteAll_24rounds T
basemul.o TiMER_nttmul_poly_basemul_montgomery T
basemul.o TiMER_nttmul_polyvec_basemul_acc_montgomery T
cbd.o TiMER1_poly_cbd T
ciphertext.o TiMER1_computeC1 T
ciphertext.o TiMER1_computeC2 T
consts10753.o TiMER_nttmul_pdata10753 R
consts7681.o TiMER_nttmul_pdata7681 R
dg.o TiMER1_addGaussianError T
dg.o TiMER1_addGaussianErrorVec T
fips202.o fips202avx_sha3_256 T
fips202.o fips202avx_sha3_256_absorb T
fips202.o fips202avx_sha3_256_finalize T
fips202.o fips202avx_sha3_256_init T
fips202.o fips202avx_sha3_512 T
fips202.o fips202avx_sha3_512_absorb T
fips202.o fips202avx_sha3_512_finalize T
fips202.o fips202avx_sha3_512_init T
fips202.o fips202avx_shake128 T
fips202.o fips202avx_shake128_absorb T
fips202.o fips202avx_shake128_finalize T
fips202.o fips202avx_shake128_init T
fips202.o fips202avx_shake128_squeeze T
fips202.o fips202avx_shake256 T
fips202.o fips202avx_shake256_absorb T
fips202.o fips202avx_shake256_finalize T
fips202.o fips202avx_shake256_init T
fips202.o fips202avx_shake256_squeeze T
fips202x4.o fips202x4_shake128x4 T
fips202x4.o fips202x4_shake128x4_absorb_once T
fips202x4.o fips202x4_shake128x4_squeezeblocks T
fips202x4.o fips202x4_shake256x4 T
fips202x4.o fips202x4_shake256x4_absorb_once T
fips202x4.o fips202x4_shake256x4_squeezeblocks T
hash.o TiMER1_shake256_absorb_twice_squeeze T
hwt.o TiMER1_hwt T
indcpa.o TiMER1_genRx_vec T
indcpa.o TiMER1_indcpa_dec T
indcpa.o TiMER1_indcpa_enc T
indcpa.o TiMER1_indcpa_keypair T
invntt.o TiMER_nttmul_poly_invntt_tomont T
io.o TiMER1_load_from_file T
io.o TiMER1_load_from_file_pk T
io.o TiMER1_load_from_file_sk T
io.o TiMER1_load_from_string T
io.o TiMER1_load_from_string_pk T
io.o TiMER1_load_from_string_sk T
io.o TiMER1_save_to_file T
io.o TiMER1_save_to_file_pk T
io.o TiMER1_save_to_file_sk T
io.o TiMER1_save_to_string T
io.o TiMER1_save_to_string_pk T
io.o TiMER1_save_to_string_sk T
key.o TiMER1_genAx T
key.o TiMER1_genBx T
key.o TiMER1_genPubkey T
key.o TiMER1_genSx_vec T
ntt-asm.o TiMER_nttmul_poly_ntt T
ntt.o TiMER_nttmul_poly_crt T
ntt.o TiMER_nttmul_poly_mul T
ntt.o TiMER_nttmul_polyvec_crt T
ntt.o TiMER_nttmul_polyvec_invntt_tomont T
ntt.o TiMER_nttmul_polyvec_iprod T
ntt.o TiMER_nttmul_polyvec_iprod_ntt T
ntt.o TiMER_nttmul_polyvec_matrix_vector_mul T
ntt.o TiMER_nttmul_polyvec_ntt T
pack.o TiMER1_Rp2_to_bytes T
pack.o TiMER1_Rp_to_bytes T
pack.o TiMER1_Rp_vec_to_bytes T
pack.o TiMER1_Rq_mat_to_bytes T
pack.o TiMER1_Rq_to_bytes T
pack.o TiMER1_Rq_vec_to_bytes T
pack.o TiMER1_Sx_to_bytes T
pack.o TiMER1_bytes_to_Rp T
pack.o TiMER1_bytes_to_Rp2 T
pack.o TiMER1_bytes_to_Rp_vec T
pack.o TiMER1_bytes_to_Rq T
pack.o TiMER1_bytes_to_Rq_mat T
pack.o TiMER1_bytes_to_Rq_vec T
pack.o TiMER1_bytes_to_Sx T
poly.o TiMER1_matrix_vec_mult_add T
poly.o TiMER1_matrix_vec_mult_sub T
poly.o TiMER1_vec_vec_mult_add_p T
poly.o TiMER1_vec_vec_mult_add_q T
poly.o flipabs T
poly.o poly_frommsg T
poly.o poly_tomsg T
verify.o TiMER1_cmov T
verify.o TiMER1_verify T
Number of similar (implementation,compiler) pairs: 3, namely:
| Implementation | Compiler |
| avx2 | gcc -march=native -mtune=native -O2 -fwrapv -fPIC -fPIE -gdwarf-4 -Wall (14.2.0) |
| avx2 | gcc -march=native -mtune=native -O3 -fwrapv -fPIC -fPIE -gdwarf-4 -Wall (14.2.0) |
| avx2 | gcc -march=native -mtune=native -O -fwrapv -fPIC -fPIE -gdwarf-4 -Wall (14.2.0) |
Namespace violations
cbd.o TiMER1_poly_cbd T
ciphertext.o TiMER1_computeC1 T
ciphertext.o TiMER1_computeC2 T
dg.o TiMER1_addGaussianError T
dg.o TiMER1_addGaussianErrorVec T
fips202.o KeccakF_RoundConstants R
fips202.o sha3_256 T
fips202.o sha3_512 T
fips202.o shake128 T
fips202.o shake128_absorb T
fips202.o shake128_absorb_once T
fips202.o shake128_finalize T
fips202.o shake128_init T
fips202.o shake128_squeeze T
fips202.o shake128_squeezeblocks T
fips202.o shake256 T
fips202.o shake256_absorb T
fips202.o shake256_absorb_once T
fips202.o shake256_finalize T
fips202.o shake256_init T
fips202.o shake256_squeeze T
fips202.o shake256_squeezeblocks T
hash.o TiMER1_shake256_absorb_twice_squeeze T
hwt.o TiMER1_hwt T
indcpa.o TiMER1_genRx_vec T
indcpa.o TiMER1_indcpa_dec T
indcpa.o TiMER1_indcpa_enc T
indcpa.o TiMER1_indcpa_keypair T
io.o TiMER1_load_from_file T
io.o TiMER1_load_from_file_pk T
io.o TiMER1_load_from_file_sk T
io.o TiMER1_load_from_string T
io.o TiMER1_load_from_string_pk T
io.o TiMER1_load_from_string_sk T
io.o TiMER1_save_to_file T
io.o TiMER1_save_to_file_pk T
io.o TiMER1_save_to_file_sk T
io.o TiMER1_save_to_string T
io.o TiMER1_save_to_string_pk T
io.o TiMER1_save_to_string_sk T
key.o TiMER1_genAx T
key.o TiMER1_genBx T
key.o TiMER1_genPubkey T
key.o TiMER1_genSx_vec T
pack.o TiMER1_Rp2_to_bytes T
pack.o TiMER1_Rp_to_bytes T
pack.o TiMER1_Rp_vec_to_bytes T
pack.o TiMER1_Rq_mat_to_bytes T
pack.o TiMER1_Rq_to_bytes T
pack.o TiMER1_Rq_vec_to_bytes T
pack.o TiMER1_Sx_to_bytes T
pack.o TiMER1_bytes_to_Rp T
pack.o TiMER1_bytes_to_Rp2 T
pack.o TiMER1_bytes_to_Rp_vec T
pack.o TiMER1_bytes_to_Rq T
pack.o TiMER1_bytes_to_Rq_mat T
pack.o TiMER1_bytes_to_Rq_vec T
pack.o TiMER1_bytes_to_Sx T
poly.o TiMER1_matrix_vec_mult_add T
poly.o TiMER1_matrix_vec_mult_sub T
poly.o TiMER1_vec_vec_mult_add T
poly.o flipabs T
poly.o poly_frommsg T
poly.o poly_tomsg T
poly.o vec_vec_mult T
toomcook.o TiMER1_poly_mul_acc T
verify.o TiMER1_cmov T
verify.o TiMER1_verify T
Number of similar (implementation,compiler) pairs: 3, namely:
| Implementation | Compiler |
| ref | gcc -march=native -mtune=native -O2 -fwrapv -fPIC -fPIE -gdwarf-4 -Wall (14.2.0) |
| ref | gcc -march=native -mtune=native -O3 -fwrapv -fPIC -fPIE -gdwarf-4 -Wall (14.2.0) |
| ref | gcc -march=native -mtune=native -O -fwrapv -fPIC -fPIE -gdwarf-4 -Wall (14.2.0) |
TIMECOP error (can be valgrind bug)
error 127
timeout: failed to run command 'valgrind': No such file or directory
Number of similar (implementation,compiler) pairs: 6, namely:
| Implementation | Compiler |
| avx2 | gcc -march=native -mtune=native -O2 -fwrapv -fPIC -fPIE -gdwarf-4 -Wall (14.2.0) |
| avx2 | gcc -march=native -mtune=native -O3 -fwrapv -fPIC -fPIE -gdwarf-4 -Wall (14.2.0) |
| avx2 | gcc -march=native -mtune=native -O -fwrapv -fPIC -fPIE -gdwarf-4 -Wall (14.2.0) |
| ref | gcc -march=native -mtune=native -O2 -fwrapv -fPIC -fPIE -gdwarf-4 -Wall (14.2.0) |
| ref | gcc -march=native -mtune=native -O3 -fwrapv -fPIC -fPIE -gdwarf-4 -Wall (14.2.0) |
| ref | gcc -march=native -mtune=native -O -fwrapv -fPIC -fPIE -gdwarf-4 -Wall (14.2.0) |