Test results for amd64, tripwire, crypto_kem/smaugt1
[Page version: 20261004 16:18:08]
Measurements for amd64, tripwire, crypto_kem
Test results for amd64, tripwire, crypto_kem
Test results for crypto_kem/smaugt1
Computer: tripwire
Microarchitecture: amd64; Zen 5 (b00f21)
Architecture: amd64
CPU ID: AuthenticAMD-00b00f21-178bfbff
SUPERCOP version: 20260831
Operation: crypto_kem
Primitive: smaugt1
| Time | Object size | Test size | Implementation | Compiler | Benchmark date | SUPERCOP version |
| 48202 | 142470 512 0 | 184378 1768 2456 | avx2 | gcc -march=native -mtune=native -O3 -fwrapv -fPIC -fPIE -gdwarf-4 -Wall | 20260930 | 20260831 |
| 56571 | 107023 512 0 | 144570 1768 2456 | avx2 | gcc -march=native -mtune=native -O2 -fwrapv -fPIC -fPIE -gdwarf-4 -Wall | 20260930 | 20260831 |
| 59833 | 102189 512 0 | 139282 1768 2424 | avx2 | gcc -march=native -mtune=native -O -fwrapv -fPIC -fPIE -gdwarf-4 -Wall | 20260930 | 20260831 |
| 92163 | 55852 0 0 | 97474 1248 2456 | ref | gcc -march=native -mtune=native -O3 -fwrapv -fPIC -fPIE -gdwarf-4 -Wall | 20260930 | 20260831 |
| 310547 | 20851 0 0 | 58138 1248 2456 | ref | gcc -march=native -mtune=native -O2 -fwrapv -fPIC -fPIE -gdwarf-4 -Wall | 20260930 | 20260831 |
| 393572 | 18139 0 0 | 54986 1248 2424 | ref | gcc -march=native -mtune=native -O -fwrapv -fPIC -fPIE -gdwarf-4 -Wall | 20260930 | 20260831 |
Compiler output
try.c: In file included from try-anything-timecop.c:3:
try.c: try-anything.c:26:10: fatal error: valgrind/memcheck.h: No such file or directory
try.c: 26 | #include <valgrind/memcheck.h>
try.c: | ^~~~~~~~~~~~~~~~~~~~~
try.c: compilation terminated.
Number of similar (implementation,compiler) pairs: 6, namely:
| Implementation | Compiler |
| avx2 | gcc -march=native -mtune=native -O2 -fwrapv -fPIC -fPIE -gdwarf-4 -Wall (14.2.0) |
| avx2 | gcc -march=native -mtune=native -O3 -fwrapv -fPIC -fPIE -gdwarf-4 -Wall (14.2.0) |
| avx2 | gcc -march=native -mtune=native -O -fwrapv -fPIC -fPIE -gdwarf-4 -Wall (14.2.0) |
| ref | gcc -march=native -mtune=native -O2 -fwrapv -fPIC -fPIE -gdwarf-4 -Wall (14.2.0) |
| ref | gcc -march=native -mtune=native -O3 -fwrapv -fPIC -fPIE -gdwarf-4 -Wall (14.2.0) |
| ref | gcc -march=native -mtune=native -O -fwrapv -fPIC -fPIE -gdwarf-4 -Wall (14.2.0) |
Compiler output
try.c: /usr/bin/ld: libcrypto_kem_smaugt1.a(poly.o): in function `cryptolab_smaug1_vec_vec_mult_add_p':
try.c: .../supercop-data/tripwire/amd64/try/c/gcc_-march=native_-mtune=native_-Os_-fwrapv_-fPIC_-fPIE_-gdwarf-4_-Wall/constbranchindex/crypto_kem/smaugt1/avx2/work/poly.c:58:(.text+0x...): undefined reference to `poly_add'
try.c: /usr/bin/ld: libcrypto_kem_smaugt1.a(poly.o): in function `cryptolab_smaug1_vec_vec_mult_add_q':
try.c: .../supercop-data/tripwire/amd64/try/c/gcc_-march=native_-mtune=native_-Os_-fwrapv_-fPIC_-fPIE_-gdwarf-4_-Wall/constbranchindex/crypto_kem/smaugt1/avx2/work/poly.c:74:(.text+0x...): undefined reference to `poly_add'
try.c: /usr/bin/ld: libcrypto_kem_smaugt1.a(poly.o): in function `cryptolab_smaug1_matrix_vec_mult_sub':
try.c: .../supercop-data/tripwire/amd64/try/c/gcc_-march=native_-mtune=native_-Os_-fwrapv_-fPIC_-fPIE_-gdwarf-4_-Wall/constbranchindex/crypto_kem/smaugt1/avx2/work/poly.c:136:(.text+0x...): undefined reference to `poly_sub'
try.c: /usr/bin/ld: .../supercop-data/tripwire/amd64/try/c/gcc_-march=native_-mtune=native_-Os_-fwrapv_-fPIC_-fPIE_-gdwarf-4_-Wall/constbranchindex/crypto_kem/smaugt1/avx2/work/poly.c:136:(.text+0x...): undefined reference to `poly_sub'
try.c: collect2: error: ld returned 1 exit status
Number of similar (implementation,compiler) pairs: 1, namely:
| Implementation | Compiler |
| avx2 | gcc -march=native -mtune=native -Os -fwrapv -fPIC -fPIE -gdwarf-4 -Wall (14.2.0) |
Compiler output
try.c: /usr/bin/ld: libcrypto_kem_smaugt1.a(poly.o): in function `cryptolab_smaug1_vec_vec_mult_add':
try.c: .../supercop-data/tripwire/amd64/try/c/gcc_-march=native_-mtune=native_-Os_-fwrapv_-fPIC_-fPIE_-gdwarf-4_-Wall/constbranchindex/crypto_kem/smaugt1/ref/work/poly.c:77:(.text+0x...): undefined reference to `poly_add'
try.c: /usr/bin/ld: libcrypto_kem_smaugt1.a(poly.o): in function `cryptolab_smaug1_matrix_vec_mult_sub':
try.c: .../supercop-data/tripwire/amd64/try/c/gcc_-march=native_-mtune=native_-Os_-fwrapv_-fPIC_-fPIE_-gdwarf-4_-Wall/constbranchindex/crypto_kem/smaugt1/ref/work/poly.c:132:(.text+0x...): undefined reference to `poly_sub'
try.c: collect2: error: ld returned 1 exit status
Number of similar (implementation,compiler) pairs: 1, namely:
| Implementation | Compiler |
| ref | gcc -march=native -mtune=native -Os -fwrapv -fPIC -fPIE -gdwarf-4 -Wall (14.2.0) |
Namespace violations
KeccakP-1600-AVX2.o ALLON a
KeccakP-1600-AVX2.o KeccakF1600_FastLoop_Absorb_avx2 T
KeccakP-1600-AVX2.o KeccakP1600_12rounds_FastLoop_Absorb_avx2 T
KeccakP-1600-AVX2.o KeccakP1600_AddByte_avx2 T
KeccakP-1600-AVX2.o KeccakP1600_AddBytes_avx2 T
KeccakP-1600-AVX2.o KeccakP1600_ExtractAndAddBytes_avx2 T
KeccakP-1600-AVX2.o KeccakP1600_ExtractBytes_avx2 T
KeccakP-1600-AVX2.o KeccakP1600_Initialize_avx2 T
KeccakP-1600-AVX2.o KeccakP1600_OverwriteBytes_avx2 T
KeccakP-1600-AVX2.o KeccakP1600_OverwriteWithZeroes_avx2 T
KeccakP-1600-AVX2.o KeccakP1600_Permute_12rounds_avx2 T
KeccakP-1600-AVX2.o KeccakP1600_Permute_24rounds_avx2 T
KeccakP-1600-AVX2.o KeccakP1600_Permute_Nrounds_avx2 T
KeccakP-1600-AVX2.o _KeccakF1600_FastLoop_Absorb_avx2 T
KeccakP-1600-AVX2.o _KeccakP1600_12rounds_FastLoop_Absorb_avx2 T
KeccakP-1600-AVX2.o _KeccakP1600_AddByte_avx2 T
KeccakP-1600-AVX2.o _KeccakP1600_AddBytes_avx2 T
KeccakP-1600-AVX2.o _KeccakP1600_ExtractAndAddBytes_avx2 T
KeccakP-1600-AVX2.o _KeccakP1600_ExtractBytes_avx2 T
KeccakP-1600-AVX2.o _KeccakP1600_Initialize_avx2 T
KeccakP-1600-AVX2.o _KeccakP1600_OverwriteBytes_avx2 T
KeccakP-1600-AVX2.o _KeccakP1600_OverwriteWithZeroes_avx2 T
KeccakP-1600-AVX2.o _KeccakP1600_Permute_12rounds_avx2 T
KeccakP-1600-AVX2.o _KeccakP1600_Permute_24rounds_avx2 T
KeccakP-1600-AVX2.o _KeccakP1600_Permute_Nrounds_avx2 T
KeccakP-1600-times4-SIMD256.o fips202x4_KeccakF1600times4_FastLoop_Absorb T
KeccakP-1600-times4-SIMD256.o fips202x4_KeccakP1600times4_12rounds_FastLoop_Absorb T
KeccakP-1600-times4-SIMD256.o fips202x4_KeccakP1600times4_AddBytes T
KeccakP-1600-times4-SIMD256.o fips202x4_KeccakP1600times4_AddLanesAll T
KeccakP-1600-times4-SIMD256.o fips202x4_KeccakP1600times4_ExtractAndAddBytes T
KeccakP-1600-times4-SIMD256.o fips202x4_KeccakP1600times4_ExtractAndAddLanesAll T
KeccakP-1600-times4-SIMD256.o fips202x4_KeccakP1600times4_ExtractBytes T
KeccakP-1600-times4-SIMD256.o fips202x4_KeccakP1600times4_ExtractLanesAll T
KeccakP-1600-times4-SIMD256.o fips202x4_KeccakP1600times4_InitializeAll T
KeccakP-1600-times4-SIMD256.o fips202x4_KeccakP1600times4_OverwriteBytes T
KeccakP-1600-times4-SIMD256.o fips202x4_KeccakP1600times4_OverwriteLanesAll T
KeccakP-1600-times4-SIMD256.o fips202x4_KeccakP1600times4_OverwriteWithZeroes T
KeccakP-1600-times4-SIMD256.o fips202x4_KeccakP1600times4_PermuteAll_12rounds T
KeccakP-1600-times4-SIMD256.o fips202x4_KeccakP1600times4_PermuteAll_24rounds T
basemul.o smaug1_nttmul_poly_basemul_montgomery T
basemul.o smaug1_nttmul_polyvec_basemul_acc_montgomery T
cbd.o cryptolab_smaug1_poly_cbd T
ciphertext.o cryptolab_smaug1_computeC1 T
ciphertext.o cryptolab_smaug1_computeC2 T
consts10753.o smaug1_nttmul_pdata10753 R
consts7681.o smaug1_nttmul_pdata7681 R
dg.o cryptolab_smaug1_addGaussianError T
dg.o cryptolab_smaug1_addGaussianErrorVec T
fips202.o fips202avx_sha3_256 T
fips202.o fips202avx_sha3_256_absorb T
fips202.o fips202avx_sha3_256_finalize T
fips202.o fips202avx_sha3_256_init T
fips202.o fips202avx_sha3_512 T
fips202.o fips202avx_sha3_512_absorb T
fips202.o fips202avx_sha3_512_finalize T
fips202.o fips202avx_sha3_512_init T
fips202.o fips202avx_shake128 T
fips202.o fips202avx_shake128_absorb T
fips202.o fips202avx_shake128_finalize T
fips202.o fips202avx_shake128_init T
fips202.o fips202avx_shake128_squeeze T
fips202.o fips202avx_shake256 T
fips202.o fips202avx_shake256_absorb T
fips202.o fips202avx_shake256_finalize T
fips202.o fips202avx_shake256_init T
fips202.o fips202avx_shake256_squeeze T
fips202x4.o fips202x4_shake128x4 T
fips202x4.o fips202x4_shake128x4_absorb_once T
fips202x4.o fips202x4_shake128x4_squeezeblocks T
fips202x4.o fips202x4_shake256x4 T
fips202x4.o fips202x4_shake256x4_absorb_once T
fips202x4.o fips202x4_shake256x4_squeezeblocks T
hash.o cryptolab_smaug1_shake256_absorb_twice_squeeze T
hwt.o cryptolab_smaug1_hwt T
indcpa.o cryptolab_smaug1_genRx_vec T
indcpa.o cryptolab_smaug1_indcpa_dec T
indcpa.o cryptolab_smaug1_indcpa_enc T
indcpa.o cryptolab_smaug1_indcpa_keypair T
invntt.o smaug1_nttmul_poly_invntt_tomont T
io.o cryptolab_smaug1_load_from_file T
io.o cryptolab_smaug1_load_from_file_pk T
io.o cryptolab_smaug1_load_from_file_sk T
io.o cryptolab_smaug1_load_from_string T
io.o cryptolab_smaug1_load_from_string_pk T
io.o cryptolab_smaug1_load_from_string_sk T
io.o cryptolab_smaug1_save_to_file T
io.o cryptolab_smaug1_save_to_file_pk T
io.o cryptolab_smaug1_save_to_file_sk T
io.o cryptolab_smaug1_save_to_string T
io.o cryptolab_smaug1_save_to_string_pk T
io.o cryptolab_smaug1_save_to_string_sk T
key.o cryptolab_smaug1_genAx T
key.o cryptolab_smaug1_genBx T
key.o cryptolab_smaug1_genPubkey T
key.o cryptolab_smaug1_genSx_vec T
ntt-asm.o smaug1_nttmul_poly_ntt T
ntt.o smaug1_nttmul_poly_crt T
ntt.o smaug1_nttmul_poly_mul T
ntt.o smaug1_nttmul_polyvec_crt T
ntt.o smaug1_nttmul_polyvec_invntt_tomont T
ntt.o smaug1_nttmul_polyvec_iprod T
ntt.o smaug1_nttmul_polyvec_iprod_ntt T
ntt.o smaug1_nttmul_polyvec_matrix_vector_mul T
ntt.o smaug1_nttmul_polyvec_ntt T
pack.o cryptolab_smaug1_Rp2_to_bytes T
pack.o cryptolab_smaug1_Rp_to_bytes T
pack.o cryptolab_smaug1_Rp_vec_to_bytes T
pack.o cryptolab_smaug1_Rq_mat_to_bytes T
pack.o cryptolab_smaug1_Rq_to_bytes T
pack.o cryptolab_smaug1_Rq_vec_to_bytes T
pack.o cryptolab_smaug1_Sx_to_bytes T
pack.o cryptolab_smaug1_bytes_to_Rp T
pack.o cryptolab_smaug1_bytes_to_Rp2 T
pack.o cryptolab_smaug1_bytes_to_Rp_vec T
pack.o cryptolab_smaug1_bytes_to_Rq T
pack.o cryptolab_smaug1_bytes_to_Rq_mat T
pack.o cryptolab_smaug1_bytes_to_Rq_vec T
pack.o cryptolab_smaug1_bytes_to_Sx T
poly.o cryptolab_smaug1_matrix_vec_mult_add T
poly.o cryptolab_smaug1_matrix_vec_mult_sub T
poly.o cryptolab_smaug1_vec_vec_mult_add_p T
poly.o cryptolab_smaug1_vec_vec_mult_add_q T
verify.o cryptolab_smaug1_cmov T
verify.o cryptolab_smaug1_verify T
Number of similar (implementation,compiler) pairs: 3, namely:
| Implementation | Compiler |
| avx2 | gcc -march=native -mtune=native -O2 -fwrapv -fPIC -fPIE -gdwarf-4 -Wall (14.2.0) |
| avx2 | gcc -march=native -mtune=native -O3 -fwrapv -fPIC -fPIE -gdwarf-4 -Wall (14.2.0) |
| avx2 | gcc -march=native -mtune=native -O -fwrapv -fPIC -fPIE -gdwarf-4 -Wall (14.2.0) |
Namespace violations
cbd.o cryptolab_smaug1_poly_cbd T
ciphertext.o cryptolab_smaug1_computeC1 T
ciphertext.o cryptolab_smaug1_computeC2 T
dg.o cryptolab_smaug1_addGaussianError T
dg.o cryptolab_smaug1_addGaussianErrorVec T
fips202.o KeccakF_RoundConstants R
fips202.o sha3_256 T
fips202.o sha3_512 T
fips202.o shake128 T
fips202.o shake128_absorb T
fips202.o shake128_absorb_once T
fips202.o shake128_finalize T
fips202.o shake128_init T
fips202.o shake128_squeeze T
fips202.o shake128_squeezeblocks T
fips202.o shake256 T
fips202.o shake256_absorb T
fips202.o shake256_absorb_once T
fips202.o shake256_finalize T
fips202.o shake256_init T
fips202.o shake256_squeeze T
fips202.o shake256_squeezeblocks T
hash.o cryptolab_smaug1_shake256_absorb_twice_squeeze T
hwt.o cryptolab_smaug1_hwt T
indcpa.o cryptolab_smaug1_genRx_vec T
indcpa.o cryptolab_smaug1_indcpa_dec T
indcpa.o cryptolab_smaug1_indcpa_enc T
indcpa.o cryptolab_smaug1_indcpa_keypair T
io.o cryptolab_smaug1_load_from_file T
io.o cryptolab_smaug1_load_from_file_pk T
io.o cryptolab_smaug1_load_from_file_sk T
io.o cryptolab_smaug1_load_from_string T
io.o cryptolab_smaug1_load_from_string_pk T
io.o cryptolab_smaug1_load_from_string_sk T
io.o cryptolab_smaug1_save_to_file T
io.o cryptolab_smaug1_save_to_file_pk T
io.o cryptolab_smaug1_save_to_file_sk T
io.o cryptolab_smaug1_save_to_string T
io.o cryptolab_smaug1_save_to_string_pk T
io.o cryptolab_smaug1_save_to_string_sk T
key.o cryptolab_smaug1_genAx T
key.o cryptolab_smaug1_genBx T
key.o cryptolab_smaug1_genPubkey T
key.o cryptolab_smaug1_genSx_vec T
pack.o cryptolab_smaug1_Rp2_to_bytes T
pack.o cryptolab_smaug1_Rp_to_bytes T
pack.o cryptolab_smaug1_Rp_vec_to_bytes T
pack.o cryptolab_smaug1_Rq_mat_to_bytes T
pack.o cryptolab_smaug1_Rq_to_bytes T
pack.o cryptolab_smaug1_Rq_vec_to_bytes T
pack.o cryptolab_smaug1_Sx_to_bytes T
pack.o cryptolab_smaug1_bytes_to_Rp T
pack.o cryptolab_smaug1_bytes_to_Rp2 T
pack.o cryptolab_smaug1_bytes_to_Rp_vec T
pack.o cryptolab_smaug1_bytes_to_Rq T
pack.o cryptolab_smaug1_bytes_to_Rq_mat T
pack.o cryptolab_smaug1_bytes_to_Rq_vec T
pack.o cryptolab_smaug1_bytes_to_Sx T
poly.o cryptolab_smaug1_matrix_vec_mult_add T
poly.o cryptolab_smaug1_matrix_vec_mult_sub T
poly.o cryptolab_smaug1_vec_vec_mult_add T
poly.o vec_vec_mult T
toomcook.o cryptolab_smaug1_poly_mul_acc T
verify.o cryptolab_smaug1_cmov T
verify.o cryptolab_smaug1_verify T
Number of similar (implementation,compiler) pairs: 3, namely:
| Implementation | Compiler |
| ref | gcc -march=native -mtune=native -O2 -fwrapv -fPIC -fPIE -gdwarf-4 -Wall (14.2.0) |
| ref | gcc -march=native -mtune=native -O3 -fwrapv -fPIC -fPIE -gdwarf-4 -Wall (14.2.0) |
| ref | gcc -march=native -mtune=native -O -fwrapv -fPIC -fPIE -gdwarf-4 -Wall (14.2.0) |
TIMECOP error (can be valgrind bug)
error 127
timeout: failed to run command 'valgrind': No such file or directory
Number of similar (implementation,compiler) pairs: 6, namely:
| Implementation | Compiler |
| avx2 | gcc -march=native -mtune=native -O2 -fwrapv -fPIC -fPIE -gdwarf-4 -Wall (14.2.0) |
| avx2 | gcc -march=native -mtune=native -O3 -fwrapv -fPIC -fPIE -gdwarf-4 -Wall (14.2.0) |
| avx2 | gcc -march=native -mtune=native -O -fwrapv -fPIC -fPIE -gdwarf-4 -Wall (14.2.0) |
| ref | gcc -march=native -mtune=native -O2 -fwrapv -fPIC -fPIE -gdwarf-4 -Wall (14.2.0) |
| ref | gcc -march=native -mtune=native -O3 -fwrapv -fPIC -fPIE -gdwarf-4 -Wall (14.2.0) |
| ref | gcc -march=native -mtune=native -O -fwrapv -fPIC -fPIE -gdwarf-4 -Wall (14.2.0) |