Test results for amd64, tripwire, crypto_aead/omdsha512k128n128tau128v2
[Page version: 20261005 15:57:56]
Measurements for amd64, tripwire, crypto_aead
Test results for amd64, tripwire, crypto_aead
Test results for crypto_aead/omdsha512k128n128tau128v2
Computer: tripwire
Microarchitecture: amd64; Zen 5 (b00f21)
Architecture: amd64
CPU ID: AuthenticAMD-00b00f21-178bfbff
SUPERCOP version: 20261004
Operation: crypto_aead
Primitive: omdsha512k128n128tau128v2
| Time | Object size | Test size | Implementation | Compiler | Benchmark date | SUPERCOP version |
| 80421 | 16084 0 0 | 52527 1216 1784 | T:ref | gcc -march=native -mtune=native -O3 -fwrapv -fPIC -fPIE -gdwarf-4 -Wall | 20261004 | 20260831 |
| 91048 | 6750 0 0 | 38695 1216 1784 | T:ref | gcc -march=native -mtune=native -O2 -fwrapv -fPIC -fPIE -gdwarf-4 -Wall | 20261004 | 20260831 |
| 120035 | 5515 0 0 | 36574 1208 1720 | T:ref | gcc -march=native -mtune=native -O -fwrapv -fPIC -fPIE -gdwarf-4 -Wall | 20261004 | 20260831 |
| 124958 | 4592 0 0 | 33762 1192 1688 | T:ref | gcc -march=native -mtune=native -Os -fwrapv -fPIC -fPIE -gdwarf-4 -Wall | 20261004 | 20260831 |
Compiler output
omdsha512.c: In function 'xor_block',
omdsha512.c: inlined from 'omdsha512_process' at omdsha512.c:308:5:
omdsha512.c: omdsha512.c:15:38: warning: 'tage' may be used uninitialized [-Wmaybe-uninitialized]
omdsha512.c: 15 | res[i] = in1[i] ^ in2[i];
omdsha512.c: | ~~~^~~
omdsha512.c: omdsha512.c: In function 'omdsha512_process':
omdsha512.c: omdsha512.c:260:15: note: 'tage' declared here
omdsha512.c: 260 | hashblock tage;
omdsha512.c: | ^~~~
try.c: /usr/bin/ld: libcrypto_aead_omdsha512k128n128tau128v2.a(omdsha512.o):.../supercop-data/tripwire/amd64/try/c/gcc_-march=native_-mtune=native_-O2_-fwrapv_-fPIC_-fPIE_-gdwarf-4_-Wall/timingleaks/crypto_aead/omdsha512k128n128tau128v2/avx1/work/omdsha512.h:146: multiple definition of `Hash'; libcrypto_aead_omdsha512k128n128tau128v2.a(encrypt.o):.../supercop-data/tripwire/amd64/try/c/gcc_-march=native_-mtune=native_-O2_-fwrapv_-fPIC_-fPIE_-gdwarf-4_-Wall/timingleaks/crypto_aead/omdsha512k128n128tau128v2/avx1/work/omdsha512.h:146: first defined here
try.c: collect2: error: ld returned 1 exit status
Number of similar (implementation,compiler) pairs: 1, namely:
| Implementation | Compiler |
| T:avx1 | gcc -march=native -mtune=native -O2 -fwrapv -fPIC -fPIE -gdwarf-4 -Wall (14.2.0) |
Compiler output
omdsha512.c: In function 'xor_block',
omdsha512.c: inlined from 'omdsha512_process' at omdsha512.c:308:5:
omdsha512.c: omdsha512.c:15:38: warning: 'tage' may be used uninitialized [-Wmaybe-uninitialized]
omdsha512.c: 15 | res[i] = in1[i] ^ in2[i];
omdsha512.c: | ~~~^~~
omdsha512.c: omdsha512.c: In function 'omdsha512_process':
omdsha512.c: omdsha512.c:260:15: note: 'tage' declared here
omdsha512.c: 260 | hashblock tage;
omdsha512.c: | ^~~~
try.c: /usr/bin/ld: libcrypto_aead_omdsha512k128n128tau128v2.a(omdsha512.o):.../supercop-data/tripwire/amd64/try/c/gcc_-march=native_-mtune=native_-O3_-fwrapv_-fPIC_-fPIE_-gdwarf-4_-Wall/timingleaks/crypto_aead/omdsha512k128n128tau128v2/avx1/work/omdsha512.h:146: multiple definition of `Hash'; libcrypto_aead_omdsha512k128n128tau128v2.a(encrypt.o):.../supercop-data/tripwire/amd64/try/c/gcc_-march=native_-mtune=native_-O3_-fwrapv_-fPIC_-fPIE_-gdwarf-4_-Wall/timingleaks/crypto_aead/omdsha512k128n128tau128v2/avx1/work/omdsha512.h:146: first defined here
try.c: collect2: error: ld returned 1 exit status
Number of similar (implementation,compiler) pairs: 1, namely:
| Implementation | Compiler |
| T:avx1 | gcc -march=native -mtune=native -O3 -fwrapv -fPIC -fPIE -gdwarf-4 -Wall (14.2.0) |
Compiler output
try.c: /usr/bin/ld: libcrypto_aead_omdsha512k128n128tau128v2.a(omdsha512.o):.../supercop-data/tripwire/amd64/try/c/gcc_-march=native_-mtune=native_-O_-fwrapv_-fPIC_-fPIE_-gdwarf-4_-Wall/timingleaks/crypto_aead/omdsha512k128n128tau128v2/avx1/work/omdsha512.h:146: multiple definition of `Hash'; libcrypto_aead_omdsha512k128n128tau128v2.a(encrypt.o):.../supercop-data/tripwire/amd64/try/c/gcc_-march=native_-mtune=native_-O_-fwrapv_-fPIC_-fPIE_-gdwarf-4_-Wall/timingleaks/crypto_aead/omdsha512k128n128tau128v2/avx1/work/omdsha512.h:146: first defined here
try.c: collect2: error: ld returned 1 exit status
Number of similar (implementation,compiler) pairs: 1, namely:
| Implementation | Compiler |
| T:avx1 | gcc -march=native -mtune=native -O -fwrapv -fPIC -fPIE -gdwarf-4 -Wall (14.2.0) |
Compiler output
try.c: /usr/bin/ld: libcrypto_aead_omdsha512k128n128tau128v2.a(omdsha512.o):.../supercop-data/tripwire/amd64/try/c/gcc_-march=native_-mtune=native_-Os_-fwrapv_-fPIC_-fPIE_-gdwarf-4_-Wall/timingleaks/crypto_aead/omdsha512k128n128tau128v2/avx1/work/omdsha512.h:146: multiple definition of `Hash'; libcrypto_aead_omdsha512k128n128tau128v2.a(encrypt.o):.../supercop-data/tripwire/amd64/try/c/gcc_-march=native_-mtune=native_-Os_-fwrapv_-fPIC_-fPIE_-gdwarf-4_-Wall/timingleaks/crypto_aead/omdsha512k128n128tau128v2/avx1/work/omdsha512.h:146: first defined here
try.c: collect2: error: ld returned 1 exit status
Number of similar (implementation,compiler) pairs: 1, namely:
| Implementation | Compiler |
| T:avx1 | gcc -march=native -mtune=native -Os -fwrapv -fPIC -fPIE -gdwarf-4 -Wall (14.2.0) |
Compiler output
omdsha512.c: In function 'xor_block',
omdsha512.c: inlined from 'omdsha512_process' at omdsha512.c:308:5:
omdsha512.c: omdsha512.c:15:38: warning: 'tage' may be used uninitialized [-Wmaybe-uninitialized]
omdsha512.c: 15 | res[i] = in1[i] ^ in2[i];
omdsha512.c: | ~~~^~~
omdsha512.c: omdsha512.c: In function 'omdsha512_process':
omdsha512.c: omdsha512.c:260:15: note: 'tage' declared here
omdsha512.c: 260 | hashblock tage;
omdsha512.c: | ^~~~
try.c: /usr/bin/ld: libcrypto_aead_omdsha512k128n128tau128v2.a(omdsha512.o):.../supercop-data/tripwire/amd64/try/c/gcc_-march=native_-mtune=native_-O2_-fwrapv_-fPIC_-fPIE_-gdwarf-4_-Wall/timingleaks/crypto_aead/omdsha512k128n128tau128v2/sse4/work/omdsha512.h:146: multiple definition of `Hash'; libcrypto_aead_omdsha512k128n128tau128v2.a(encrypt.o):.../supercop-data/tripwire/amd64/try/c/gcc_-march=native_-mtune=native_-O2_-fwrapv_-fPIC_-fPIE_-gdwarf-4_-Wall/timingleaks/crypto_aead/omdsha512k128n128tau128v2/sse4/work/omdsha512.h:146: first defined here
try.c: collect2: error: ld returned 1 exit status
Number of similar (implementation,compiler) pairs: 1, namely:
| Implementation | Compiler |
| T:sse4 | gcc -march=native -mtune=native -O2 -fwrapv -fPIC -fPIE -gdwarf-4 -Wall (14.2.0) |
Compiler output
omdsha512.c: In function 'xor_block',
omdsha512.c: inlined from 'omdsha512_process' at omdsha512.c:308:5:
omdsha512.c: omdsha512.c:15:38: warning: 'tage' may be used uninitialized [-Wmaybe-uninitialized]
omdsha512.c: 15 | res[i] = in1[i] ^ in2[i];
omdsha512.c: | ~~~^~~
omdsha512.c: omdsha512.c: In function 'omdsha512_process':
omdsha512.c: omdsha512.c:260:15: note: 'tage' declared here
omdsha512.c: 260 | hashblock tage;
omdsha512.c: | ^~~~
try.c: /usr/bin/ld: libcrypto_aead_omdsha512k128n128tau128v2.a(omdsha512.o):.../supercop-data/tripwire/amd64/try/c/gcc_-march=native_-mtune=native_-O3_-fwrapv_-fPIC_-fPIE_-gdwarf-4_-Wall/timingleaks/crypto_aead/omdsha512k128n128tau128v2/sse4/work/omdsha512.h:146: multiple definition of `Hash'; libcrypto_aead_omdsha512k128n128tau128v2.a(encrypt.o):.../supercop-data/tripwire/amd64/try/c/gcc_-march=native_-mtune=native_-O3_-fwrapv_-fPIC_-fPIE_-gdwarf-4_-Wall/timingleaks/crypto_aead/omdsha512k128n128tau128v2/sse4/work/omdsha512.h:146: first defined here
try.c: collect2: error: ld returned 1 exit status
Number of similar (implementation,compiler) pairs: 1, namely:
| Implementation | Compiler |
| T:sse4 | gcc -march=native -mtune=native -O3 -fwrapv -fPIC -fPIE -gdwarf-4 -Wall (14.2.0) |
Compiler output
try.c: /usr/bin/ld: libcrypto_aead_omdsha512k128n128tau128v2.a(omdsha512.o):.../supercop-data/tripwire/amd64/try/c/gcc_-march=native_-mtune=native_-O_-fwrapv_-fPIC_-fPIE_-gdwarf-4_-Wall/timingleaks/crypto_aead/omdsha512k128n128tau128v2/sse4/work/omdsha512.h:146: multiple definition of `Hash'; libcrypto_aead_omdsha512k128n128tau128v2.a(encrypt.o):.../supercop-data/tripwire/amd64/try/c/gcc_-march=native_-mtune=native_-O_-fwrapv_-fPIC_-fPIE_-gdwarf-4_-Wall/timingleaks/crypto_aead/omdsha512k128n128tau128v2/sse4/work/omdsha512.h:146: first defined here
try.c: collect2: error: ld returned 1 exit status
Number of similar (implementation,compiler) pairs: 1, namely:
| Implementation | Compiler |
| T:sse4 | gcc -march=native -mtune=native -O -fwrapv -fPIC -fPIE -gdwarf-4 -Wall (14.2.0) |
Compiler output
try.c: /usr/bin/ld: libcrypto_aead_omdsha512k128n128tau128v2.a(omdsha512.o):.../supercop-data/tripwire/amd64/try/c/gcc_-march=native_-mtune=native_-Os_-fwrapv_-fPIC_-fPIE_-gdwarf-4_-Wall/timingleaks/crypto_aead/omdsha512k128n128tau128v2/sse4/work/omdsha512.h:146: multiple definition of `Hash'; libcrypto_aead_omdsha512k128n128tau128v2.a(encrypt.o):.../supercop-data/tripwire/amd64/try/c/gcc_-march=native_-mtune=native_-Os_-fwrapv_-fPIC_-fPIE_-gdwarf-4_-Wall/timingleaks/crypto_aead/omdsha512k128n128tau128v2/sse4/work/omdsha512.h:146: first defined here
try.c: collect2: error: ld returned 1 exit status
Number of similar (implementation,compiler) pairs: 1, namely:
| Implementation | Compiler |
| T:sse4 | gcc -march=native -mtune=native -Os -fwrapv -fPIC -fPIE -gdwarf-4 -Wall (14.2.0) |
Namespace violations
omdsha512.o calc_L_i T
omdsha512.o double_block T
omdsha512.o final_masking_associated_data T
omdsha512.o final_masking_message T
omdsha512.o hash T
omdsha512.o increment_masking_associated_data T
omdsha512.o increment_masking_message T
omdsha512.o key_func T
omdsha512.o l2b T
omdsha512.o ntz T
omdsha512.o omdsha512_process T
omdsha512.o triple_block T
omdsha512.o xor_block T
sha512.o sha512_comp T
Number of similar (implementation,compiler) pairs: 4, namely:
| Implementation | Compiler |
| T:ref | gcc -march=native -mtune=native -O2 -fwrapv -fPIC -fPIE -gdwarf-4 -Wall (14.2.0) |
| T:ref | gcc -march=native -mtune=native -O3 -fwrapv -fPIC -fPIE -gdwarf-4 -Wall (14.2.0) |
| T:ref | gcc -march=native -mtune=native -O -fwrapv -fPIC -fPIE -gdwarf-4 -Wall (14.2.0) |
| T:ref | gcc -march=native -mtune=native -Os -fwrapv -fPIC -fPIE -gdwarf-4 -Wall (14.2.0) |