Test results for amd64, thinksky, crypto_stream/simon128128ctr
[Page version: 20250828 09:09:05]
Measurements for amd64, thinksky, crypto_stream
Test results for amd64, thinksky, crypto_stream
Test results for crypto_stream/simon128128ctr
Computer: thinksky
Microarchitecture: amd64; Skylake (506e3)
Architecture: amd64
CPU ID: GenuineIntel-000506e3-bfebfbff
SUPERCOP version: 20250415
Operation: crypto_stream
Primitive: simon128128ctr
Time | Object size | Test size | Implementation | Compiler | Benchmark date | SUPERCOP version |
4365 | 111751 0 0 | 128724 820 1032 | T:avx2 | clang -march=native -O3 -fwrapv -Qunused-arguments -fPIC -fPIE -gdwarf-4 -Wall | 20250822 | 20250415 |
4398 | 111799 0 0 | 128852 820 1032 | T:avx2 | clang -march=native -O2 -fwrapv -Qunused-arguments -fPIC -fPIE -gdwarf-4 -Wall | 20250822 | 20250415 |
4786 | 124897 0 0 | 140076 780 1032 | T:avx2 | gcc -march=native -mtune=native -O3 -fwrapv -fPIC -fPIE -gdwarf-4 -Wall | 20250822 | 20250415 |
6646 | 118753 0 0 | 130367 756 1000 | T:avx2 | gcc -march=native -mtune=native -Os -fwrapv -fPIC -fPIE -gdwarf-4 -Wall | 20250822 | 20250415 |
7280 | 119512 0 0 | 132708 780 1032 | T:avx2 | gcc -march=native -mtune=native -O2 -fwrapv -fPIC -fPIE -gdwarf-4 -Wall | 20250822 | 20250415 |
7591 | 141710 0 0 | 154148 820 968 | T:avx2 | clang -march=native -O -fwrapv -Qunused-arguments -fPIC -fPIE -gdwarf-4 -Wall | 20250822 | 20250415 |
7851 | 107678 0 0 | 124749 820 1032 | T:sse4 | clang -march=native -O3 -fwrapv -Qunused-arguments -fPIC -fPIE -gdwarf-4 -Wall | 20250822 | 20250415 |
7878 | 118563 0 0 | 133700 780 1032 | T:sse4 | gcc -march=native -mtune=native -O3 -fwrapv -fPIC -fPIE -gdwarf-4 -Wall | 20250822 | 20250415 |
7881 | 107198 0 0 | 124349 820 1032 | T:sse4 | clang -march=native -O2 -fwrapv -Qunused-arguments -fPIC -fPIE -gdwarf-4 -Wall | 20250822 | 20250415 |
8907 | 111195 0 0 | 124406 812 1032 | T:avx2 | clang -march=native -Os -fwrapv -Qunused-arguments -fPIC -fPIE -gdwarf-4 -Wall | 20250822 | 20250415 |
11882 | 119712 0 0 | 132707 772 1032 | T:sse4 | gcc -march=native -mtune=native -O -fwrapv -fPIC -fPIE -gdwarf-4 -Wall | 20250822 | 20250415 |
12490 | 117907 0 0 | 131060 780 1032 | T:sse4 | gcc -march=native -mtune=native -O2 -fwrapv -fPIC -fPIE -gdwarf-4 -Wall | 20250822 | 20250415 |
12777 | 106505 0 0 | 119870 812 1032 | T:sse4 | clang -march=native -Os -fwrapv -Qunused-arguments -fPIC -fPIE -gdwarf-4 -Wall | 20250822 | 20250415 |
13058 | 110615 0 0 | 122997 820 968 | T:sse4 | clang -march=native -O -fwrapv -Qunused-arguments -fPIC -fPIE -gdwarf-4 -Wall | 20250822 | 20250415 |
14198 | 122196 0 0 | 133759 756 1000 | T:sse4 | gcc -march=native -mtune=native -Os -fwrapv -fPIC -fPIE -gdwarf-4 -Wall | 20250822 | 20250415 |
Compiler output
stream.c: stream.c:130:3: error: always_inline function '_mm256_set_epi64x' requires target feature 'avx', but would be inlined into function 'Encrypt' that is compiled without support for 'avx'
stream.c: 130 | SET1(X[0],nonce[1]); SET4(Y[0],nonce[0]);
stream.c: | ^
stream.c: ./Intrinsics_AVX2_128block.h:25:22: note: expanded from macro 'SET1'
stream.c: 25 | #define SET1(X,c) (X=SET(c,c,c,c))
stream.c: | ^
stream.c: ./Intrinsics_AVX2_128block.h:24:13: note: expanded from macro 'SET'
stream.c: 24 | #define SET _mm256_set_epi64x
stream.c: | ^
stream.c: stream.c:130:3: error: AVX vector return of type '__m256i' (vector of 4 'long long' values) without 'avx' enabled changes the ABI
stream.c: ./Intrinsics_AVX2_128block.h:25:22: note: expanded from macro 'SET1'
stream.c: 25 | #define SET1(X,c) (X=SET(c,c,c,c))
stream.c: | ^
stream.c: ./Intrinsics_AVX2_128block.h:24:13: note: expanded from macro 'SET'
stream.c: 24 | #define SET _mm256_set_epi64x
stream.c: | ^
stream.c: stream.c:130:24: error: always_inline function '_mm256_set_epi64x' requires target feature 'avx', but would be inlined into function 'Encrypt' that is compiled without support for 'avx'
stream.c: 130 | SET1(X[0],nonce[1]); SET4(Y[0],nonce[0]);
stream.c: | ^
stream.c: ./Intrinsics_AVX2_128block.h:26:22: note: expanded from macro 'SET4'
stream.c: 26 | #define SET4(X,c) (X=SET(c,c,c,c), X=ADD(X,_q))
stream.c: | ^
stream.c: ./Intrinsics_AVX2_128block.h:24:13: note: expanded from macro 'SET'
stream.c: 24 | #define SET _mm256_set_epi64x
stream.c: | ^
stream.c: ...
Number of similar (implementation,compiler) pairs: 1, namely:
Implementation | Compiler |
T:avx2 | clang -mcpu=native -O3 -fwrapv -Qunused-arguments -fPIC -fPIE -gdwarf-4 -Wall (Debian_Clang_19.1.7_(3+b1)) |
Compiler output
stream.c: In file included from /usr/lib/gcc/x86_64-linux-gnu/14/include/immintrin.h:53,
stream.c: from Intrinsics_AVX2_128block.h:5,
stream.c: from Simon128128AVX2.h:17,
stream.c: from stream.c:21:
stream.c: In function '_mm256_unpackhi_epi64',
stream.c: inlined from 'Encrypt' at stream.c:166:22:
stream.c: /usr/lib/gcc/x86_64-linux-gnu/14/include/avx2intrin.h:880:19: warning: 'X[2]' may be used uninitialized [-Wmaybe-uninitialized]
stream.c: 880 | return (__m256i)__builtin_ia32_punpckhqdq256 ((__v4di)__A, (__v4di)__B);
stream.c: | ^~~~~~~~~~~~~~~~~~~~~~~~~~~~~~~~~~~~~~~~~~~~~~~~~~~~~~~
stream.c: stream.c: In function 'Encrypt':
stream.c: stream.c:110:8: note: 'X[2]' was declared here
stream.c: 110 | u256 X[8],Y[8];
stream.c: | ^
stream.c: In function '_mm256_unpackhi_epi64',
stream.c: inlined from 'Encrypt' at stream.c:167:22:
stream.c: /usr/lib/gcc/x86_64-linux-gnu/14/include/avx2intrin.h:880:19: warning: 'X[3]' may be used uninitialized [-Wmaybe-uninitialized]
stream.c: 880 | return (__m256i)__builtin_ia32_punpckhqdq256 ((__v4di)__A, (__v4di)__B);
stream.c: | ^~~~~~~~~~~~~~~~~~~~~~~~~~~~~~~~~~~~~~~~~~~~~~~~~~~~~~~
stream.c: stream.c: In function 'Encrypt':
stream.c: stream.c:110:8: note: 'X[3]' was declared here
stream.c: 110 | u256 X[8],Y[8];
stream.c: | ^
stream.c: In function '_mm256_unpackhi_epi64',
stream.c: inlined from 'Encrypt' at stream.c:169:5:
stream.c: /usr/lib/gcc/x86_64-linux-gnu/14/include/avx2intrin.h:880:19: warning: '*(__m256i *)(&X[4])' may be used uninitialized [-Wmaybe-uninitialized]
stream.c: ...
Number of similar (implementation,compiler) pairs: 1, namely:
Implementation | Compiler |
T:avx2 | gcc -march=native -mtune=native -O3 -fwrapv -fPIC -fPIE -gdwarf-4 -Wall (14.2.0) |
Compiler output
try.c: /usr/bin/ld: libcrypto_stream_simon128128ctr.a(stream.o): in function `Encrypt':
try.c: .../supercop-data/thinksky/amd64/try/c/gcc_-march=native_-mtune=native_-O_-fwrapv_-fPIC_-fPIE_-gdwarf-4_-Wall/timingleaks/crypto_stream/simon128128ctr/avx2/work/stream.c:147:(.text+0x...): undefined reference to `Transpose'
try.c: /usr/bin/ld: .../supercop-data/thinksky/amd64/try/c/gcc_-march=native_-mtune=native_-O_-fwrapv_-fPIC_-fPIE_-gdwarf-4_-Wall/timingleaks/crypto_stream/simon128128ctr/avx2/work/stream.c:147:(.text+0x...): undefined reference to `Transpose'
try.c: /usr/bin/ld: .../supercop-data/thinksky/amd64/try/c/gcc_-march=native_-mtune=native_-O_-fwrapv_-fPIC_-fPIE_-gdwarf-4_-Wall/timingleaks/crypto_stream/simon128128ctr/avx2/work/stream.c:156:(.text+0x...): undefined reference to `Transpose'
try.c: /usr/bin/ld: .../supercop-data/thinksky/amd64/try/c/gcc_-march=native_-mtune=native_-O_-fwrapv_-fPIC_-fPIE_-gdwarf-4_-Wall/timingleaks/crypto_stream/simon128128ctr/avx2/work/stream.c:156:(.text+0x...): undefined reference to `Transpose'
try.c: /usr/bin/ld: libcrypto_stream_simon128128ctr.a(stream.o): in function `Encrypt_Xor':
try.c: .../supercop-data/thinksky/amd64/try/c/gcc_-march=native_-mtune=native_-O_-fwrapv_-fPIC_-fPIE_-gdwarf-4_-Wall/timingleaks/crypto_stream/simon128128ctr/avx2/work/stream.c:297:(.text+0x...): undefined reference to `Transpose'
try.c: /usr/bin/ld: libcrypto_stream_simon128128ctr.a(stream.o):.../supercop-data/thinksky/amd64/try/c/gcc_-march=native_-mtune=native_-O_-fwrapv_-fPIC_-fPIE_-gdwarf-4_-Wall/timingleaks/crypto_stream/simon128128ctr/avx2/work/stream.c:297: more undefined references to `Transpose' follow
try.c: collect2: error: ld returned 1 exit status
Number of similar (implementation,compiler) pairs: 1, namely:
Implementation | Compiler |
T:avx2 | gcc -march=native -mtune=native -O -fwrapv -fPIC -fPIE -gdwarf-4 -Wall (14.2.0) |
Compiler output
stream.c: stream.c:324:58: warning: argument 'T' of type '__m128i[8]' with mismatched bound [-Warray-parameter]
stream.c: 324 | inline __attribute__((always_inline)) int Transpose(u128 T[8])
stream.c: | ^
stream.c: stream.c:28:58: note: previously declared as '__m128i[]' here
stream.c: 28 | inline __attribute__((always_inline)) int Transpose(u128 M[]);
stream.c: | ^
stream.c: 1 warning generated.
Number of similar (implementation,compiler) pairs: 4, namely:
Implementation | Compiler |
T:sse4 | clang -march=native -O2 -fwrapv -Qunused-arguments -fPIC -fPIE -gdwarf-4 -Wall (Debian_Clang_19.1.7_(3+b1)) |
T:sse4 | clang -march=native -O3 -fwrapv -Qunused-arguments -fPIC -fPIE -gdwarf-4 -Wall (Debian_Clang_19.1.7_(3+b1)) |
T:sse4 | clang -march=native -O -fwrapv -Qunused-arguments -fPIC -fPIE -gdwarf-4 -Wall (Debian_Clang_19.1.7_(3+b1)) |
T:sse4 | clang -march=native -Os -fwrapv -Qunused-arguments -fPIC -fPIE -gdwarf-4 -Wall (Debian_Clang_19.1.7_(3+b1)) |
Compiler output
stream.c: stream.c:306:3: error: always_inline function '_mm_shuffle_epi8' requires target feature 'ssse3', but would be inlined into function 'ExpandKeyBS' that is compiled without support for 'ssse3'
stream.c: 306 | EKBS(rk);
stream.c: | ^
stream.c: ./Simon128128SSE4.h:62:19: note: expanded from macro 'EKBS'
stream.c: 62 | #define EKBS(rk) (RKBS(rk,2,_D), RKBS(rk,3,_C), RKBS(rk,4,_D), RKBS(rk,5,_C), RKBS(rk,6,_D), RKBS(rk,7,_D), RKBS(rk,8,_D), RKBS(rk,9,_D), \
stream.c: | ^
stream.c: ./Simon128128SSE4.h:53:52: note: expanded from macro 'RKBS'
stream.c: 53 | #define RKBS(rk,r,_V) (rk[r][7]= _D ^ rk[r-2][7] ^ ROR8(rk[r-1][2] ^ rk[r-1][3]), \
stream.c: | ^
stream.c: ./Intrinsics_SSE4_128block.h:39:19: note: expanded from macro 'ROR8'
stream.c: 39 | #define ROR8(X) (SHFL(X,R8))
stream.c: | ^
stream.c: ./Intrinsics_SSE4_128block.h:35:14: note: expanded from macro 'SHFL'
stream.c: 35 | #define SHFL _mm_shuffle_epi8
stream.c: | ^
stream.c: stream.c:306:3: error: always_inline function '_mm_shuffle_epi8' requires target feature 'ssse3', but would be inlined into function 'ExpandKeyBS' that is compiled without support for 'ssse3'
stream.c: ./Simon128128SSE4.h:62:19: note: expanded from macro 'EKBS'
stream.c: 62 | #define EKBS(rk) (RKBS(rk,2,_D), RKBS(rk,3,_C), RKBS(rk,4,_D), RKBS(rk,5,_C), RKBS(rk,6,_D), RKBS(rk,7,_D), RKBS(rk,8,_D), RKBS(rk,9,_D), \
stream.c: | ^
stream.c: ./Simon128128SSE4.h:54:38: note: expanded from macro 'RKBS'
stream.c: 54 | rk[r][6]= _D ^ rk[r-2][6] ^ ROR8(rk[r-1][1] ^ rk[r-1][2]), \
stream.c: | ^
stream.c: ./Intrinsics_SSE4_128block.h:39:19: note: expanded from macro 'ROR8'
stream.c: 39 | #define ROR8(X) (SHFL(X,R8))
stream.c: | ^
stream.c: ...
Number of similar (implementation,compiler) pairs: 1, namely:
Implementation | Compiler |
T:sse4 | clang -mcpu=native -O3 -fwrapv -Qunused-arguments -fPIC -fPIE -gdwarf-4 -Wall (Debian_Clang_19.1.7_(3+b1)) |
Compiler output
stream.c: stream.c:324:58: warning: argument 1 of type '__m128i[8]' with mismatched bound [-Warray-parameter=]
stream.c: 324 | inline __attribute__((always_inline)) int Transpose(u128 T[8])
stream.c: stream.c:28:58: note: previously declared as '__m128i[]'
stream.c: 28 | inline __attribute__((always_inline)) int Transpose(u128 M[]);
Number of similar (implementation,compiler) pairs: 4, namely:
Implementation | Compiler |
T:sse4 | gcc -march=native -mtune=native -O2 -fwrapv -fPIC -fPIE -gdwarf-4 -Wall (14.2.0) |
T:sse4 | gcc -march=native -mtune=native -O3 -fwrapv -fPIC -fPIE -gdwarf-4 -Wall (14.2.0) |
T:sse4 | gcc -march=native -mtune=native -O -fwrapv -fPIC -fPIE -gdwarf-4 -Wall (14.2.0) |
T:sse4 | gcc -march=native -mtune=native -Os -fwrapv -fPIC -fPIE -gdwarf-4 -Wall (14.2.0) |
Namespace violations
stream.o Encrypt T
stream.o Encrypt_Xor T
stream.o ExpandKeyBS T
stream.o ExpandKeyNBS T
Number of similar (implementation,compiler) pairs: 7, namely:
Implementation | Compiler |
T:avx2 | clang -march=native -O2 -fwrapv -Qunused-arguments -fPIC -fPIE -gdwarf-4 -Wall (Debian_Clang_19.1.7_(3+b1)) |
T:avx2 | clang -march=native -O3 -fwrapv -Qunused-arguments -fPIC -fPIE -gdwarf-4 -Wall (Debian_Clang_19.1.7_(3+b1)) |
T:avx2 | clang -march=native -O -fwrapv -Qunused-arguments -fPIC -fPIE -gdwarf-4 -Wall (Debian_Clang_19.1.7_(3+b1)) |
T:avx2 | clang -march=native -Os -fwrapv -Qunused-arguments -fPIC -fPIE -gdwarf-4 -Wall (Debian_Clang_19.1.7_(3+b1)) |
T:avx2 | gcc -march=native -mtune=native -O2 -fwrapv -fPIC -fPIE -gdwarf-4 -Wall (14.2.0) |
T:avx2 | gcc -march=native -mtune=native -O3 -fwrapv -fPIC -fPIE -gdwarf-4 -Wall (14.2.0) |
T:avx2 | gcc -march=native -mtune=native -Os -fwrapv -fPIC -fPIE -gdwarf-4 -Wall (14.2.0) |
Namespace violations
stream.o ExpandKeyBS T
stream.o ExpandKeyNBS T
Number of similar (implementation,compiler) pairs: 8, namely:
Implementation | Compiler |
T:sse4 | clang -march=native -O2 -fwrapv -Qunused-arguments -fPIC -fPIE -gdwarf-4 -Wall (Debian_Clang_19.1.7_(3+b1)) |
T:sse4 | clang -march=native -O3 -fwrapv -Qunused-arguments -fPIC -fPIE -gdwarf-4 -Wall (Debian_Clang_19.1.7_(3+b1)) |
T:sse4 | clang -march=native -O -fwrapv -Qunused-arguments -fPIC -fPIE -gdwarf-4 -Wall (Debian_Clang_19.1.7_(3+b1)) |
T:sse4 | clang -march=native -Os -fwrapv -Qunused-arguments -fPIC -fPIE -gdwarf-4 -Wall (Debian_Clang_19.1.7_(3+b1)) |
T:sse4 | gcc -march=native -mtune=native -O2 -fwrapv -fPIC -fPIE -gdwarf-4 -Wall (14.2.0) |
T:sse4 | gcc -march=native -mtune=native -O3 -fwrapv -fPIC -fPIE -gdwarf-4 -Wall (14.2.0) |
T:sse4 | gcc -march=native -mtune=native -O -fwrapv -fPIC -fPIE -gdwarf-4 -Wall (14.2.0) |
T:sse4 | gcc -march=native -mtune=native -Os -fwrapv -fPIC -fPIE -gdwarf-4 -Wall (14.2.0) |