Test results for amd64, speed2supercop, crypto_hash/echosp256
[Page version: 20250318 22:34:28]
Measurements for amd64, speed2supercop, crypto_hash
Test results for amd64, speed2supercop, crypto_hash
Test results for crypto_hash/echosp256
Computer: speed2supercop
Microarchitecture: amd64; Haswell+AES (306c3)
Architecture: amd64
CPU ID: GenuineIntel-000306c3-1fc9cbf5
SUPERCOP version: 20250307
Operation: crypto_hash
Primitive: echosp256
Time | Object size | Test size | Implementation | Compiler | Benchmark date | SUPERCOP version |
37620 | 20350 0 1 | 30669 752 808 | T:generic/opt64 | gcc -march=native -mtune=native -O -fwrapv -fPIC -fPIE -gdwarf-4 -Wall | 20250310 | 20250307 |
38700 | 21990 0 1 | 34229 752 808 | T:generic/opt64 | gcc -march=native -mtune=native -O3 -fwrapv -fPIC -fPIE -gdwarf-4 -Wall | 20250310 | 20250307 |
38840 | 21246 0 1 | 31613 752 808 | T:generic/opt64 | gcc -march=native -mtune=native -O2 -fwrapv -fPIC -fPIE -gdwarf-4 -Wall | 20250310 | 20250307 |
41056 | 22526 0 1 | 33423 784 800 | T:generic/opt64 | clang -march=native -Os -fwrapv -Qunused-arguments -fPIC -fPIE -gdwarf-4 -Wall | 20250310 | 20250307 |
41300 | 19988 0 1 | 29000 728 776 | T:generic/opt64 | gcc -march=native -mtune=native -Os -fwrapv -fPIC -fPIE -gdwarf-4 -Wall | 20250310 | 20250307 |
43632 | 28064 0 16 | 42830 792 808 | T:powerpc/pp32cv2 | clang -march=native -O3 -fwrapv -Qunused-arguments -fPIC -fPIE -gdwarf-4 -Wall | 20250310 | 20250307 |
43716 | 28031 0 16 | 42838 792 808 | T:powerpc/pp32cv2 | clang -march=native -O2 -fwrapv -Qunused-arguments -fPIC -fPIE -gdwarf-4 -Wall | 20250310 | 20250307 |
48572 | 22879 0 16 | 33711 784 808 | T:powerpc/pp32cv2 | clang -march=native -Os -fwrapv -Qunused-arguments -fPIC -fPIE -gdwarf-4 -Wall | 20250310 | 20250307 |
49752 | 23972 0 1 | 34006 792 736 | T:generic/opt64 | clang -march=native -O -fwrapv -Qunused-arguments -fPIC -fPIE -gdwarf-4 -Wall | 20250310 | 20250307 |
49924 | 26479 0 16 | 43022 792 744 | T:powerpc/pp32cv2 | clang -mcpu=native -O3 -fwrapv -Qunused-arguments -fPIC -fPIE -gdwarf-4 -Wall | 20250310 | 20250307 |
51312 | 21306 0 1 | 36117 792 800 | T:generic/opt64 | clang -march=native -O2 -fwrapv -Qunused-arguments -fPIC -fPIE -gdwarf-4 -Wall | 20250310 | 20250307 |
52192 | 30236 0 1 | 46774 792 736 | T:generic/opt64 | clang -mcpu=native -O3 -fwrapv -Qunused-arguments -fPIC -fPIE -gdwarf-4 -Wall | 20250310 | 20250307 |
52832 | 21228 0 1 | 35941 792 800 | T:generic/opt64 | clang -march=native -O3 -fwrapv -Qunused-arguments -fPIC -fPIE -gdwarf-4 -Wall | 20250310 | 20250307 |
59100 | 24563 0 16 | 34606 792 744 | T:powerpc/pp32cv2 | clang -march=native -O -fwrapv -Qunused-arguments -fPIC -fPIE -gdwarf-4 -Wall | 20250310 | 20250307 |
64196 | 31138 0 16 | 43373 752 816 | T:powerpc/pp32cv2 | gcc -march=native -mtune=native -O3 -fwrapv -fPIC -fPIE -gdwarf-4 -Wall | 20250310 | 20250307 |
64812 | 20217 0 16 | 31055 784 808 | T:powerpc/pp32cv1 | clang -march=native -Os -fwrapv -Qunused-arguments -fPIC -fPIE -gdwarf-4 -Wall | 20250310 | 20250307 |
66896 | 25937 0 16 | 34960 728 784 | T:powerpc/pp32cv2 | gcc -march=native -mtune=native -Os -fwrapv -fPIC -fPIE -gdwarf-4 -Wall | 20250310 | 20250307 |
67548 | 24387 0 16 | 39222 792 808 | T:powerpc/pp32cv1 | clang -march=native -O2 -fwrapv -Qunused-arguments -fPIC -fPIE -gdwarf-4 -Wall | 20250310 | 20250307 |
67636 | 24420 0 16 | 39182 792 808 | T:powerpc/pp32cv1 | clang -march=native -O3 -fwrapv -Qunused-arguments -fPIC -fPIE -gdwarf-4 -Wall | 20250310 | 20250307 |
70832 | 20351 0 16 | 36894 792 744 | T:powerpc/pp32cv1 | clang -mcpu=native -O3 -fwrapv -Qunused-arguments -fPIC -fPIE -gdwarf-4 -Wall | 20250310 | 20250307 |
72056 | 30490 0 16 | 40877 752 816 | T:powerpc/pp32cv2 | gcc -march=native -mtune=native -O2 -fwrapv -fPIC -fPIE -gdwarf-4 -Wall | 20250310 | 20250307 |
74764 | 28895 0 16 | 39229 752 816 | T:powerpc/pp32cv2 | gcc -march=native -mtune=native -O -fwrapv -fPIC -fPIE -gdwarf-4 -Wall | 20250310 | 20250307 |
75220 | 19138 0 16 | 31373 752 816 | T:powerpc/pp32cv1 | gcc -march=native -mtune=native -O3 -fwrapv -fPIC -fPIE -gdwarf-4 -Wall | 20250310 | 20250307 |
77212 | 17626 0 16 | 28013 752 816 | T:powerpc/pp32cv1 | gcc -march=native -mtune=native -O2 -fwrapv -fPIC -fPIE -gdwarf-4 -Wall | 20250310 | 20250307 |
82204 | 18275 0 16 | 28318 792 744 | T:powerpc/pp32cv1 | clang -march=native -O -fwrapv -Qunused-arguments -fPIC -fPIE -gdwarf-4 -Wall | 20250310 | 20250307 |
84264 | 18079 0 16 | 28413 752 816 | T:powerpc/pp32cv1 | gcc -march=native -mtune=native -O -fwrapv -fPIC -fPIE -gdwarf-4 -Wall | 20250310 | 20250307 |
86916 | 16698 0 16 | 25728 728 784 | T:powerpc/pp32cv1 | gcc -march=native -mtune=native -Os -fwrapv -fPIC -fPIE -gdwarf-4 -Wall | 20250310 | 20250307 |
Compiler output
echo64.S: echo64.S:1040:2: error: '.att_syntax noprefix' is not supported: registers must have a '%' prefix in .att_syntax
echo64.S: .att_syntax noprefix
echo64.S: ^
echo64.S: echo64.S:1053:10: error: unknown token in expression
echo64.S: movabsq $-9187201950435737472, %rax
echo64.S: ^
echo64.S: echo64.S:1054:10: error: unknown token in expression
echo64.S: movabsq $-9187201950435737472, %r11
echo64.S: ^
echo64.S: echo64.S:1055:10: error: unknown token in expression
echo64.S: movabsq $7599940337074203, %r10
echo64.S: ^
echo64.S: echo64.S:1056:7: error: unknown token in expression
echo64.S: movq %rax, MEM_CST+16(%rip)
echo64.S: ^
echo64.S: echo64.S:1057:10: error: unknown token in expression
echo64.S: movabsq $7599940337074203, %r9
echo64.S: ^
echo64.S: echo64.S:1058:10: error: unknown token in expression
echo64.S: movabsq $-72340172838076674, %rax
echo64.S: ^
echo64.S: echo64.S:1059:10: error: unknown token in expression
echo64.S: movabsq $72340172838076673, %r8
echo64.S: ^
echo64.S: echo64.S:1060:10: error: unknown token in expression
echo64.S: ...
Number of similar (implementation,compiler) pairs: 5, namely:
Implementation | Compiler |
T:aes/aes64 | clang -march=native -O2 -fwrapv -Qunused-arguments -fPIC -fPIE -gdwarf-4 -Wall (Debian_Clang_19.1.7_(1+b1)) |
T:aes/aes64 | clang -march=native -O3 -fwrapv -Qunused-arguments -fPIC -fPIE -gdwarf-4 -Wall (Debian_Clang_19.1.7_(1+b1)) |
T:aes/aes64 | clang -march=native -O -fwrapv -Qunused-arguments -fPIC -fPIE -gdwarf-4 -Wall (Debian_Clang_19.1.7_(1+b1)) |
T:aes/aes64 | clang -march=native -Os -fwrapv -Qunused-arguments -fPIC -fPIE -gdwarf-4 -Wall (Debian_Clang_19.1.7_(1+b1)) |
T:aes/aes64 | clang -mcpu=native -O3 -fwrapv -Qunused-arguments -fPIC -fPIE -gdwarf-4 -Wall (Debian_Clang_19.1.7_(1+b1)) |
Compiler output
try.c: /usr/bin/ld: libcrypto_hash_echosp256.a(echo64.o): relocation R_X86_64_32S against symbol `OLDCV' can not be used when making a PIE object; recompile with -fPIE
try.c: /usr/bin/ld: failed to set dynamic section sizes: bad value
try.c: collect2: error: ld returned 1 exit status
Number of similar (implementation,compiler) pairs: 4, namely:
Implementation | Compiler |
T:aes/aes64 | gcc -march=native -mtune=native -O2 -fwrapv -fPIC -fPIE -gdwarf-4 -Wall (14.2.0) |
T:aes/aes64 | gcc -march=native -mtune=native -O3 -fwrapv -fPIC -fPIE -gdwarf-4 -Wall (14.2.0) |
T:aes/aes64 | gcc -march=native -mtune=native -O -fwrapv -fPIC -fPIE -gdwarf-4 -Wall (14.2.0) |
T:aes/aes64 | gcc -march=native -mtune=native -Os -fwrapv -fPIC -fPIE -gdwarf-4 -Wall (14.2.0) |
Compiler output
echo64.S: echo64.S:224:2: error: invalid instruction mnemonic 'movzbl'
echo64.S: movzbl ebp, ah
echo64.S: ^~~~~~
echo64.S: echo64.S:227:2: error: invalid instruction mnemonic 'movzbl'
echo64.S: movzbl esi, al
echo64.S: ^~~~~~
echo64.S: echo64.S:239:2: error: invalid instruction mnemonic 'movzbl'
echo64.S: movzbl ebp, bl
echo64.S: ^~~~~~
echo64.S: echo64.S:242:2: error: invalid instruction mnemonic 'movzbl'
echo64.S: movzbl esi, bh
echo64.S: ^~~~~~
echo64.S: echo64.S:254:2: error: invalid instruction mnemonic 'movzbl'
echo64.S: movzbl ebp, al
echo64.S: ^~~~~~
echo64.S: echo64.S:257:2: error: invalid instruction mnemonic 'movzbl'
echo64.S: movzbl esi, ah
echo64.S: ^~~~~~
echo64.S: echo64.S:269:2: error: invalid instruction mnemonic 'movzbl'
echo64.S: movzbl ebp, bh
echo64.S: ^~~~~~
echo64.S: echo64.S:272:2: error: invalid instruction mnemonic 'movzbl'
echo64.S: movzbl esi, bl
echo64.S: ^~~~~~
echo64.S: echo64.S:284:2: error: invalid instruction mnemonic 'movzbl'
echo64.S: ...
Number of similar (implementation,compiler) pairs: 5, namely:
Implementation | Compiler |
T:athlon/athlon64 | clang -march=native -O2 -fwrapv -Qunused-arguments -fPIC -fPIE -gdwarf-4 -Wall (Debian_Clang_19.1.7_(1+b1)) |
T:athlon/athlon64 | clang -march=native -O3 -fwrapv -Qunused-arguments -fPIC -fPIE -gdwarf-4 -Wall (Debian_Clang_19.1.7_(1+b1)) |
T:athlon/athlon64 | clang -march=native -O -fwrapv -Qunused-arguments -fPIC -fPIE -gdwarf-4 -Wall (Debian_Clang_19.1.7_(1+b1)) |
T:athlon/athlon64 | clang -march=native -Os -fwrapv -Qunused-arguments -fPIC -fPIE -gdwarf-4 -Wall (Debian_Clang_19.1.7_(1+b1)) |
T:athlon/athlon64 | clang -mcpu=native -O3 -fwrapv -Qunused-arguments -fPIC -fPIE -gdwarf-4 -Wall (Debian_Clang_19.1.7_(1+b1)) |
Compiler output
echo64.S: echo64.c: Assembler messages:
echo64.S: echo64.c:729: Error: no such instruction: `movzbl ebp,ah'
echo64.S: echo64.c:729: Error: no such instruction: `movzbl esi,al'
echo64.S: echo64.c:729: Error: no such instruction: `movzbl ebp,bl'
echo64.S: echo64.c:729: Error: no such instruction: `movzbl esi,bh'
echo64.S: echo64.c:729: Error: no such instruction: `movzbl ebp,al'
echo64.S: echo64.c:729: Error: no such instruction: `movzbl esi,ah'
echo64.S: echo64.c:729: Error: no such instruction: `movzbl ebp,bh'
echo64.S: echo64.c:729: Error: no such instruction: `movzbl esi,bl'
echo64.S: echo64.c:729: Error: no such instruction: `movzbl ebp,ah'
echo64.S: echo64.c:729: Error: no such instruction: `movzbl esi,al'
echo64.S: echo64.c:729: Error: no such instruction: `movzbl ebp,bl'
echo64.S: echo64.c:729: Error: no such instruction: `movzbl esi,bh'
echo64.S: echo64.c:729: Error: no such instruction: `movzbl ebp,al'
echo64.S: echo64.c:729: Error: no such instruction: `movzbl esi,ah'
echo64.S: echo64.c:729: Error: no such instruction: `movzbl ebp,bl'
echo64.S: echo64.c:729: Error: no such instruction: `movzbl esi,bh'
echo64.S: echo64.c:729: Error: no such instruction: `movzbl ebp,dl'
echo64.S: echo64.c:729: Error: no such instruction: `movzbl esi,dh'
echo64.S: echo64.c:729: Error: no such instruction: `movzbl ebp,ch'
echo64.S: echo64.c:729: Error: no such instruction: `movzbl esi,cl'
echo64.S: echo64.c:729: Error: no such instruction: `movzbl ebp,cl'
echo64.S: echo64.c:729: Error: no such instruction: `movzbl esi,ch'
echo64.S: echo64.c:729: Error: no such instruction: `movzbl ebp,dh'
echo64.S: echo64.c:729: Error: no such instruction: `movzbl esi,dl'
echo64.S: ...
Number of similar (implementation,compiler) pairs: 4, namely:
Implementation | Compiler |
T:athlon/athlon64 | gcc -march=native -mtune=native -O2 -fwrapv -fPIC -fPIE -gdwarf-4 -Wall (14.2.0) |
T:athlon/athlon64 | gcc -march=native -mtune=native -O3 -fwrapv -fPIC -fPIE -gdwarf-4 -Wall (14.2.0) |
T:athlon/athlon64 | gcc -march=native -mtune=native -O -fwrapv -fPIC -fPIE -gdwarf-4 -Wall (14.2.0) |
T:athlon/athlon64 | gcc -march=native -mtune=native -Os -fwrapv -fPIC -fPIE -gdwarf-4 -Wall (14.2.0) |
Compiler output
echo64.S: echo64.S:212:2: error: invalid instruction mnemonic 'movzbl'
echo64.S: movzbl ebp, ah
echo64.S: ^~~~~~
echo64.S: echo64.S:218:2: error: invalid instruction mnemonic 'movzbl'
echo64.S: movzbl esi, al
echo64.S: ^~~~~~
echo64.S: echo64.S:227:2: error: invalid instruction mnemonic 'movzbl'
echo64.S: movzbl ebp, bl
echo64.S: ^~~~~~
echo64.S: echo64.S:233:2: error: invalid instruction mnemonic 'movzbl'
echo64.S: movzbl esi, bh
echo64.S: ^~~~~~
echo64.S: echo64.S:242:2: error: invalid instruction mnemonic 'movzbl'
echo64.S: movzbl ebp, al
echo64.S: ^~~~~~
echo64.S: echo64.S:248:2: error: invalid instruction mnemonic 'movzbl'
echo64.S: movzbl esi, ah
echo64.S: ^~~~~~
echo64.S: echo64.S:257:2: error: invalid instruction mnemonic 'movzbl'
echo64.S: movzbl ebp, bh
echo64.S: ^~~~~~
echo64.S: echo64.S:263:2: error: invalid instruction mnemonic 'movzbl'
echo64.S: movzbl esi, bl
echo64.S: ^~~~~~
echo64.S: echo64.S:272:2: error: invalid instruction mnemonic 'movzbl'
echo64.S: ...
Number of similar (implementation,compiler) pairs: 5, namely:
Implementation | Compiler |
T:core2/core2v64 | clang -march=native -O2 -fwrapv -Qunused-arguments -fPIC -fPIE -gdwarf-4 -Wall (Debian_Clang_19.1.7_(1+b1)) |
T:core2/core2v64 | clang -march=native -O3 -fwrapv -Qunused-arguments -fPIC -fPIE -gdwarf-4 -Wall (Debian_Clang_19.1.7_(1+b1)) |
T:core2/core2v64 | clang -march=native -O -fwrapv -Qunused-arguments -fPIC -fPIE -gdwarf-4 -Wall (Debian_Clang_19.1.7_(1+b1)) |
T:core2/core2v64 | clang -march=native -Os -fwrapv -Qunused-arguments -fPIC -fPIE -gdwarf-4 -Wall (Debian_Clang_19.1.7_(1+b1)) |
T:core2/core2v64 | clang -mcpu=native -O3 -fwrapv -Qunused-arguments -fPIC -fPIE -gdwarf-4 -Wall (Debian_Clang_19.1.7_(1+b1)) |
Compiler output
echo64.S: echo64.c: Assembler messages:
echo64.S: echo64.c:635: Error: no such instruction: `movzbl ebp,ah'
echo64.S: echo64.c:635: Error: no such instruction: `movzbl esi,al'
echo64.S: echo64.c:635: Error: no such instruction: `movzbl ebp,bl'
echo64.S: echo64.c:635: Error: no such instruction: `movzbl esi,bh'
echo64.S: echo64.c:635: Error: no such instruction: `movzbl ebp,al'
echo64.S: echo64.c:635: Error: no such instruction: `movzbl esi,ah'
echo64.S: echo64.c:635: Error: no such instruction: `movzbl ebp,bh'
echo64.S: echo64.c:635: Error: no such instruction: `movzbl esi,bl'
echo64.S: echo64.c:635: Error: no such instruction: `movzbl ebp,ah'
echo64.S: echo64.c:635: Error: no such instruction: `movzbl esi,al'
echo64.S: echo64.c:635: Error: no such instruction: `movzbl ebp,bl'
echo64.S: echo64.c:635: Error: no such instruction: `movzbl esi,bh'
echo64.S: echo64.c:635: Error: no such instruction: `movzbl ebp,al'
echo64.S: echo64.c:635: Error: no such instruction: `movzbl esi,ah'
echo64.S: echo64.c:635: Error: no such instruction: `movzbl ebp,bl'
echo64.S: echo64.c:635: Error: no such instruction: `movzbl esi,bh'
echo64.S: echo64.c:635: Error: no such instruction: `movzbl ebp,dl'
echo64.S: echo64.c:635: Error: no such instruction: `movzbl esi,dh'
echo64.S: echo64.c:635: Error: no such instruction: `movzbl ebp,ch'
echo64.S: echo64.c:635: Error: no such instruction: `movzbl esi,cl'
echo64.S: echo64.c:635: Error: no such instruction: `movzbl ebp,cl'
echo64.S: echo64.c:635: Error: no such instruction: `movzbl esi,ch'
echo64.S: echo64.c:635: Error: no such instruction: `movzbl ebp,dh'
echo64.S: echo64.c:635: Error: no such instruction: `movzbl esi,dl'
echo64.S: ...
Number of similar (implementation,compiler) pairs: 4, namely:
Implementation | Compiler |
T:core2/core2v64 | gcc -march=native -mtune=native -O2 -fwrapv -fPIC -fPIE -gdwarf-4 -Wall (14.2.0) |
T:core2/core2v64 | gcc -march=native -mtune=native -O3 -fwrapv -fPIC -fPIE -gdwarf-4 -Wall (14.2.0) |
T:core2/core2v64 | gcc -march=native -mtune=native -O -fwrapv -fPIC -fPIE -gdwarf-4 -Wall (14.2.0) |
T:core2/core2v64 | gcc -march=native -mtune=native -Os -fwrapv -fPIC -fPIE -gdwarf-4 -Wall (14.2.0) |
Compiler output
echo32.c: echo32.c:37:4: error: call to undeclared library function 'printf' with type 'int (const char *, ...)'; ISO C99 and later do not support implicit function declarations [-Wimplicit-function-declaration]
echo32.c: 37 | printf ("row %d,col %d :",i,j);
echo32.c: | ^
echo32.c: echo32.c:37:4: note: include the header <stdio.h> or explicitly provide a declaration for 'printf'
echo32.c: echo32.c:125:18: warning: unused variable 'j' [-Wunused-variable]
echo32.c: 125 | unsigned int i, j;
echo32.c: | ^
echo32.c: echo32.c:126:16: warning: unused variable 'endianess' [-Wunused-variable]
echo32.c: 126 | unsigned char endianess;
echo32.c: | ^~~~~~~~~
echo32.c: echo32.c:397:15: warning: unused variable 'i' [-Wunused-variable]
echo32.c: 397 | unsigned int i;
echo32.c: | ^
echo32.c: echo32.c:398:21: warning: unused variable 'c0' [-Wunused-variable]
echo32.c: 398 | unsigned long long c0, c1;
echo32.c: | ^~
echo32.c: echo32.c:398:25: warning: unused variable 'c1' [-Wunused-variable]
echo32.c: 398 | unsigned long long c0, c1;
echo32.c: | ^~
echo32.c: echo32.c:496:21: warning: unused variable 'hashlen' [-Wunused-variable]
echo32.c: 496 | unsigned short int hashlen = 0;
echo32.c: | ^~~~~~~
echo32.c: echo32.c:497:21: warning: unused variable 'messlen_l' [-Wunused-variable]
echo32.c: 497 | unsigned long long messlen_l = 0;
echo32.c: | ^~~~~~~~~
echo32.c: ...
Number of similar (implementation,compiler) pairs: 5, namely:
Implementation | Compiler |
T:generic/opt32 | clang -march=native -O2 -fwrapv -Qunused-arguments -fPIC -fPIE -gdwarf-4 -Wall (Debian_Clang_19.1.7_(1+b1)) |
T:generic/opt32 | clang -march=native -O3 -fwrapv -Qunused-arguments -fPIC -fPIE -gdwarf-4 -Wall (Debian_Clang_19.1.7_(1+b1)) |
T:generic/opt32 | clang -march=native -O -fwrapv -Qunused-arguments -fPIC -fPIE -gdwarf-4 -Wall (Debian_Clang_19.1.7_(1+b1)) |
T:generic/opt32 | clang -march=native -Os -fwrapv -Qunused-arguments -fPIC -fPIE -gdwarf-4 -Wall (Debian_Clang_19.1.7_(1+b1)) |
T:generic/opt32 | clang -mcpu=native -O3 -fwrapv -Qunused-arguments -fPIC -fPIE -gdwarf-4 -Wall (Debian_Clang_19.1.7_(1+b1)) |
Compiler output
echo32.c: echo32.c: In function 'PrintState':
echo32.c: echo32.c:37:25: error: implicit declaration of function 'printf' [-Wimplicit-function-declaration]
echo32.c: 37 | printf ("row %d,col %d :",i,j);
echo32.c: | ^~~~~~
echo32.c: echo32.c:12:1: note: include '<stdio.h>' or provide a declaration of 'printf'
echo32.c: 11 | #include "api.h"
echo32.c: +++ |+#include <stdio.h>
echo32.c: 12 |
echo32.c: echo32.c:37:25: warning: incompatible implicit declaration of built-in function 'printf' [-Wbuiltin-declaration-mismatch]
echo32.c: 37 | printf ("row %d,col %d :",i,j);
echo32.c: | ^~~~~~
echo32.c: echo32.c:37:25: note: include '<stdio.h>' or provide a declaration of 'printf'
echo32.c: echo32.c:47:9: warning: incompatible implicit declaration of built-in function 'printf' [-Wbuiltin-declaration-mismatch]
echo32.c: 47 | printf("-----------------------------------\n");
echo32.c: | ^~~~~~
echo32.c: echo32.c:47:9: note: include '<stdio.h>' or provide a declaration of 'printf'
echo32.c: echo32.c: In function 'Init':
echo32.c: echo32.c:126:23: warning: unused variable 'endianess' [-Wunused-variable]
echo32.c: 126 | unsigned char endianess;
echo32.c: | ^~~~~~~~~
echo32.c: echo32.c:125:25: warning: unused variable 'j' [-Wunused-variable]
echo32.c: 125 | unsigned int i, j;
echo32.c: | ^
echo32.c: echo32.c: In function 'Compress':
echo32.c: echo32.c:398:32: warning: unused variable 'c1' [-Wunused-variable]
echo32.c: ...
Number of similar (implementation,compiler) pairs: 4, namely:
Implementation | Compiler |
T:generic/opt32 | gcc -march=native -mtune=native -O2 -fwrapv -fPIC -fPIE -gdwarf-4 -Wall (14.2.0) |
T:generic/opt32 | gcc -march=native -mtune=native -O3 -fwrapv -fPIC -fPIE -gdwarf-4 -Wall (14.2.0) |
T:generic/opt32 | gcc -march=native -mtune=native -O -fwrapv -fPIC -fPIE -gdwarf-4 -Wall (14.2.0) |
T:generic/opt32 | gcc -march=native -mtune=native -Os -fwrapv -fPIC -fPIE -gdwarf-4 -Wall (14.2.0) |
Compiler output
echo64.c: echo64.c:318:30: warning: unused variable 'WT5' [-Wunused-variable]
echo64.c: 318 | WT0, WT1, WT2, WT3, WT4, WT5;
echo64.c: | ^~~
echo64.c: echo64.c:486:16: warning: unused variable 'i' [-Wunused-variable]
echo64.c: 486 | unsigned int i;
echo64.c: | ^
echo64.c: echo64.c:555:29: warning: passing 'const unsigned char *' to parameter of type 'BitSequence *' (aka 'unsigned char *') discards qualifiers [-Wincompatible-pointer-types-discards-qualifiers]
echo64.c: 555 | if (Hash(CRYPTO_BYTES * 8,in,inlen * 8,out) == SUCCESS) return 0;
echo64.c: | ^~
echo64.c: echo64.c:542:46: note: passing argument to parameter 'data' here
echo64.c: 542 | HashReturn Hash(int hashbitlen, BitSequence *data, DataLength databitlen, BitSequence *hashval)
echo64.c: | ^
echo64.c: 3 warnings generated.
Number of similar (implementation,compiler) pairs: 5, namely:
Implementation | Compiler |
T:generic/opt64 | clang -march=native -O2 -fwrapv -Qunused-arguments -fPIC -fPIE -gdwarf-4 -Wall (Debian_Clang_19.1.7_(1+b1)) |
T:generic/opt64 | clang -march=native -O3 -fwrapv -Qunused-arguments -fPIC -fPIE -gdwarf-4 -Wall (Debian_Clang_19.1.7_(1+b1)) |
T:generic/opt64 | clang -march=native -O -fwrapv -Qunused-arguments -fPIC -fPIE -gdwarf-4 -Wall (Debian_Clang_19.1.7_(1+b1)) |
T:generic/opt64 | clang -march=native -Os -fwrapv -Qunused-arguments -fPIC -fPIE -gdwarf-4 -Wall (Debian_Clang_19.1.7_(1+b1)) |
T:generic/opt64 | clang -mcpu=native -O3 -fwrapv -Qunused-arguments -fPIC -fPIE -gdwarf-4 -Wall (Debian_Clang_19.1.7_(1+b1)) |
Compiler output
echo64.c: echo64.c: In function 'Compress':
echo64.c: echo64.c:318:30: warning: unused variable 'WT5' [-Wunused-variable]
echo64.c: 318 | WT0, WT1, WT2, WT3, WT4, WT5;
echo64.c: | ^~~
echo64.c: echo64.c: In function 'Final':
echo64.c: echo64.c:486:16: warning: unused variable 'i' [-Wunused-variable]
echo64.c: 486 | unsigned int i;
echo64.c: | ^
echo64.c: echo64.c: In function 'crypto_hash_echosp256_generic_opt64_timingleaks':
echo64.c: echo64.c:555:29: warning: passing argument 2 of 'Hash' discards 'const' qualifier from pointer target type [-Wdiscarded-qualifiers]
echo64.c: 555 | if (Hash(CRYPTO_BYTES * 8,in,inlen * 8,out) == SUCCESS) return 0;
echo64.c: | ^~
echo64.c: echo64.c:542:46: note: expected 'BitSequence *' {aka 'unsigned char *'} but argument is of type 'const unsigned char *'
echo64.c: 542 | HashReturn Hash(int hashbitlen, BitSequence *data, DataLength databitlen, BitSequence *hashval)
echo64.c: | ~~~~~~~~~~~~~^~~~
Number of similar (implementation,compiler) pairs: 4, namely:
Implementation | Compiler |
T:generic/opt64 | gcc -march=native -mtune=native -O2 -fwrapv -fPIC -fPIE -gdwarf-4 -Wall (14.2.0) |
T:generic/opt64 | gcc -march=native -mtune=native -O3 -fwrapv -fPIC -fPIE -gdwarf-4 -Wall (14.2.0) |
T:generic/opt64 | gcc -march=native -mtune=native -O -fwrapv -fPIC -fPIE -gdwarf-4 -Wall (14.2.0) |
T:generic/opt64 | gcc -march=native -mtune=native -Os -fwrapv -fPIC -fPIE -gdwarf-4 -Wall (14.2.0) |
Compiler output
echo32.S: echo32.S:311:2: error: invalid instruction mnemonic 'addd'
echo32.S: addd [SHA3_CNT], 1
echo32.S: ^~~~
echo32.S: echo32.S:575:2: error: invalid instruction mnemonic 'addd'
echo32.S: addd [SHA3_CNT], 1
echo32.S: ^~~~
echo32.S: echo32.S:839:2: error: invalid instruction mnemonic 'addd'
echo32.S: addd [SHA3_CNT], 1
echo32.S: ^~~~
echo32.S: echo32.S:1103:2: error: invalid instruction mnemonic 'addd'
echo32.S: addd [SHA3_CNT], 1
echo32.S: ^~~~
echo32.S: echo32.S:1367:2: error: invalid instruction mnemonic 'addd'
echo32.S: addd [SHA3_CNT], 1
echo32.S: ^~~~
echo32.S: echo32.S:1631:2: error: invalid instruction mnemonic 'addd'
echo32.S: addd [SHA3_CNT], 1
echo32.S: ^~~~
echo32.S: echo32.S:1895:2: error: invalid instruction mnemonic 'addd'
echo32.S: addd [SHA3_CNT], 1
echo32.S: ^~~~
echo32.S: echo32.S:2159:2: error: invalid instruction mnemonic 'addd'
echo32.S: addd [SHA3_CNT], 1
echo32.S: ^~~~
echo32.S: echo32.S:2423:2: error: invalid instruction mnemonic 'addd'
echo32.S: ...
Number of similar (implementation,compiler) pairs: 5, namely:
Implementation | Compiler |
T:pentium/pentium4v64v1 | clang -march=native -O2 -fwrapv -Qunused-arguments -fPIC -fPIE -gdwarf-4 -Wall (Debian_Clang_19.1.7_(1+b1)) |
T:pentium/pentium4v64v1 | clang -march=native -O3 -fwrapv -Qunused-arguments -fPIC -fPIE -gdwarf-4 -Wall (Debian_Clang_19.1.7_(1+b1)) |
T:pentium/pentium4v64v1 | clang -march=native -O -fwrapv -Qunused-arguments -fPIC -fPIE -gdwarf-4 -Wall (Debian_Clang_19.1.7_(1+b1)) |
T:pentium/pentium4v64v1 | clang -march=native -Os -fwrapv -Qunused-arguments -fPIC -fPIE -gdwarf-4 -Wall (Debian_Clang_19.1.7_(1+b1)) |
T:pentium/pentium4v64v1 | clang -mcpu=native -O3 -fwrapv -Qunused-arguments -fPIC -fPIE -gdwarf-4 -Wall (Debian_Clang_19.1.7_(1+b1)) |
Compiler output
echo32.S: echo32.c: Assembler messages:
echo32.S: echo32.c:656: Warning: mnemonic suffix used with `add'
echo32.S: echo32.c:656: Warning: NOTE: Such forms are deprecated and will be rejected by a future version of the assembler
echo32.S: echo32.c:656: Warning: mnemonic suffix used with `add'
echo32.S: echo32.c:656: Warning: mnemonic suffix used with `add'
echo32.S: echo32.c:656: Warning: mnemonic suffix used with `add'
echo32.S: echo32.c:657: Warning: mnemonic suffix used with `add'
echo32.S: echo32.c:657: Warning: mnemonic suffix used with `add'
echo32.S: echo32.c:657: Warning: mnemonic suffix used with `add'
echo32.S: echo32.c:657: Warning: mnemonic suffix used with `add'
echo32.S: echo32.c:658: Warning: mnemonic suffix used with `add'
echo32.S: echo32.c:658: Warning: mnemonic suffix used with `add'
echo32.S: echo32.c:658: Warning: mnemonic suffix used with `add'
echo32.S: echo32.c:658: Warning: mnemonic suffix used with `add'
echo32.S: echo32.c:659: Warning: mnemonic suffix used with `add'
echo32.S: echo32.c:659: Warning: mnemonic suffix used with `add'
echo32.S: echo32.c:659: Warning: mnemonic suffix used with `add'
echo32.S: echo32.c:659: Warning: mnemonic suffix used with `add'
echo32.S: echo32.c:661: Warning: mnemonic suffix used with `sub'
echo32.S: echo32.c:688: Warning: mnemonic suffix used with `add'
echo32.S: echo32.c:688: Warning: mnemonic suffix used with `add'
echo32.S: echo32.c:688: Warning: mnemonic suffix used with `add'
echo32.S: echo32.c:688: Warning: mnemonic suffix used with `add'
echo32.S: echo32.c:688: Warning: mnemonic suffix used with `add'
echo32.S: echo32.c:688: Warning: mnemonic suffix used with `add'
echo32.S: ...
try.c: /usr/bin/ld: libcrypto_hash_echosp256.a(echo32.o): relocation R_X86_64_32S against symbol `SHA3_R' can not be used when making a PIE object; recompile with -fPIE
try.c: /usr/bin/ld: failed to set dynamic section sizes: bad value
try.c: collect2: error: ld returned 1 exit status
Number of similar (implementation,compiler) pairs: 4, namely:
Implementation | Compiler |
T:pentium/pentium4v64v1 | gcc -march=native -mtune=native -O2 -fwrapv -fPIC -fPIE -gdwarf-4 -Wall (14.2.0) |
T:pentium/pentium4v64v1 | gcc -march=native -mtune=native -O3 -fwrapv -fPIC -fPIE -gdwarf-4 -Wall (14.2.0) |
T:pentium/pentium4v64v1 | gcc -march=native -mtune=native -O -fwrapv -fPIC -fPIE -gdwarf-4 -Wall (14.2.0) |
T:pentium/pentium4v64v1 | gcc -march=native -mtune=native -Os -fwrapv -fPIC -fPIE -gdwarf-4 -Wall (14.2.0) |
Compiler output
echo64.S: echo64.S:383:2: error: invalid instruction mnemonic 'addd'
echo64.S: addd [SHA3_CNT], 1
echo64.S: ^~~~
echo64.S: echo64.S:647:2: error: invalid instruction mnemonic 'addd'
echo64.S: addd [SHA3_CNT], 1
echo64.S: ^~~~
echo64.S: echo64.S:911:2: error: invalid instruction mnemonic 'addd'
echo64.S: addd [SHA3_CNT], 1
echo64.S: ^~~~
echo64.S: echo64.S:1175:2: error: invalid instruction mnemonic 'addd'
echo64.S: addd [SHA3_CNT], 1
echo64.S: ^~~~
echo64.S: echo64.S:1439:2: error: invalid instruction mnemonic 'addd'
echo64.S: addd [SHA3_CNT], 1
echo64.S: ^~~~
echo64.S: echo64.S:1703:2: error: invalid instruction mnemonic 'addd'
echo64.S: addd [SHA3_CNT], 1
echo64.S: ^~~~
echo64.S: echo64.S:1967:2: error: invalid instruction mnemonic 'addd'
echo64.S: addd [SHA3_CNT], 1
echo64.S: ^~~~
echo64.S: echo64.S:2231:2: error: invalid instruction mnemonic 'addd'
echo64.S: addd [SHA3_CNT], 1
echo64.S: ^~~~
echo64.S: echo64.S:2495:2: error: invalid instruction mnemonic 'addd'
echo64.S: ...
Number of similar (implementation,compiler) pairs: 5, namely:
Implementation | Compiler |
T:pentium/pentium4v64v2 | clang -march=native -O2 -fwrapv -Qunused-arguments -fPIC -fPIE -gdwarf-4 -Wall (Debian_Clang_19.1.7_(1+b1)) |
T:pentium/pentium4v64v2 | clang -march=native -O3 -fwrapv -Qunused-arguments -fPIC -fPIE -gdwarf-4 -Wall (Debian_Clang_19.1.7_(1+b1)) |
T:pentium/pentium4v64v2 | clang -march=native -O -fwrapv -Qunused-arguments -fPIC -fPIE -gdwarf-4 -Wall (Debian_Clang_19.1.7_(1+b1)) |
T:pentium/pentium4v64v2 | clang -march=native -Os -fwrapv -Qunused-arguments -fPIC -fPIE -gdwarf-4 -Wall (Debian_Clang_19.1.7_(1+b1)) |
T:pentium/pentium4v64v2 | clang -mcpu=native -O3 -fwrapv -Qunused-arguments -fPIC -fPIE -gdwarf-4 -Wall (Debian_Clang_19.1.7_(1+b1)) |
Compiler output
echo64.S: echo64.c: Assembler messages:
echo64.S: echo64.c:735: Warning: mnemonic suffix used with `add'
echo64.S: echo64.c:735: Warning: NOTE: Such forms are deprecated and will be rejected by a future version of the assembler
echo64.S: echo64.c:735: Warning: mnemonic suffix used with `add'
echo64.S: echo64.c:735: Warning: mnemonic suffix used with `add'
echo64.S: echo64.c:735: Warning: mnemonic suffix used with `add'
echo64.S: echo64.c:736: Warning: mnemonic suffix used with `add'
echo64.S: echo64.c:736: Warning: mnemonic suffix used with `add'
echo64.S: echo64.c:736: Warning: mnemonic suffix used with `add'
echo64.S: echo64.c:736: Warning: mnemonic suffix used with `add'
echo64.S: echo64.c:737: Warning: mnemonic suffix used with `add'
echo64.S: echo64.c:737: Warning: mnemonic suffix used with `add'
echo64.S: echo64.c:737: Warning: mnemonic suffix used with `add'
echo64.S: echo64.c:737: Warning: mnemonic suffix used with `add'
echo64.S: echo64.c:738: Warning: mnemonic suffix used with `add'
echo64.S: echo64.c:738: Warning: mnemonic suffix used with `add'
echo64.S: echo64.c:738: Warning: mnemonic suffix used with `add'
echo64.S: echo64.c:738: Warning: mnemonic suffix used with `add'
echo64.S: echo64.c:740: Warning: mnemonic suffix used with `sub'
echo64.S: echo64.c:768: Warning: mnemonic suffix used with `add'
echo64.S: echo64.c:768: Warning: mnemonic suffix used with `add'
echo64.S: echo64.c:768: Warning: mnemonic suffix used with `add'
echo64.S: echo64.c:768: Warning: mnemonic suffix used with `add'
echo64.S: echo64.c:768: Warning: mnemonic suffix used with `add'
echo64.S: echo64.c:768: Warning: mnemonic suffix used with `add'
echo64.S: ...
try.c: /usr/bin/ld: libcrypto_hash_echosp256.a(echo64.o): relocation R_X86_64_32S against symbol `SHA3_R' can not be used when making a PIE object; recompile with -fPIE
try.c: /usr/bin/ld: failed to set dynamic section sizes: bad value
try.c: collect2: error: ld returned 1 exit status
Number of similar (implementation,compiler) pairs: 4, namely:
Implementation | Compiler |
T:pentium/pentium4v64v2 | gcc -march=native -mtune=native -O2 -fwrapv -fPIC -fPIE -gdwarf-4 -Wall (14.2.0) |
T:pentium/pentium4v64v2 | gcc -march=native -mtune=native -O3 -fwrapv -fPIC -fPIE -gdwarf-4 -Wall (14.2.0) |
T:pentium/pentium4v64v2 | gcc -march=native -mtune=native -O -fwrapv -fPIC -fPIE -gdwarf-4 -Wall (14.2.0) |
T:pentium/pentium4v64v2 | gcc -march=native -mtune=native -Os -fwrapv -fPIC -fPIE -gdwarf-4 -Wall (14.2.0) |
Compiler output
echo32.c: echo32.c:106:18: warning: unused variable 'j' [-Wunused-variable]
echo32.c: 106 | unsigned int i, j;
echo32.c: | ^
echo32.c: echo32.c:107:16: warning: unused variable 'endianess' [-Wunused-variable]
echo32.c: 107 | unsigned char endianess;
echo32.c: | ^~~~~~~~~
echo32.c: echo32.c:512:21: warning: unused variable 'c0' [-Wunused-variable]
echo32.c: 512 | unsigned long long c0, c1;
echo32.c: | ^~
echo32.c: echo32.c:512:25: warning: unused variable 'c1' [-Wunused-variable]
echo32.c: 512 | unsigned long long c0, c1;
echo32.c: | ^~
echo32.c: echo32.c:639:21: warning: unused variable 'hashlen' [-Wunused-variable]
echo32.c: 639 | unsigned short int hashlen = 0;
echo32.c: | ^~~~~~~
echo32.c: echo32.c:640:21: warning: unused variable 'messlen_l' [-Wunused-variable]
echo32.c: 640 | unsigned long long messlen_l = 0;
echo32.c: | ^~~~~~~~~
echo32.c: echo32.c:641:21: warning: unused variable 'messlen_h' [-Wunused-variable]
echo32.c: 641 | unsigned long long messlen_h = 0;
echo32.c: | ^~~~~~~~~
echo32.c: 7 warnings generated.
Number of similar (implementation,compiler) pairs: 5, namely:
Implementation | Compiler |
T:powerpc/pp32cv1 | clang -march=native -O2 -fwrapv -Qunused-arguments -fPIC -fPIE -gdwarf-4 -Wall (Debian_Clang_19.1.7_(1+b1)) |
T:powerpc/pp32cv1 | clang -march=native -O3 -fwrapv -Qunused-arguments -fPIC -fPIE -gdwarf-4 -Wall (Debian_Clang_19.1.7_(1+b1)) |
T:powerpc/pp32cv1 | clang -march=native -O -fwrapv -Qunused-arguments -fPIC -fPIE -gdwarf-4 -Wall (Debian_Clang_19.1.7_(1+b1)) |
T:powerpc/pp32cv1 | clang -march=native -Os -fwrapv -Qunused-arguments -fPIC -fPIE -gdwarf-4 -Wall (Debian_Clang_19.1.7_(1+b1)) |
T:powerpc/pp32cv1 | clang -mcpu=native -O3 -fwrapv -Qunused-arguments -fPIC -fPIE -gdwarf-4 -Wall (Debian_Clang_19.1.7_(1+b1)) |
Compiler output
echo32.c: echo32.c: In function 'Init':
echo32.c: echo32.c:107:23: warning: unused variable 'endianess' [-Wunused-variable]
echo32.c: 107 | unsigned char endianess;
echo32.c: | ^~~~~~~~~
echo32.c: echo32.c:106:25: warning: unused variable 'j' [-Wunused-variable]
echo32.c: 106 | unsigned int i, j;
echo32.c: | ^
echo32.c: echo32.c: In function 'Compress':
echo32.c: echo32.c:512:32: warning: unused variable 'c1' [-Wunused-variable]
echo32.c: 512 | unsigned long long c0, c1;
echo32.c: | ^~
echo32.c: echo32.c:512:28: warning: unused variable 'c0' [-Wunused-variable]
echo32.c: 512 | unsigned long long c0, c1;
echo32.c: | ^~
echo32.c: echo32.c: In function 'Final':
echo32.c: echo32.c:641:28: warning: unused variable 'messlen_h' [-Wunused-variable]
echo32.c: 641 | unsigned long long messlen_h = 0;
echo32.c: | ^~~~~~~~~
echo32.c: echo32.c:640:28: warning: unused variable 'messlen_l' [-Wunused-variable]
echo32.c: 640 | unsigned long long messlen_l = 0;
echo32.c: | ^~~~~~~~~
echo32.c: echo32.c:639:28: warning: unused variable 'hashlen' [-Wunused-variable]
echo32.c: 639 | unsigned short int hashlen = 0;
echo32.c: | ^~~~~~~
Number of similar (implementation,compiler) pairs: 4, namely:
Implementation | Compiler |
T:powerpc/pp32cv1 | gcc -march=native -mtune=native -O2 -fwrapv -fPIC -fPIE -gdwarf-4 -Wall (14.2.0) |
T:powerpc/pp32cv1 | gcc -march=native -mtune=native -O3 -fwrapv -fPIC -fPIE -gdwarf-4 -Wall (14.2.0) |
T:powerpc/pp32cv1 | gcc -march=native -mtune=native -O -fwrapv -fPIC -fPIE -gdwarf-4 -Wall (14.2.0) |
T:powerpc/pp32cv1 | gcc -march=native -mtune=native -Os -fwrapv -fPIC -fPIE -gdwarf-4 -Wall (14.2.0) |
Compiler output
echo32.c: echo32.c:106:18: warning: unused variable 'j' [-Wunused-variable]
echo32.c: 106 | unsigned int i, j;
echo32.c: | ^
echo32.c: echo32.c:107:16: warning: unused variable 'endianess' [-Wunused-variable]
echo32.c: 107 | unsigned char endianess;
echo32.c: | ^~~~~~~~~
echo32.c: echo32.c:480:21: warning: unused variable 'c0' [-Wunused-variable]
echo32.c: 480 | unsigned long long c0, c1;
echo32.c: | ^~
echo32.c: echo32.c:480:25: warning: unused variable 'c1' [-Wunused-variable]
echo32.c: 480 | unsigned long long c0, c1;
echo32.c: | ^~
echo32.c: echo32.c:607:21: warning: unused variable 'hashlen' [-Wunused-variable]
echo32.c: 607 | unsigned short int hashlen = 0;
echo32.c: | ^~~~~~~
echo32.c: echo32.c:608:21: warning: unused variable 'messlen_l' [-Wunused-variable]
echo32.c: 608 | unsigned long long messlen_l = 0;
echo32.c: | ^~~~~~~~~
echo32.c: echo32.c:609:21: warning: unused variable 'messlen_h' [-Wunused-variable]
echo32.c: 609 | unsigned long long messlen_h = 0;
echo32.c: | ^~~~~~~~~
echo32.c: 7 warnings generated.
Number of similar (implementation,compiler) pairs: 5, namely:
Implementation | Compiler |
T:powerpc/pp32cv2 | clang -march=native -O2 -fwrapv -Qunused-arguments -fPIC -fPIE -gdwarf-4 -Wall (Debian_Clang_19.1.7_(1+b1)) |
T:powerpc/pp32cv2 | clang -march=native -O3 -fwrapv -Qunused-arguments -fPIC -fPIE -gdwarf-4 -Wall (Debian_Clang_19.1.7_(1+b1)) |
T:powerpc/pp32cv2 | clang -march=native -O -fwrapv -Qunused-arguments -fPIC -fPIE -gdwarf-4 -Wall (Debian_Clang_19.1.7_(1+b1)) |
T:powerpc/pp32cv2 | clang -march=native -Os -fwrapv -Qunused-arguments -fPIC -fPIE -gdwarf-4 -Wall (Debian_Clang_19.1.7_(1+b1)) |
T:powerpc/pp32cv2 | clang -mcpu=native -O3 -fwrapv -Qunused-arguments -fPIC -fPIE -gdwarf-4 -Wall (Debian_Clang_19.1.7_(1+b1)) |
Compiler output
echo32.c: echo32.c: In function 'Init':
echo32.c: echo32.c:107:23: warning: unused variable 'endianess' [-Wunused-variable]
echo32.c: 107 | unsigned char endianess;
echo32.c: | ^~~~~~~~~
echo32.c: echo32.c:106:25: warning: unused variable 'j' [-Wunused-variable]
echo32.c: 106 | unsigned int i, j;
echo32.c: | ^
echo32.c: echo32.c: In function 'Compress':
echo32.c: echo32.c:480:32: warning: unused variable 'c1' [-Wunused-variable]
echo32.c: 480 | unsigned long long c0, c1;
echo32.c: | ^~
echo32.c: echo32.c:480:28: warning: unused variable 'c0' [-Wunused-variable]
echo32.c: 480 | unsigned long long c0, c1;
echo32.c: | ^~
echo32.c: echo32.c: In function 'Final':
echo32.c: echo32.c:609:28: warning: unused variable 'messlen_h' [-Wunused-variable]
echo32.c: 609 | unsigned long long messlen_h = 0;
echo32.c: | ^~~~~~~~~
echo32.c: echo32.c:608:28: warning: unused variable 'messlen_l' [-Wunused-variable]
echo32.c: 608 | unsigned long long messlen_l = 0;
echo32.c: | ^~~~~~~~~
echo32.c: echo32.c:607:28: warning: unused variable 'hashlen' [-Wunused-variable]
echo32.c: 607 | unsigned short int hashlen = 0;
echo32.c: | ^~~~~~~
Number of similar (implementation,compiler) pairs: 4, namely:
Implementation | Compiler |
T:powerpc/pp32cv2 | gcc -march=native -mtune=native -O2 -fwrapv -fPIC -fPIE -gdwarf-4 -Wall (14.2.0) |
T:powerpc/pp32cv2 | gcc -march=native -mtune=native -O3 -fwrapv -fPIC -fPIE -gdwarf-4 -Wall (14.2.0) |
T:powerpc/pp32cv2 | gcc -march=native -mtune=native -O -fwrapv -fPIC -fPIE -gdwarf-4 -Wall (14.2.0) |
T:powerpc/pp32cv2 | gcc -march=native -mtune=native -Os -fwrapv -fPIC -fPIE -gdwarf-4 -Wall (14.2.0) |
Namespace violations
echo64.o Compress T
echo64.o Endianess T
echo64.o Final T
echo64.o Hash T
echo64.o Init T
echo64.o PushString T
echo64.o Update T
echo64.o endian B
Number of similar (implementation,compiler) pairs: 9, namely:
Implementation | Compiler |
T:generic/opt64 | clang -march=native -O2 -fwrapv -Qunused-arguments -fPIC -fPIE -gdwarf-4 -Wall (Debian_Clang_19.1.7_(1+b1)) |
T:generic/opt64 | clang -march=native -O3 -fwrapv -Qunused-arguments -fPIC -fPIE -gdwarf-4 -Wall (Debian_Clang_19.1.7_(1+b1)) |
T:generic/opt64 | clang -march=native -O -fwrapv -Qunused-arguments -fPIC -fPIE -gdwarf-4 -Wall (Debian_Clang_19.1.7_(1+b1)) |
T:generic/opt64 | clang -march=native -Os -fwrapv -Qunused-arguments -fPIC -fPIE -gdwarf-4 -Wall (Debian_Clang_19.1.7_(1+b1)) |
T:generic/opt64 | clang -mcpu=native -O3 -fwrapv -Qunused-arguments -fPIC -fPIE -gdwarf-4 -Wall (Debian_Clang_19.1.7_(1+b1)) |
T:generic/opt64 | gcc -march=native -mtune=native -O2 -fwrapv -fPIC -fPIE -gdwarf-4 -Wall (14.2.0) |
T:generic/opt64 | gcc -march=native -mtune=native -O3 -fwrapv -fPIC -fPIE -gdwarf-4 -Wall (14.2.0) |
T:generic/opt64 | gcc -march=native -mtune=native -O -fwrapv -fPIC -fPIE -gdwarf-4 -Wall (14.2.0) |
T:generic/opt64 | gcc -march=native -mtune=native -Os -fwrapv -fPIC -fPIE -gdwarf-4 -Wall (14.2.0) |
Namespace violations
echo32.o CNT_r B
echo32.o Compress T
echo32.o Endianess T
echo32.o Final T
echo32.o Hash T
echo32.o Init T
echo32.o PushString T
echo32.o Update T
echo32.o endian B
echo32.o flip_bits T
echo32.o r B
Number of similar (implementation,compiler) pairs: 18, namely:
Implementation | Compiler |
T:powerpc/pp32cv1 | clang -march=native -O2 -fwrapv -Qunused-arguments -fPIC -fPIE -gdwarf-4 -Wall (Debian_Clang_19.1.7_(1+b1)) |
T:powerpc/pp32cv1 | clang -march=native -O3 -fwrapv -Qunused-arguments -fPIC -fPIE -gdwarf-4 -Wall (Debian_Clang_19.1.7_(1+b1)) |
T:powerpc/pp32cv1 | clang -march=native -O -fwrapv -Qunused-arguments -fPIC -fPIE -gdwarf-4 -Wall (Debian_Clang_19.1.7_(1+b1)) |
T:powerpc/pp32cv1 | clang -march=native -Os -fwrapv -Qunused-arguments -fPIC -fPIE -gdwarf-4 -Wall (Debian_Clang_19.1.7_(1+b1)) |
T:powerpc/pp32cv1 | clang -mcpu=native -O3 -fwrapv -Qunused-arguments -fPIC -fPIE -gdwarf-4 -Wall (Debian_Clang_19.1.7_(1+b1)) |
T:powerpc/pp32cv1 | gcc -march=native -mtune=native -O2 -fwrapv -fPIC -fPIE -gdwarf-4 -Wall (14.2.0) |
T:powerpc/pp32cv1 | gcc -march=native -mtune=native -O3 -fwrapv -fPIC -fPIE -gdwarf-4 -Wall (14.2.0) |
T:powerpc/pp32cv1 | gcc -march=native -mtune=native -O -fwrapv -fPIC -fPIE -gdwarf-4 -Wall (14.2.0) |
T:powerpc/pp32cv1 | gcc -march=native -mtune=native -Os -fwrapv -fPIC -fPIE -gdwarf-4 -Wall (14.2.0) |
T:powerpc/pp32cv2 | clang -march=native -O2 -fwrapv -Qunused-arguments -fPIC -fPIE -gdwarf-4 -Wall (Debian_Clang_19.1.7_(1+b1)) |
T:powerpc/pp32cv2 | clang -march=native -O3 -fwrapv -Qunused-arguments -fPIC -fPIE -gdwarf-4 -Wall (Debian_Clang_19.1.7_(1+b1)) |
T:powerpc/pp32cv2 | clang -march=native -O -fwrapv -Qunused-arguments -fPIC -fPIE -gdwarf-4 -Wall (Debian_Clang_19.1.7_(1+b1)) |
T:powerpc/pp32cv2 | clang -march=native -Os -fwrapv -Qunused-arguments -fPIC -fPIE -gdwarf-4 -Wall (Debian_Clang_19.1.7_(1+b1)) |
T:powerpc/pp32cv2 | clang -mcpu=native -O3 -fwrapv -Qunused-arguments -fPIC -fPIE -gdwarf-4 -Wall (Debian_Clang_19.1.7_(1+b1)) |
T:powerpc/pp32cv2 | gcc -march=native -mtune=native -O2 -fwrapv -fPIC -fPIE -gdwarf-4 -Wall (14.2.0) |
T:powerpc/pp32cv2 | gcc -march=native -mtune=native -O3 -fwrapv -fPIC -fPIE -gdwarf-4 -Wall (14.2.0) |
T:powerpc/pp32cv2 | gcc -march=native -mtune=native -O -fwrapv -fPIC -fPIE -gdwarf-4 -Wall (14.2.0) |
T:powerpc/pp32cv2 | gcc -march=native -mtune=native -Os -fwrapv -fPIC -fPIE -gdwarf-4 -Wall (14.2.0) |