Test results for amd64, speed2supercop, crypto_hash/asconhashav12

[Page version: 20250318 22:34:28]

Measurements for amd64, speed2supercop, crypto_hash Test results for amd64, speed2supercop, crypto_hash Test results for crypto_hash/asconhashav12
Computer: speed2supercop
Microarchitecture: amd64; Haswell+AES (306c3)
Architecture: amd64
CPU ID: GenuineIntel-000306c3-1fc9cbf5
SUPERCOP version: 20250307
Operation: crypto_hash
Primitive: asconhashav12
TimeObject sizeTest sizeImplementationCompilerBenchmark dateSUPERCOP version
221684835 0 019566 792 792opt64clang -march=native -O2 -fwrapv -Qunused-arguments -fPIC -fPIE -gdwarf-4 -Wall2025031020250307
222044811 0 015815 784 792opt64clang -march=native -Os -fwrapv -Qunused-arguments -fPIC -fPIE -gdwarf-4 -Wall2025031020250307
222284835 0 019502 792 792opt64clang -march=native -O3 -fwrapv -Qunused-arguments -fPIC -fPIE -gdwarf-4 -Wall2025031020250307
222284835 0 014790 792 728opt64clang -march=native -O -fwrapv -Qunused-arguments -fPIC -fPIE -gdwarf-4 -Wall2025031020250307
225404657 0 013560 728 768opt64gcc -march=native -mtune=native -Os -fwrapv -fPIC -fPIE -gdwarf-4 -Wall2025031020250307
227964903 0 015205 752 800opt64gcc -march=native -mtune=native -O2 -fwrapv -fPIC -fPIE -gdwarf-4 -Wall2025031020250307
228444903 0 017069 752 800opt64gcc -march=native -mtune=native -O3 -fwrapv -fPIC -fPIE -gdwarf-4 -Wall2025031020250307
229764993 0 021454 792 728opt64clang -mcpu=native -O3 -fwrapv -Qunused-arguments -fPIC -fPIE -gdwarf-4 -Wall2025031020250307
234005061 0 017221 752 800refgcc -march=native -mtune=native -O3 -fwrapv -fPIC -fPIE -gdwarf-4 -Wall2025031020250307
245845545 0 015684 744 800opt64gcc -march=native -mtune=native -O -fwrapv -fPIC -fPIE -gdwarf-4 -Wall2025031020250307
250165120 0 015429 752 800refgcc -march=native -mtune=native -O2 -fwrapv -fPIC -fPIE -gdwarf-4 -Wall2025031020250307
251483767 0 018446 792 792refclang -march=native -O3 -fwrapv -Qunused-arguments -fPIC -fPIE -gdwarf-4 -Wall2025031020250307
254525124 0 015268 744 800refgcc -march=native -mtune=native -O -fwrapv -fPIC -fPIE -gdwarf-4 -Wall2025031020250307
25660704 0 09632 728 768opt64_lowsizegcc -march=native -mtune=native -Os -fwrapv -fPIC -fPIE -gdwarf-4 -Wall2025031020250307
257363767 0 018510 792 792refclang -march=native -O2 -fwrapv -Qunused-arguments -fPIC -fPIE -gdwarf-4 -Wall2025031020250307
26304799 0 011085 752 800opt64_lowsizegcc -march=native -mtune=native -O2 -fwrapv -fPIC -fPIE -gdwarf-4 -Wall2025031020250307
26388721 0 015478 792 792opt64_lowsizeclang -march=native -O2 -fwrapv -Qunused-arguments -fPIC -fPIE -gdwarf-4 -Wall2025031020250307
26400666 0 010654 792 728opt64_lowsizeclang -march=native -O -fwrapv -Qunused-arguments -fPIC -fPIE -gdwarf-4 -Wall2025031020250307
26424669 0 011663 784 792opt64_lowsizeclang -march=native -Os -fwrapv -Qunused-arguments -fPIC -fPIE -gdwarf-4 -Wall2025031020250307
26440721 0 015406 792 792opt64_lowsizeclang -march=native -O3 -fwrapv -Qunused-arguments -fPIC -fPIE -gdwarf-4 -Wall2025031020250307
26892799 0 012949 752 800opt64_lowsizegcc -march=native -mtune=native -O3 -fwrapv -fPIC -fPIE -gdwarf-4 -Wall2025031020250307
271084004 0 015039 784 792refclang -march=native -Os -fwrapv -Qunused-arguments -fPIC -fPIE -gdwarf-4 -Wall2025031020250307
273523871 0 013838 792 728refclang -march=native -O -fwrapv -Qunused-arguments -fPIC -fPIE -gdwarf-4 -Wall2025031020250307
274721291 0 011412 744 800opt64_lowsizegcc -march=native -mtune=native -O -fwrapv -fPIC -fPIE -gdwarf-4 -Wall2025031020250307
275405974 0 015926 792 728opt32clang -march=native -O -fwrapv -Qunused-arguments -fPIC -fPIE -gdwarf-4 -Wall2025031020250307
275525951 0 016951 784 792opt32clang -march=native -Os -fwrapv -Qunused-arguments -fPIC -fPIE -gdwarf-4 -Wall2025031020250307
276605974 0 020638 792 792opt32clang -march=native -O3 -fwrapv -Qunused-arguments -fPIC -fPIE -gdwarf-4 -Wall2025031020250307
27680751 0 017222 792 728opt64_lowsizeclang -mcpu=native -O3 -fwrapv -Qunused-arguments -fPIC -fPIE -gdwarf-4 -Wall2025031020250307
277125974 0 020702 792 792opt32clang -march=native -O2 -fwrapv -Qunused-arguments -fPIC -fPIE -gdwarf-4 -Wall2025031020250307
277524345 0 020822 792 728refclang -mcpu=native -O3 -fwrapv -Qunused-arguments -fPIC -fPIE -gdwarf-4 -Wall2025031020250307
280886295 0 016597 752 800opt32gcc -march=native -mtune=native -O2 -fwrapv -fPIC -fPIE -gdwarf-4 -Wall2025031020250307
283126295 0 018461 752 800opt32gcc -march=native -mtune=native -O3 -fwrapv -fPIC -fPIE -gdwarf-4 -Wall2025031020250307
293086853 0 016996 744 800opt32gcc -march=native -mtune=native -O -fwrapv -fPIC -fPIE -gdwarf-4 -Wall2025031020250307
303126441 0 015344 728 768opt32gcc -march=native -mtune=native -Os -fwrapv -fPIC -fPIE -gdwarf-4 -Wall2025031020250307
31452844 0 011125 752 800opt32_lowsizegcc -march=native -mtune=native -O2 -fwrapv -fPIC -fPIE -gdwarf-4 -Wall2025031020250307
31496844 0 012989 752 800opt32_lowsizegcc -march=native -mtune=native -O3 -fwrapv -fPIC -fPIE -gdwarf-4 -Wall2025031020250307
32160705 0 010686 792 728opt32_lowsizeclang -march=native -O -fwrapv -Qunused-arguments -fPIC -fPIE -gdwarf-4 -Wall2025031020250307
32220760 0 015438 792 792opt32_lowsizeclang -march=native -O3 -fwrapv -Qunused-arguments -fPIC -fPIE -gdwarf-4 -Wall2025031020250307
32232760 0 015510 792 792opt32_lowsizeclang -march=native -O2 -fwrapv -Qunused-arguments -fPIC -fPIE -gdwarf-4 -Wall2025031020250307
32268708 0 011695 784 792opt32_lowsizeclang -march=native -Os -fwrapv -Qunused-arguments -fPIC -fPIE -gdwarf-4 -Wall2025031020250307
32804774 0 09688 728 768opt32_lowsizegcc -march=native -mtune=native -Os -fwrapv -fPIC -fPIE -gdwarf-4 -Wall2025031020250307
331486824 0 023278 792 728opt32clang -mcpu=native -O3 -fwrapv -Qunused-arguments -fPIC -fPIE -gdwarf-4 -Wall2025031020250307
337921368 0 011492 744 800opt32_lowsizegcc -march=native -mtune=native -O -fwrapv -fPIC -fPIE -gdwarf-4 -Wall2025031020250307
357441006 0 09928 728 768refgcc -march=native -mtune=native -Os -fwrapv -fPIC -fPIE -gdwarf-4 -Wall2025031020250307
38260795 0 017254 792 728opt32_lowsizeclang -mcpu=native -O3 -fwrapv -Qunused-arguments -fPIC -fPIE -gdwarf-4 -Wall2025031020250307
507168262 0 018206 792 728bi32clang -march=native -O -fwrapv -Qunused-arguments -fPIC -fPIE -gdwarf-4 -Wall2025031020250307
507968687 0 023366 792 792bi32clang -march=native -O3 -fwrapv -Qunused-arguments -fPIC -fPIE -gdwarf-4 -Wall2025031020250307
508048246 0 022950 792 792bi32clang -march=native -O2 -fwrapv -Qunused-arguments -fPIC -fPIE -gdwarf-4 -Wall2025031020250307
508048236 0 019215 784 792bi32clang -march=native -Os -fwrapv -Qunused-arguments -fPIC -fPIE -gdwarf-4 -Wall2025031020250307
516808560 0 020705 752 800bi32gcc -march=native -mtune=native -O3 -fwrapv -fPIC -fPIE -gdwarf-4 -Wall2025031020250307
519809137 0 019244 744 800bi32gcc -march=native -mtune=native -O -fwrapv -fPIC -fPIE -gdwarf-4 -Wall2025031020250307
528368651 0 025094 792 728bi32clang -mcpu=native -O3 -fwrapv -Qunused-arguments -fPIC -fPIE -gdwarf-4 -Wall2025031020250307
528568564 0 018845 752 800bi32gcc -march=native -mtune=native -O2 -fwrapv -fPIC -fPIE -gdwarf-4 -Wall2025031020250307
538728008 0 016888 728 768bi32gcc -march=native -mtune=native -Os -fwrapv -fPIC -fPIE -gdwarf-4 -Wall2025031020250307
560922994 0 012982 792 728bi32_lowregclang -march=native -O -fwrapv -Qunused-arguments -fPIC -fPIE -gdwarf-4 -Wall2025031020250307
561402908 0 013895 784 792bi32_lowregclang -march=native -Os -fwrapv -Qunused-arguments -fPIC -fPIE -gdwarf-4 -Wall2025031020250307
561563574 0 013756 744 800bi32_lowreggcc -march=native -mtune=native -O -fwrapv -fPIC -fPIE -gdwarf-4 -Wall2025031020250307
562763010 0 017758 792 792bi32_lowregclang -march=native -O2 -fwrapv -Qunused-arguments -fPIC -fPIE -gdwarf-4 -Wall2025031020250307
562883010 0 017694 792 792bi32_lowregclang -march=native -O3 -fwrapv -Qunused-arguments -fPIC -fPIE -gdwarf-4 -Wall2025031020250307
568401461 0 011446 792 728bi32_lowsizeclang -march=native -O -fwrapv -Qunused-arguments -fPIC -fPIE -gdwarf-4 -Wall2025031020250307
568521507 0 016254 792 792bi32_lowsizeclang -march=native -O2 -fwrapv -Qunused-arguments -fPIC -fPIE -gdwarf-4 -Wall2025031020250307
569081507 0 016190 792 792bi32_lowsizeclang -march=native -O3 -fwrapv -Qunused-arguments -fPIC -fPIE -gdwarf-4 -Wall2025031020250307
571122390 0 011360 728 768bi32_lowreggcc -march=native -mtune=native -Os -fwrapv -fPIC -fPIE -gdwarf-4 -Wall2025031020250307
571883005 0 019502 792 728bi32_lowregclang -mcpu=native -O3 -fwrapv -Qunused-arguments -fPIC -fPIE -gdwarf-4 -Wall2025031020250307
574001393 0 010312 728 768bi32_lowsizegcc -march=native -mtune=native -Os -fwrapv -fPIC -fPIE -gdwarf-4 -Wall2025031020250307
574641439 0 012415 784 792bi32_lowsizeclang -march=native -Os -fwrapv -Qunused-arguments -fPIC -fPIE -gdwarf-4 -Wall2025031020250307
579963054 0 013381 752 800bi32_lowreggcc -march=native -mtune=native -O2 -fwrapv -fPIC -fPIE -gdwarf-4 -Wall2025031020250307
581003054 0 015245 752 800bi32_lowreggcc -march=native -mtune=native -O3 -fwrapv -fPIC -fPIE -gdwarf-4 -Wall2025031020250307
584601511 0 017966 792 728bi32_lowsizeclang -mcpu=native -O3 -fwrapv -Qunused-arguments -fPIC -fPIE -gdwarf-4 -Wall2025031020250307
587361746 0 011876 744 800bi32_lowsizegcc -march=native -mtune=native -O -fwrapv -fPIC -fPIE -gdwarf-4 -Wall2025031020250307
594641526 0 013669 752 800bi32_lowsizegcc -march=native -mtune=native -O3 -fwrapv -fPIC -fPIE -gdwarf-4 -Wall2025031020250307
594721526 0 011805 752 800bi32_lowsizegcc -march=native -mtune=native -O2 -fwrapv -fPIC -fPIE -gdwarf-4 -Wall2025031020250307
1954643394 0 018054 792 792opt8clang -march=native -O2 -fwrapv -Qunused-arguments -fPIC -fPIE -gdwarf-4 -Wall2025031020250307
1965523207 0 017934 792 792opt8_lowsizeclang -march=native -O2 -fwrapv -Qunused-arguments -fPIC -fPIE -gdwarf-4 -Wall2025031020250307
2083802396 0 013367 784 792opt8_lowsizeclang -march=native -Os -fwrapv -Qunused-arguments -fPIC -fPIE -gdwarf-4 -Wall2025031020250307
2086482412 0 013391 784 792opt8clang -march=native -Os -fwrapv -Qunused-arguments -fPIC -fPIE -gdwarf-4 -Wall2025031020250307
2147523842 0 019926 792 728bi8clang -mcpu=native -O3 -fwrapv -Qunused-arguments -fPIC -fPIE -gdwarf-4 -Wall2025031020250307
2359483369 0 013999 784 792bi8clang -march=native -Os -fwrapv -Qunused-arguments -fPIC -fPIE -gdwarf-4 -Wall2025031020250307
2360963835 0 018150 792 792bi8clang -march=native -O3 -fwrapv -Qunused-arguments -fPIC -fPIE -gdwarf-4 -Wall2025031020250307
2362083835 0 018198 792 792bi8clang -march=native -O2 -fwrapv -Qunused-arguments -fPIC -fPIE -gdwarf-4 -Wall2025031020250307
2415923419 0 012990 792 728bi8clang -march=native -O -fwrapv -Qunused-arguments -fPIC -fPIE -gdwarf-4 -Wall2025031020250307
2874964613 0 021062 792 728opt8clang -mcpu=native -O3 -fwrapv -Qunused-arguments -fPIC -fPIE -gdwarf-4 -Wall2025031020250307
2892084272 0 020718 792 728opt8_lowsizeclang -mcpu=native -O3 -fwrapv -Qunused-arguments -fPIC -fPIE -gdwarf-4 -Wall2025031020250307
2999684225 0 015981 752 800bi8gcc -march=native -mtune=native -O3 -fwrapv -fPIC -fPIE -gdwarf-4 -Wall2025031020250307
3014643611 0 012288 728 768bi8gcc -march=native -mtune=native -Os -fwrapv -fPIC -fPIE -gdwarf-4 -Wall2025031020250307
3024004229 0 014117 752 800bi8gcc -march=native -mtune=native -O2 -fwrapv -fPIC -fPIE -gdwarf-4 -Wall2025031020250307
3141364834 0 019405 792 792opt8clang -march=native -O3 -fwrapv -Qunused-arguments -fPIC -fPIE -gdwarf-4 -Wall2025031020250307
3148244477 0 019141 792 792opt8_lowsizeclang -march=native -O3 -fwrapv -Qunused-arguments -fPIC -fPIE -gdwarf-4 -Wall2025031020250307
3151404755 0 014500 744 800bi8gcc -march=native -mtune=native -O -fwrapv -fPIC -fPIE -gdwarf-4 -Wall2025031020250307
3389203183 0 013525 752 800opt8gcc -march=native -mtune=native -O2 -fwrapv -fPIC -fPIE -gdwarf-4 -Wall2025031020250307
3390723008 0 013301 752 800opt8_lowsizegcc -march=native -mtune=native -O2 -fwrapv -fPIC -fPIE -gdwarf-4 -Wall2025031020250307
3492962714 0 012670 792 728opt8clang -march=native -O -fwrapv -Qunused-arguments -fPIC -fPIE -gdwarf-4 -Wall2025031020250307
3497242427 0 012398 792 728opt8_lowsizeclang -march=native -O -fwrapv -Qunused-arguments -fPIC -fPIE -gdwarf-4 -Wall2025031020250307
3547524202 0 016381 752 800opt8gcc -march=native -mtune=native -O3 -fwrapv -fPIC -fPIE -gdwarf-4 -Wall2025031020250307
3565363818 0 015965 752 800opt8_lowsizegcc -march=native -mtune=native -O3 -fwrapv -fPIC -fPIE -gdwarf-4 -Wall2025031020250307
5205204283 0 014436 744 800opt8gcc -march=native -mtune=native -O -fwrapv -fPIC -fPIE -gdwarf-4 -Wall2025031020250307
5212084237 0 014348 744 800opt8_lowsizegcc -march=native -mtune=native -O -fwrapv -fPIC -fPIE -gdwarf-4 -Wall2025031020250307
5648443789 0 012704 728 768opt8gcc -march=native -mtune=native -Os -fwrapv -fPIC -fPIE -gdwarf-4 -Wall2025031020250307
5686643818 0 012728 728 768opt8_lowsizegcc -march=native -mtune=native -Os -fwrapv -fPIC -fPIE -gdwarf-4 -Wall2025031020250307

Compiler output


ascon.S: ascon.S:1:10: fatal error: 'xtensa/coreasm.h' file not found
ascon.S:     1 | #include <xtensa/coreasm.h>
ascon.S:       |          ^~~~~~~~~~~~~~~~~~
ascon.S: 1 error generated.

Number of similar (implementation,compiler) pairs: 5, namely:
ImplementationCompiler
T:asm_esp32clang -march=native -O2 -fwrapv -Qunused-arguments -fPIC -fPIE -gdwarf-4 -Wall (Debian_Clang_19.1.7_(1+b1))
T:asm_esp32clang -march=native -O3 -fwrapv -Qunused-arguments -fPIC -fPIE -gdwarf-4 -Wall (Debian_Clang_19.1.7_(1+b1))
T:asm_esp32clang -march=native -O -fwrapv -Qunused-arguments -fPIC -fPIE -gdwarf-4 -Wall (Debian_Clang_19.1.7_(1+b1))
T:asm_esp32clang -march=native -Os -fwrapv -Qunused-arguments -fPIC -fPIE -gdwarf-4 -Wall (Debian_Clang_19.1.7_(1+b1))
T:asm_esp32clang -mcpu=native -O3 -fwrapv -Qunused-arguments -fPIC -fPIE -gdwarf-4 -Wall (Debian_Clang_19.1.7_(1+b1))

Compiler output


ascon.S: ascon.S:1:10: fatal error: xtensa/coreasm.h: No such file or directory
ascon.S:     1 | #include <xtensa/coreasm.h>
ascon.S:       |          ^~~~~~~~~~~~~~~~~~
ascon.S: compilation terminated.

Number of similar (implementation,compiler) pairs: 4, namely:
ImplementationCompiler
T:asm_esp32gcc -march=native -mtune=native -O2 -fwrapv -fPIC -fPIE -gdwarf-4 -Wall (14.2.0)
T:asm_esp32gcc -march=native -mtune=native -O3 -fwrapv -fPIC -fPIE -gdwarf-4 -Wall (14.2.0)
T:asm_esp32gcc -march=native -mtune=native -O -fwrapv -fPIC -fPIE -gdwarf-4 -Wall (14.2.0)
T:asm_esp32gcc -march=native -mtune=native -Os -fwrapv -fPIC -fPIE -gdwarf-4 -Wall (14.2.0)

Compiler output


permutations.S: permutations.S:29:10: fatal error: 'avr/io.h' file not found
permutations.S:    29 | #include "avr/io.h"
permutations.S:       |          ^~~~~~~~~~
permutations.S: 1 error generated.

Number of similar (implementation,compiler) pairs: 10, namely:
ImplementationCompiler
avrclang -march=native -O2 -fwrapv -Qunused-arguments -fPIC -fPIE -gdwarf-4 -Wall (Debian_Clang_19.1.7_(1+b1))
avrclang -march=native -O3 -fwrapv -Qunused-arguments -fPIC -fPIE -gdwarf-4 -Wall (Debian_Clang_19.1.7_(1+b1))
avrclang -march=native -O -fwrapv -Qunused-arguments -fPIC -fPIE -gdwarf-4 -Wall (Debian_Clang_19.1.7_(1+b1))
avrclang -march=native -Os -fwrapv -Qunused-arguments -fPIC -fPIE -gdwarf-4 -Wall (Debian_Clang_19.1.7_(1+b1))
avrclang -mcpu=native -O3 -fwrapv -Qunused-arguments -fPIC -fPIE -gdwarf-4 -Wall (Debian_Clang_19.1.7_(1+b1))
avr_lowsizeclang -march=native -O2 -fwrapv -Qunused-arguments -fPIC -fPIE -gdwarf-4 -Wall (Debian_Clang_19.1.7_(1+b1))
avr_lowsizeclang -march=native -O3 -fwrapv -Qunused-arguments -fPIC -fPIE -gdwarf-4 -Wall (Debian_Clang_19.1.7_(1+b1))
avr_lowsizeclang -march=native -O -fwrapv -Qunused-arguments -fPIC -fPIE -gdwarf-4 -Wall (Debian_Clang_19.1.7_(1+b1))
avr_lowsizeclang -march=native -Os -fwrapv -Qunused-arguments -fPIC -fPIE -gdwarf-4 -Wall (Debian_Clang_19.1.7_(1+b1))
avr_lowsizeclang -mcpu=native -O3 -fwrapv -Qunused-arguments -fPIC -fPIE -gdwarf-4 -Wall (Debian_Clang_19.1.7_(1+b1))

Compiler output


hash.c: In file included from round.h:8,
hash.c:                  from permutations.h:11,
hash.c:                  from hash.c:4:
hash.c: word.h:61:11: warning: 'crypto_int64_bitmod_01' is static but used in inline function 'NOTZERO' which is not static
hash.c:    61 |   return (crypto_int64_bitmod_01(((int)(result & 0xff) - 1),8)) - 1;
hash.c:       |           ^~~~~~~~~~~~~~~~~~~~~~
permutations.S: permutations.S:29:10: fatal error: avr/io.h: No such file or directory
permutations.S:    29 | #include "avr/io.h"
permutations.S:       |          ^~~~~~~~~~
permutations.S: compilation terminated.

Number of similar (implementation,compiler) pairs: 4, namely:
ImplementationCompiler
avrgcc -march=native -mtune=native -O2 -fwrapv -fPIC -fPIE -gdwarf-4 -Wall (14.2.0)
avrgcc -march=native -mtune=native -O3 -fwrapv -fPIC -fPIE -gdwarf-4 -Wall (14.2.0)
avrgcc -march=native -mtune=native -O -fwrapv -fPIC -fPIE -gdwarf-4 -Wall (14.2.0)
avrgcc -march=native -mtune=native -Os -fwrapv -fPIC -fPIE -gdwarf-4 -Wall (14.2.0)

Compiler output


hash.c: In file included from round.h:8,
hash.c:                  from permutations.h:11,
hash.c:                  from hash.c:4:
hash.c: word.h:61:11: warning: 'crypto_int64_bitmod_01' is static but used in inline function 'NOTZERO' which is not static
hash.c:    61 |   return (crypto_int64_bitmod_01(((int)(result & 0xff) - 1),8)) - 1;
hash.c:       |           ^~~~~~~~~~~~~~~~~~~~~~
update.c: In file included from round.h:8,
update.c:                  from permutations.h:11,
update.c:                  from update.c:3:
update.c: word.h:61:11: warning: 'crypto_int64_bitmod_01' is static but used in inline function 'NOTZERO' which is not static
update.c:    61 |   return (crypto_int64_bitmod_01(((int)(result & 0xff) - 1),8)) - 1;
update.c:       |           ^~~~~~~~~~~~~~~~~~~~~~
permutations.S: permutations.S:29:10: fatal error: avr/io.h: No such file or directory
permutations.S:    29 | #include "avr/io.h"
permutations.S:       |          ^~~~~~~~~~
permutations.S: compilation terminated.

Number of similar (implementation,compiler) pairs: 4, namely:
ImplementationCompiler
avr_lowsizegcc -march=native -mtune=native -O2 -fwrapv -fPIC -fPIE -gdwarf-4 -Wall (14.2.0)
avr_lowsizegcc -march=native -mtune=native -O3 -fwrapv -fPIC -fPIE -gdwarf-4 -Wall (14.2.0)
avr_lowsizegcc -march=native -mtune=native -O -fwrapv -fPIC -fPIE -gdwarf-4 -Wall (14.2.0)
avr_lowsizegcc -march=native -mtune=native -Os -fwrapv -fPIC -fPIE -gdwarf-4 -Wall (14.2.0)

Compiler output


hash.c: In file included from round.h:8,
hash.c:                  from permutations.h:11,
hash.c:                  from hash.c:4:
hash.c: word.h:55:11: warning: 'crypto_int64_bitmod_01' is static but used in inline function 'NOTZERO' which is not static
hash.c:    55 |   return (crypto_int64_bitmod_01(((int)(result & 0xff) - 1),8)) - 1;
hash.c:       |           ^~~~~~~~~~~~~~~~~~~~~~
permutations.c: In file included from round.h:8,
permutations.c:                  from permutations.h:11,
permutations.c:                  from permutations.c:1:
permutations.c: word.h:55:11: warning: 'crypto_int64_bitmod_01' is static but used in inline function 'NOTZERO' which is not static
permutations.c:    55 |   return (crypto_int64_bitmod_01(((int)(result & 0xff) - 1),8)) - 1;
permutations.c:       |           ^~~~~~~~~~~~~~~~~~~~~~

Number of similar (implementation,compiler) pairs: 16, namely:
ImplementationCompiler
bi32gcc -march=native -mtune=native -O2 -fwrapv -fPIC -fPIE -gdwarf-4 -Wall (14.2.0)
bi32gcc -march=native -mtune=native -O3 -fwrapv -fPIC -fPIE -gdwarf-4 -Wall (14.2.0)
bi32gcc -march=native -mtune=native -O -fwrapv -fPIC -fPIE -gdwarf-4 -Wall (14.2.0)
bi32gcc -march=native -mtune=native -Os -fwrapv -fPIC -fPIE -gdwarf-4 -Wall (14.2.0)
bi32_lowreggcc -march=native -mtune=native -O2 -fwrapv -fPIC -fPIE -gdwarf-4 -Wall (14.2.0)
bi32_lowreggcc -march=native -mtune=native -O3 -fwrapv -fPIC -fPIE -gdwarf-4 -Wall (14.2.0)
bi32_lowreggcc -march=native -mtune=native -O -fwrapv -fPIC -fPIE -gdwarf-4 -Wall (14.2.0)
bi32_lowreggcc -march=native -mtune=native -Os -fwrapv -fPIC -fPIE -gdwarf-4 -Wall (14.2.0)
bi32_lowsizegcc -march=native -mtune=native -O2 -fwrapv -fPIC -fPIE -gdwarf-4 -Wall (14.2.0)
bi32_lowsizegcc -march=native -mtune=native -O3 -fwrapv -fPIC -fPIE -gdwarf-4 -Wall (14.2.0)
bi32_lowsizegcc -march=native -mtune=native -O -fwrapv -fPIC -fPIE -gdwarf-4 -Wall (14.2.0)
bi32_lowsizegcc -march=native -mtune=native -Os -fwrapv -fPIC -fPIE -gdwarf-4 -Wall (14.2.0)
bi8gcc -march=native -mtune=native -O2 -fwrapv -fPIC -fPIE -gdwarf-4 -Wall (14.2.0)
bi8gcc -march=native -mtune=native -O3 -fwrapv -fPIC -fPIE -gdwarf-4 -Wall (14.2.0)
bi8gcc -march=native -mtune=native -O -fwrapv -fPIC -fPIE -gdwarf-4 -Wall (14.2.0)
bi8gcc -march=native -mtune=native -Os -fwrapv -fPIC -fPIE -gdwarf-4 -Wall (14.2.0)

Compiler output


try.c: /usr/bin/ld: /tmp/try-small-ceb42b.o: in function `doit':
try.c: .../supercop-data/speed2supercop/amd64/try/c/clang_-march=native_-O2_-fwrapv_-Qunused-arguments_-fPIC_-fPIE_-gdwarf-4_-Wall/timingleaks/crypto_hash/asconhashav12/esp32/work/./try.c:76:(.text+0x...): undefined reference to `crypto_hash_asconhashav12_esp32_timingleaks'
try.c: /usr/bin/ld: /tmp/try-small-ceb42b.o: in function `test':
try.c: .../supercop-data/speed2supercop/amd64/try/c/clang_-march=native_-O2_-fwrapv_-Qunused-arguments_-fPIC_-fPIE_-gdwarf-4_-Wall/timingleaks/crypto_hash/asconhashav12/esp32/work/./try.c:90:(.text+0x...): undefined reference to `crypto_hash_asconhashav12_esp32_timingleaks'
try.c: /usr/bin/ld: .../supercop-data/speed2supercop/amd64/try/c/clang_-march=native_-O2_-fwrapv_-Qunused-arguments_-fPIC_-fPIE_-gdwarf-4_-Wall/timingleaks/crypto_hash/asconhashav12/esp32/work/./try.c:102:(.text+0x...): undefined reference to `crypto_hash_asconhashav12_esp32_timingleaks'
try.c: /usr/bin/ld: .../supercop-data/speed2supercop/amd64/try/c/clang_-march=native_-O2_-fwrapv_-Qunused-arguments_-fPIC_-fPIE_-gdwarf-4_-Wall/timingleaks/crypto_hash/asconhashav12/esp32/work/./try.c:112:(.text+0x...): undefined reference to `crypto_hash_asconhashav12_esp32_timingleaks'
try.c: clang: error: linker command failed with exit code 1 (use -v to see invocation)

Number of similar (implementation,compiler) pairs: 1, namely:
ImplementationCompiler
T:esp32clang -march=native -O2 -fwrapv -Qunused-arguments -fPIC -fPIE -gdwarf-4 -Wall (Debian_Clang_19.1.7_(1+b1))

Compiler output


try.c: /usr/bin/ld: /tmp/try-small-98b62d.o: in function `doit':
try.c: .../supercop-data/speed2supercop/amd64/try/c/clang_-march=native_-O3_-fwrapv_-Qunused-arguments_-fPIC_-fPIE_-gdwarf-4_-Wall/timingleaks/crypto_hash/asconhashav12/esp32/work/./try.c:76:(.text+0x...): undefined reference to `crypto_hash_asconhashav12_esp32_timingleaks'
try.c: /usr/bin/ld: /tmp/try-small-98b62d.o: in function `test':
try.c: .../supercop-data/speed2supercop/amd64/try/c/clang_-march=native_-O3_-fwrapv_-Qunused-arguments_-fPIC_-fPIE_-gdwarf-4_-Wall/timingleaks/crypto_hash/asconhashav12/esp32/work/./try.c:90:(.text+0x...): undefined reference to `crypto_hash_asconhashav12_esp32_timingleaks'
try.c: /usr/bin/ld: .../supercop-data/speed2supercop/amd64/try/c/clang_-march=native_-O3_-fwrapv_-Qunused-arguments_-fPIC_-fPIE_-gdwarf-4_-Wall/timingleaks/crypto_hash/asconhashav12/esp32/work/./try.c:102:(.text+0x...): undefined reference to `crypto_hash_asconhashav12_esp32_timingleaks'
try.c: /usr/bin/ld: .../supercop-data/speed2supercop/amd64/try/c/clang_-march=native_-O3_-fwrapv_-Qunused-arguments_-fPIC_-fPIE_-gdwarf-4_-Wall/timingleaks/crypto_hash/asconhashav12/esp32/work/./try.c:112:(.text+0x...): undefined reference to `crypto_hash_asconhashav12_esp32_timingleaks'
try.c: clang: error: linker command failed with exit code 1 (use -v to see invocation)

Number of similar (implementation,compiler) pairs: 1, namely:
ImplementationCompiler
T:esp32clang -march=native -O3 -fwrapv -Qunused-arguments -fPIC -fPIE -gdwarf-4 -Wall (Debian_Clang_19.1.7_(1+b1))

Compiler output


try.c: /usr/bin/ld: /tmp/try-small-e25a61.o: in function `doit':
try.c: .../supercop-data/speed2supercop/amd64/try/c/clang_-march=native_-O_-fwrapv_-Qunused-arguments_-fPIC_-fPIE_-gdwarf-4_-Wall/timingleaks/crypto_hash/asconhashav12/esp32/work/./try.c:76:(.text+0x...): undefined reference to `crypto_hash_asconhashav12_esp32_timingleaks'
try.c: /usr/bin/ld: /tmp/try-small-e25a61.o: in function `test':
try.c: .../supercop-data/speed2supercop/amd64/try/c/clang_-march=native_-O_-fwrapv_-Qunused-arguments_-fPIC_-fPIE_-gdwarf-4_-Wall/timingleaks/crypto_hash/asconhashav12/esp32/work/./try.c:90:(.text+0x...): undefined reference to `crypto_hash_asconhashav12_esp32_timingleaks'
try.c: /usr/bin/ld: .../supercop-data/speed2supercop/amd64/try/c/clang_-march=native_-O_-fwrapv_-Qunused-arguments_-fPIC_-fPIE_-gdwarf-4_-Wall/timingleaks/crypto_hash/asconhashav12/esp32/work/./try.c:102:(.text+0x...): undefined reference to `crypto_hash_asconhashav12_esp32_timingleaks'
try.c: /usr/bin/ld: .../supercop-data/speed2supercop/amd64/try/c/clang_-march=native_-O_-fwrapv_-Qunused-arguments_-fPIC_-fPIE_-gdwarf-4_-Wall/timingleaks/crypto_hash/asconhashav12/esp32/work/./try.c:112:(.text+0x...): undefined reference to `crypto_hash_asconhashav12_esp32_timingleaks'
try.c: clang: error: linker command failed with exit code 1 (use -v to see invocation)

Number of similar (implementation,compiler) pairs: 1, namely:
ImplementationCompiler
T:esp32clang -march=native -O -fwrapv -Qunused-arguments -fPIC -fPIE -gdwarf-4 -Wall (Debian_Clang_19.1.7_(1+b1))

Compiler output


try.c: /usr/bin/ld: /tmp/try-small-f6d56a.o: in function `doit':
try.c: .../supercop-data/speed2supercop/amd64/try/c/clang_-march=native_-Os_-fwrapv_-Qunused-arguments_-fPIC_-fPIE_-gdwarf-4_-Wall/timingleaks/crypto_hash/asconhashav12/esp32/work/./try.c:76:(.text+0x...): undefined reference to `crypto_hash_asconhashav12_esp32_timingleaks'
try.c: /usr/bin/ld: /tmp/try-small-f6d56a.o: in function `test':
try.c: .../supercop-data/speed2supercop/amd64/try/c/clang_-march=native_-Os_-fwrapv_-Qunused-arguments_-fPIC_-fPIE_-gdwarf-4_-Wall/timingleaks/crypto_hash/asconhashav12/esp32/work/./try.c:90:(.text+0x...): undefined reference to `crypto_hash_asconhashav12_esp32_timingleaks'
try.c: /usr/bin/ld: .../supercop-data/speed2supercop/amd64/try/c/clang_-march=native_-Os_-fwrapv_-Qunused-arguments_-fPIC_-fPIE_-gdwarf-4_-Wall/timingleaks/crypto_hash/asconhashav12/esp32/work/./try.c:102:(.text+0x...): undefined reference to `crypto_hash_asconhashav12_esp32_timingleaks'
try.c: /usr/bin/ld: .../supercop-data/speed2supercop/amd64/try/c/clang_-march=native_-Os_-fwrapv_-Qunused-arguments_-fPIC_-fPIE_-gdwarf-4_-Wall/timingleaks/crypto_hash/asconhashav12/esp32/work/./try.c:112:(.text+0x...): undefined reference to `crypto_hash_asconhashav12_esp32_timingleaks'
try.c: clang: error: linker command failed with exit code 1 (use -v to see invocation)

Number of similar (implementation,compiler) pairs: 1, namely:
ImplementationCompiler
T:esp32clang -march=native -Os -fwrapv -Qunused-arguments -fPIC -fPIE -gdwarf-4 -Wall (Debian_Clang_19.1.7_(1+b1))

Compiler output


try.c: /usr/bin/ld: /tmp/try-small-c6d042.o: in function `doit':
try.c: .../supercop-data/speed2supercop/amd64/try/c/clang_-mcpu=native_-O3_-fwrapv_-Qunused-arguments_-fPIC_-fPIE_-gdwarf-4_-Wall/timingleaks/crypto_hash/asconhashav12/esp32/work/./try.c:76:(.text+0x...): undefined reference to `crypto_hash_asconhashav12_esp32_timingleaks'
try.c: /usr/bin/ld: /tmp/try-small-c6d042.o: in function `test':
try.c: .../supercop-data/speed2supercop/amd64/try/c/clang_-mcpu=native_-O3_-fwrapv_-Qunused-arguments_-fPIC_-fPIE_-gdwarf-4_-Wall/timingleaks/crypto_hash/asconhashav12/esp32/work/./try.c:90:(.text+0x...): undefined reference to `crypto_hash_asconhashav12_esp32_timingleaks'
try.c: /usr/bin/ld: .../supercop-data/speed2supercop/amd64/try/c/clang_-mcpu=native_-O3_-fwrapv_-Qunused-arguments_-fPIC_-fPIE_-gdwarf-4_-Wall/timingleaks/crypto_hash/asconhashav12/esp32/work/./try.c:102:(.text+0x...): undefined reference to `crypto_hash_asconhashav12_esp32_timingleaks'
try.c: /usr/bin/ld: .../supercop-data/speed2supercop/amd64/try/c/clang_-mcpu=native_-O3_-fwrapv_-Qunused-arguments_-fPIC_-fPIE_-gdwarf-4_-Wall/timingleaks/crypto_hash/asconhashav12/esp32/work/./try.c:112:(.text+0x...): undefined reference to `crypto_hash_asconhashav12_esp32_timingleaks'
try.c: clang: error: linker command failed with exit code 1 (use -v to see invocation)

Number of similar (implementation,compiler) pairs: 1, namely:
ImplementationCompiler
T:esp32clang -mcpu=native -O3 -fwrapv -Qunused-arguments -fPIC -fPIE -gdwarf-4 -Wall (Debian_Clang_19.1.7_(1+b1))

Compiler output


try.c: /usr/bin/ld: /tmp/cctAAbel.o: in function `test':
try.c: .../supercop-data/speed2supercop/amd64/try/c/gcc_-march=native_-mtune=native_-O2_-fwrapv_-fPIC_-fPIE_-gdwarf-4_-Wall/timingleaks/crypto_hash/asconhashav12/esp32/work/try.c:112:(.text+0x...): undefined reference to `crypto_hash_asconhashav12_esp32_timingleaks'
try.c: /usr/bin/ld: .../supercop-data/speed2supercop/amd64/try/c/gcc_-march=native_-mtune=native_-O2_-fwrapv_-fPIC_-fPIE_-gdwarf-4_-Wall/timingleaks/crypto_hash/asconhashav12/esp32/work/try.c:90:(.text+0x...): undefined reference to `crypto_hash_asconhashav12_esp32_timingleaks'
try.c: /usr/bin/ld: .../supercop-data/speed2supercop/amd64/try/c/gcc_-march=native_-mtune=native_-O2_-fwrapv_-fPIC_-fPIE_-gdwarf-4_-Wall/timingleaks/crypto_hash/asconhashav12/esp32/work/try.c:102:(.text+0x...): undefined reference to `crypto_hash_asconhashav12_esp32_timingleaks'
try.c: /usr/bin/ld: /tmp/cctAAbel.o: in function `doit':
try.c: .../supercop-data/speed2supercop/amd64/try/c/gcc_-march=native_-mtune=native_-O2_-fwrapv_-fPIC_-fPIE_-gdwarf-4_-Wall/timingleaks/crypto_hash/asconhashav12/esp32/work/try.c:76:(.text+0x...): undefined reference to `crypto_hash_asconhashav12_esp32_timingleaks'
try.c: collect2: error: ld returned 1 exit status

Number of similar (implementation,compiler) pairs: 1, namely:
ImplementationCompiler
T:esp32gcc -march=native -mtune=native -O2 -fwrapv -fPIC -fPIE -gdwarf-4 -Wall (14.2.0)

Compiler output


try.c: /usr/bin/ld: /tmp/ccOYZUwt.o: in function `test':
try.c: .../supercop-data/speed2supercop/amd64/try/c/gcc_-march=native_-mtune=native_-O3_-fwrapv_-fPIC_-fPIE_-gdwarf-4_-Wall/timingleaks/crypto_hash/asconhashav12/esp32/work/try.c:90:(.text+0x...): undefined reference to `crypto_hash_asconhashav12_esp32_timingleaks'
try.c: /usr/bin/ld: .../supercop-data/speed2supercop/amd64/try/c/gcc_-march=native_-mtune=native_-O3_-fwrapv_-fPIC_-fPIE_-gdwarf-4_-Wall/timingleaks/crypto_hash/asconhashav12/esp32/work/try.c:102:(.text+0x...): undefined reference to `crypto_hash_asconhashav12_esp32_timingleaks'
try.c: /usr/bin/ld: .../supercop-data/speed2supercop/amd64/try/c/gcc_-march=native_-mtune=native_-O3_-fwrapv_-fPIC_-fPIE_-gdwarf-4_-Wall/timingleaks/crypto_hash/asconhashav12/esp32/work/try.c:112:(.text+0x...): undefined reference to `crypto_hash_asconhashav12_esp32_timingleaks'
try.c: /usr/bin/ld: /tmp/ccOYZUwt.o: in function `doit':
try.c: .../supercop-data/speed2supercop/amd64/try/c/gcc_-march=native_-mtune=native_-O3_-fwrapv_-fPIC_-fPIE_-gdwarf-4_-Wall/timingleaks/crypto_hash/asconhashav12/esp32/work/try.c:76:(.text+0x...): undefined reference to `crypto_hash_asconhashav12_esp32_timingleaks'
try.c: collect2: error: ld returned 1 exit status

Number of similar (implementation,compiler) pairs: 1, namely:
ImplementationCompiler
T:esp32gcc -march=native -mtune=native -O3 -fwrapv -fPIC -fPIE -gdwarf-4 -Wall (14.2.0)

Compiler output


try.c: /usr/bin/ld: /tmp/cciILQ6M.o: in function `doit':
try.c: .../supercop-data/speed2supercop/amd64/try/c/gcc_-march=native_-mtune=native_-O_-fwrapv_-fPIC_-fPIE_-gdwarf-4_-Wall/timingleaks/crypto_hash/asconhashav12/esp32/work/try.c:76:(.text+0x...): undefined reference to `crypto_hash_asconhashav12_esp32_timingleaks'
try.c: /usr/bin/ld: /tmp/cciILQ6M.o: in function `test':
try.c: .../supercop-data/speed2supercop/amd64/try/c/gcc_-march=native_-mtune=native_-O_-fwrapv_-fPIC_-fPIE_-gdwarf-4_-Wall/timingleaks/crypto_hash/asconhashav12/esp32/work/try.c:90:(.text+0x...): undefined reference to `crypto_hash_asconhashav12_esp32_timingleaks'
try.c: /usr/bin/ld: .../supercop-data/speed2supercop/amd64/try/c/gcc_-march=native_-mtune=native_-O_-fwrapv_-fPIC_-fPIE_-gdwarf-4_-Wall/timingleaks/crypto_hash/asconhashav12/esp32/work/try.c:102:(.text+0x...): undefined reference to `crypto_hash_asconhashav12_esp32_timingleaks'
try.c: /usr/bin/ld: .../supercop-data/speed2supercop/amd64/try/c/gcc_-march=native_-mtune=native_-O_-fwrapv_-fPIC_-fPIE_-gdwarf-4_-Wall/timingleaks/crypto_hash/asconhashav12/esp32/work/try.c:112:(.text+0x...): undefined reference to `crypto_hash_asconhashav12_esp32_timingleaks'
try.c: collect2: error: ld returned 1 exit status

Number of similar (implementation,compiler) pairs: 1, namely:
ImplementationCompiler
T:esp32gcc -march=native -mtune=native -O -fwrapv -fPIC -fPIE -gdwarf-4 -Wall (14.2.0)

Compiler output


try.c: /usr/bin/ld: /tmp/cct0D3az.o: in function `test':
try.c: .../supercop-data/speed2supercop/amd64/try/c/gcc_-march=native_-mtune=native_-Os_-fwrapv_-fPIC_-fPIE_-gdwarf-4_-Wall/timingleaks/crypto_hash/asconhashav12/esp32/work/try.c:90:(.text+0x...): undefined reference to `crypto_hash_asconhashav12_esp32_timingleaks'
try.c: /usr/bin/ld: .../supercop-data/speed2supercop/amd64/try/c/gcc_-march=native_-mtune=native_-Os_-fwrapv_-fPIC_-fPIE_-gdwarf-4_-Wall/timingleaks/crypto_hash/asconhashav12/esp32/work/try.c:102:(.text+0x...): undefined reference to `crypto_hash_asconhashav12_esp32_timingleaks'
try.c: /usr/bin/ld: .../supercop-data/speed2supercop/amd64/try/c/gcc_-march=native_-mtune=native_-Os_-fwrapv_-fPIC_-fPIE_-gdwarf-4_-Wall/timingleaks/crypto_hash/asconhashav12/esp32/work/try.c:112:(.text+0x...): undefined reference to `crypto_hash_asconhashav12_esp32_timingleaks'
try.c: /usr/bin/ld: /tmp/cct0D3az.o: in function `doit':
try.c: .../supercop-data/speed2supercop/amd64/try/c/gcc_-march=native_-mtune=native_-Os_-fwrapv_-fPIC_-fPIE_-gdwarf-4_-Wall/timingleaks/crypto_hash/asconhashav12/esp32/work/try.c:76:(.text+0x...): undefined reference to `crypto_hash_asconhashav12_esp32_timingleaks'
try.c: collect2: error: ld returned 1 exit status

Number of similar (implementation,compiler) pairs: 1, namely:
ImplementationCompiler
T:esp32gcc -march=native -mtune=native -Os -fwrapv -fPIC -fPIE -gdwarf-4 -Wall (14.2.0)

Compiler output


hash.c: In file included from round.h:8,
hash.c:                  from permutations.h:11,
hash.c:                  from hash.c:4:
hash.c: word.h:32:11: warning: 'crypto_int64_bitmod_01' is static but used in inline function 'NOTZERO' which is not static
hash.c:    32 |   return (crypto_int64_bitmod_01(((int)(result & 0xff) - 1),8)) - 1;
hash.c:       |           ^~~~~~~~~~~~~~~~~~~~~~
permutations.c: In file included from round.h:8,
permutations.c:                  from permutations.h:11,
permutations.c:                  from permutations.c:1:
permutations.c: word.h:32:11: warning: 'crypto_int64_bitmod_01' is static but used in inline function 'NOTZERO' which is not static
permutations.c:    32 |   return (crypto_int64_bitmod_01(((int)(result & 0xff) - 1),8)) - 1;
permutations.c:       |           ^~~~~~~~~~~~~~~~~~~~~~

Number of similar (implementation,compiler) pairs: 16, namely:
ImplementationCompiler
opt32gcc -march=native -mtune=native -O2 -fwrapv -fPIC -fPIE -gdwarf-4 -Wall (14.2.0)
opt32gcc -march=native -mtune=native -O3 -fwrapv -fPIC -fPIE -gdwarf-4 -Wall (14.2.0)
opt32gcc -march=native -mtune=native -O -fwrapv -fPIC -fPIE -gdwarf-4 -Wall (14.2.0)
opt32gcc -march=native -mtune=native -Os -fwrapv -fPIC -fPIE -gdwarf-4 -Wall (14.2.0)
opt32_lowsizegcc -march=native -mtune=native -O2 -fwrapv -fPIC -fPIE -gdwarf-4 -Wall (14.2.0)
opt32_lowsizegcc -march=native -mtune=native -O3 -fwrapv -fPIC -fPIE -gdwarf-4 -Wall (14.2.0)
opt32_lowsizegcc -march=native -mtune=native -O -fwrapv -fPIC -fPIE -gdwarf-4 -Wall (14.2.0)
opt32_lowsizegcc -march=native -mtune=native -Os -fwrapv -fPIC -fPIE -gdwarf-4 -Wall (14.2.0)
opt64gcc -march=native -mtune=native -O2 -fwrapv -fPIC -fPIE -gdwarf-4 -Wall (14.2.0)
opt64gcc -march=native -mtune=native -O3 -fwrapv -fPIC -fPIE -gdwarf-4 -Wall (14.2.0)
opt64gcc -march=native -mtune=native -O -fwrapv -fPIC -fPIE -gdwarf-4 -Wall (14.2.0)
opt64gcc -march=native -mtune=native -Os -fwrapv -fPIC -fPIE -gdwarf-4 -Wall (14.2.0)
opt64_lowsizegcc -march=native -mtune=native -O2 -fwrapv -fPIC -fPIE -gdwarf-4 -Wall (14.2.0)
opt64_lowsizegcc -march=native -mtune=native -O3 -fwrapv -fPIC -fPIE -gdwarf-4 -Wall (14.2.0)
opt64_lowsizegcc -march=native -mtune=native -O -fwrapv -fPIC -fPIE -gdwarf-4 -Wall (14.2.0)
opt64_lowsizegcc -march=native -mtune=native -Os -fwrapv -fPIC -fPIE -gdwarf-4 -Wall (14.2.0)

Compiler output


hash.c: In file included from round.h:8,
hash.c:                  from permutations.h:11,
hash.c:                  from hash.c:4:
hash.c: word.h:61:11: warning: 'crypto_int64_bitmod_01' is static but used in inline function 'NOTZERO' which is not static
hash.c:    61 |   return (crypto_int64_bitmod_01(((int)(result & 0xff) - 1),8)) - 1;
hash.c:       |           ^~~~~~~~~~~~~~~~~~~~~~
permutations.c: In file included from round.h:8,
permutations.c:                  from permutations.h:11,
permutations.c:                  from permutations.c:1:
permutations.c: word.h:61:11: warning: 'crypto_int64_bitmod_01' is static but used in inline function 'NOTZERO' which is not static
permutations.c:    61 |   return (crypto_int64_bitmod_01(((int)(result & 0xff) - 1),8)) - 1;
permutations.c:       |           ^~~~~~~~~~~~~~~~~~~~~~

Number of similar (implementation,compiler) pairs: 4, namely:
ImplementationCompiler
opt8gcc -march=native -mtune=native -O2 -fwrapv -fPIC -fPIE -gdwarf-4 -Wall (14.2.0)
opt8gcc -march=native -mtune=native -O3 -fwrapv -fPIC -fPIE -gdwarf-4 -Wall (14.2.0)
opt8gcc -march=native -mtune=native -O -fwrapv -fPIC -fPIE -gdwarf-4 -Wall (14.2.0)
opt8gcc -march=native -mtune=native -Os -fwrapv -fPIC -fPIE -gdwarf-4 -Wall (14.2.0)

Compiler output


hash.c: In file included from round.h:8,
hash.c:                  from permutations.h:11,
hash.c:                  from hash.c:4:
hash.c: word.h:61:11: warning: 'crypto_int64_bitmod_01' is static but used in inline function 'NOTZERO' which is not static
hash.c:    61 |   return (crypto_int64_bitmod_01(((int)(result & 0xff) - 1),8)) - 1;
hash.c:       |           ^~~~~~~~~~~~~~~~~~~~~~
permutations.c: In file included from round.h:8,
permutations.c:                  from permutations.h:11,
permutations.c:                  from permutations.c:1:
permutations.c: word.h:61:11: warning: 'crypto_int64_bitmod_01' is static but used in inline function 'NOTZERO' which is not static
permutations.c:    61 |   return (crypto_int64_bitmod_01(((int)(result & 0xff) - 1),8)) - 1;
permutations.c:       |           ^~~~~~~~~~~~~~~~~~~~~~
update.c: In file included from round.h:8,
update.c:                  from permutations.h:11,
update.c:                  from update.c:3:
update.c: word.h:61:11: warning: 'crypto_int64_bitmod_01' is static but used in inline function 'NOTZERO' which is not static
update.c:    61 |   return (crypto_int64_bitmod_01(((int)(result & 0xff) - 1),8)) - 1;
update.c:       |           ^~~~~~~~~~~~~~~~~~~~~~

Number of similar (implementation,compiler) pairs: 4, namely:
ImplementationCompiler
opt8_lowsizegcc -march=native -mtune=native -O2 -fwrapv -fPIC -fPIE -gdwarf-4 -Wall (14.2.0)
opt8_lowsizegcc -march=native -mtune=native -O3 -fwrapv -fPIC -fPIE -gdwarf-4 -Wall (14.2.0)
opt8_lowsizegcc -march=native -mtune=native -O -fwrapv -fPIC -fPIE -gdwarf-4 -Wall (14.2.0)
opt8_lowsizegcc -march=native -mtune=native -Os -fwrapv -fPIC -fPIE -gdwarf-4 -Wall (14.2.0)

Namespace violations


constants.o constants R
interleave.o B R
permutations.o P12 T
permutations.o P8 T

Number of similar (implementation,compiler) pairs: 9, namely:
ImplementationCompiler
bi32clang -march=native -O2 -fwrapv -Qunused-arguments -fPIC -fPIE -gdwarf-4 -Wall (Debian_Clang_19.1.7_(1+b1))
bi32clang -march=native -O3 -fwrapv -Qunused-arguments -fPIC -fPIE -gdwarf-4 -Wall (Debian_Clang_19.1.7_(1+b1))
bi32clang -march=native -O -fwrapv -Qunused-arguments -fPIC -fPIE -gdwarf-4 -Wall (Debian_Clang_19.1.7_(1+b1))
bi32clang -march=native -Os -fwrapv -Qunused-arguments -fPIC -fPIE -gdwarf-4 -Wall (Debian_Clang_19.1.7_(1+b1))
bi32clang -mcpu=native -O3 -fwrapv -Qunused-arguments -fPIC -fPIE -gdwarf-4 -Wall (Debian_Clang_19.1.7_(1+b1))
bi32gcc -march=native -mtune=native -O2 -fwrapv -fPIC -fPIE -gdwarf-4 -Wall (14.2.0)
bi32gcc -march=native -mtune=native -O3 -fwrapv -fPIC -fPIE -gdwarf-4 -Wall (14.2.0)
bi32gcc -march=native -mtune=native -O -fwrapv -fPIC -fPIE -gdwarf-4 -Wall (14.2.0)
bi32gcc -march=native -mtune=native -Os -fwrapv -fPIC -fPIE -gdwarf-4 -Wall (14.2.0)

Namespace violations


constants.o constants R
hash.o ascon_absorb T
hash.o ascon_inithash T
hash.o ascon_squeeze T
interleave.o B R

Number of similar (implementation,compiler) pairs: 9, namely:
ImplementationCompiler
bi32_lowregclang -march=native -O2 -fwrapv -Qunused-arguments -fPIC -fPIE -gdwarf-4 -Wall (Debian_Clang_19.1.7_(1+b1))
bi32_lowregclang -march=native -O3 -fwrapv -Qunused-arguments -fPIC -fPIE -gdwarf-4 -Wall (Debian_Clang_19.1.7_(1+b1))
bi32_lowregclang -march=native -O -fwrapv -Qunused-arguments -fPIC -fPIE -gdwarf-4 -Wall (Debian_Clang_19.1.7_(1+b1))
bi32_lowregclang -march=native -Os -fwrapv -Qunused-arguments -fPIC -fPIE -gdwarf-4 -Wall (Debian_Clang_19.1.7_(1+b1))
bi32_lowregclang -mcpu=native -O3 -fwrapv -Qunused-arguments -fPIC -fPIE -gdwarf-4 -Wall (Debian_Clang_19.1.7_(1+b1))
bi32_lowreggcc -march=native -mtune=native -O2 -fwrapv -fPIC -fPIE -gdwarf-4 -Wall (14.2.0)
bi32_lowreggcc -march=native -mtune=native -O3 -fwrapv -fPIC -fPIE -gdwarf-4 -Wall (14.2.0)
bi32_lowreggcc -march=native -mtune=native -O -fwrapv -fPIC -fPIE -gdwarf-4 -Wall (14.2.0)
bi32_lowreggcc -march=native -mtune=native -Os -fwrapv -fPIC -fPIE -gdwarf-4 -Wall (14.2.0)

Namespace violations


constants.o constants R
interleave.o B R
interleave.o FROMBI T
interleave.o TOBI T
permutations.o P T

Number of similar (implementation,compiler) pairs: 9, namely:
ImplementationCompiler
bi32_lowsizeclang -march=native -O2 -fwrapv -Qunused-arguments -fPIC -fPIE -gdwarf-4 -Wall (Debian_Clang_19.1.7_(1+b1))
bi32_lowsizeclang -march=native -O3 -fwrapv -Qunused-arguments -fPIC -fPIE -gdwarf-4 -Wall (Debian_Clang_19.1.7_(1+b1))
bi32_lowsizeclang -march=native -O -fwrapv -Qunused-arguments -fPIC -fPIE -gdwarf-4 -Wall (Debian_Clang_19.1.7_(1+b1))
bi32_lowsizeclang -march=native -Os -fwrapv -Qunused-arguments -fPIC -fPIE -gdwarf-4 -Wall (Debian_Clang_19.1.7_(1+b1))
bi32_lowsizeclang -mcpu=native -O3 -fwrapv -Qunused-arguments -fPIC -fPIE -gdwarf-4 -Wall (Debian_Clang_19.1.7_(1+b1))
bi32_lowsizegcc -march=native -mtune=native -O2 -fwrapv -fPIC -fPIE -gdwarf-4 -Wall (14.2.0)
bi32_lowsizegcc -march=native -mtune=native -O3 -fwrapv -fPIC -fPIE -gdwarf-4 -Wall (14.2.0)
bi32_lowsizegcc -march=native -mtune=native -O -fwrapv -fPIC -fPIE -gdwarf-4 -Wall (14.2.0)
bi32_lowsizegcc -march=native -mtune=native -Os -fwrapv -fPIC -fPIE -gdwarf-4 -Wall (14.2.0)

Namespace violations


constants.o constants R
interleave.o FROMBI T
interleave.o TOBI T
permutations.o P T

Number of similar (implementation,compiler) pairs: 9, namely:
ImplementationCompiler
bi8clang -march=native -O2 -fwrapv -Qunused-arguments -fPIC -fPIE -gdwarf-4 -Wall (Debian_Clang_19.1.7_(1+b1))
bi8clang -march=native -O3 -fwrapv -Qunused-arguments -fPIC -fPIE -gdwarf-4 -Wall (Debian_Clang_19.1.7_(1+b1))
bi8clang -march=native -O -fwrapv -Qunused-arguments -fPIC -fPIE -gdwarf-4 -Wall (Debian_Clang_19.1.7_(1+b1))
bi8clang -march=native -Os -fwrapv -Qunused-arguments -fPIC -fPIE -gdwarf-4 -Wall (Debian_Clang_19.1.7_(1+b1))
bi8clang -mcpu=native -O3 -fwrapv -Qunused-arguments -fPIC -fPIE -gdwarf-4 -Wall (Debian_Clang_19.1.7_(1+b1))
bi8gcc -march=native -mtune=native -O2 -fwrapv -fPIC -fPIE -gdwarf-4 -Wall (14.2.0)
bi8gcc -march=native -mtune=native -O3 -fwrapv -fPIC -fPIE -gdwarf-4 -Wall (14.2.0)
bi8gcc -march=native -mtune=native -O -fwrapv -fPIC -fPIE -gdwarf-4 -Wall (14.2.0)
bi8gcc -march=native -mtune=native -Os -fwrapv -fPIC -fPIE -gdwarf-4 -Wall (14.2.0)

Namespace violations


permutations.o P T

Number of similar (implementation,compiler) pairs: 18, namely:
ImplementationCompiler
opt32_lowsizeclang -march=native -O2 -fwrapv -Qunused-arguments -fPIC -fPIE -gdwarf-4 -Wall (Debian_Clang_19.1.7_(1+b1))
opt32_lowsizeclang -march=native -O3 -fwrapv -Qunused-arguments -fPIC -fPIE -gdwarf-4 -Wall (Debian_Clang_19.1.7_(1+b1))
opt32_lowsizeclang -march=native -O -fwrapv -Qunused-arguments -fPIC -fPIE -gdwarf-4 -Wall (Debian_Clang_19.1.7_(1+b1))
opt32_lowsizeclang -march=native -Os -fwrapv -Qunused-arguments -fPIC -fPIE -gdwarf-4 -Wall (Debian_Clang_19.1.7_(1+b1))
opt32_lowsizeclang -mcpu=native -O3 -fwrapv -Qunused-arguments -fPIC -fPIE -gdwarf-4 -Wall (Debian_Clang_19.1.7_(1+b1))
opt32_lowsizegcc -march=native -mtune=native -O2 -fwrapv -fPIC -fPIE -gdwarf-4 -Wall (14.2.0)
opt32_lowsizegcc -march=native -mtune=native -O3 -fwrapv -fPIC -fPIE -gdwarf-4 -Wall (14.2.0)
opt32_lowsizegcc -march=native -mtune=native -O -fwrapv -fPIC -fPIE -gdwarf-4 -Wall (14.2.0)
opt32_lowsizegcc -march=native -mtune=native -Os -fwrapv -fPIC -fPIE -gdwarf-4 -Wall (14.2.0)
opt64_lowsizeclang -march=native -O2 -fwrapv -Qunused-arguments -fPIC -fPIE -gdwarf-4 -Wall (Debian_Clang_19.1.7_(1+b1))
opt64_lowsizeclang -march=native -O3 -fwrapv -Qunused-arguments -fPIC -fPIE -gdwarf-4 -Wall (Debian_Clang_19.1.7_(1+b1))
opt64_lowsizeclang -march=native -O -fwrapv -Qunused-arguments -fPIC -fPIE -gdwarf-4 -Wall (Debian_Clang_19.1.7_(1+b1))
opt64_lowsizeclang -march=native -Os -fwrapv -Qunused-arguments -fPIC -fPIE -gdwarf-4 -Wall (Debian_Clang_19.1.7_(1+b1))
opt64_lowsizeclang -mcpu=native -O3 -fwrapv -Qunused-arguments -fPIC -fPIE -gdwarf-4 -Wall (Debian_Clang_19.1.7_(1+b1))
opt64_lowsizegcc -march=native -mtune=native -O2 -fwrapv -fPIC -fPIE -gdwarf-4 -Wall (14.2.0)
opt64_lowsizegcc -march=native -mtune=native -O3 -fwrapv -fPIC -fPIE -gdwarf-4 -Wall (14.2.0)
opt64_lowsizegcc -march=native -mtune=native -O -fwrapv -fPIC -fPIE -gdwarf-4 -Wall (14.2.0)
opt64_lowsizegcc -march=native -mtune=native -Os -fwrapv -fPIC -fPIE -gdwarf-4 -Wall (14.2.0)

Namespace violations


hash.o ascon_absorb T
hash.o ascon_inithash T
hash.o ascon_squeeze T
permutations.o P T

Number of similar (implementation,compiler) pairs: 9, namely:
ImplementationCompiler
opt8clang -march=native -O2 -fwrapv -Qunused-arguments -fPIC -fPIE -gdwarf-4 -Wall (Debian_Clang_19.1.7_(1+b1))
opt8clang -march=native -O3 -fwrapv -Qunused-arguments -fPIC -fPIE -gdwarf-4 -Wall (Debian_Clang_19.1.7_(1+b1))
opt8clang -march=native -O -fwrapv -Qunused-arguments -fPIC -fPIE -gdwarf-4 -Wall (Debian_Clang_19.1.7_(1+b1))
opt8clang -march=native -Os -fwrapv -Qunused-arguments -fPIC -fPIE -gdwarf-4 -Wall (Debian_Clang_19.1.7_(1+b1))
opt8clang -mcpu=native -O3 -fwrapv -Qunused-arguments -fPIC -fPIE -gdwarf-4 -Wall (Debian_Clang_19.1.7_(1+b1))
opt8gcc -march=native -mtune=native -O2 -fwrapv -fPIC -fPIE -gdwarf-4 -Wall (14.2.0)
opt8gcc -march=native -mtune=native -O3 -fwrapv -fPIC -fPIE -gdwarf-4 -Wall (14.2.0)
opt8gcc -march=native -mtune=native -O -fwrapv -fPIC -fPIE -gdwarf-4 -Wall (14.2.0)
opt8gcc -march=native -mtune=native -Os -fwrapv -fPIC -fPIE -gdwarf-4 -Wall (14.2.0)

Namespace violations


permutations.o P T
update.o ascon_update T

Number of similar (implementation,compiler) pairs: 9, namely:
ImplementationCompiler
opt8_lowsizeclang -march=native -O2 -fwrapv -Qunused-arguments -fPIC -fPIE -gdwarf-4 -Wall (Debian_Clang_19.1.7_(1+b1))
opt8_lowsizeclang -march=native -O3 -fwrapv -Qunused-arguments -fPIC -fPIE -gdwarf-4 -Wall (Debian_Clang_19.1.7_(1+b1))
opt8_lowsizeclang -march=native -O -fwrapv -Qunused-arguments -fPIC -fPIE -gdwarf-4 -Wall (Debian_Clang_19.1.7_(1+b1))
opt8_lowsizeclang -march=native -Os -fwrapv -Qunused-arguments -fPIC -fPIE -gdwarf-4 -Wall (Debian_Clang_19.1.7_(1+b1))
opt8_lowsizeclang -mcpu=native -O3 -fwrapv -Qunused-arguments -fPIC -fPIE -gdwarf-4 -Wall (Debian_Clang_19.1.7_(1+b1))
opt8_lowsizegcc -march=native -mtune=native -O2 -fwrapv -fPIC -fPIE -gdwarf-4 -Wall (14.2.0)
opt8_lowsizegcc -march=native -mtune=native -O3 -fwrapv -fPIC -fPIE -gdwarf-4 -Wall (14.2.0)
opt8_lowsizegcc -march=native -mtune=native -O -fwrapv -fPIC -fPIE -gdwarf-4 -Wall (14.2.0)
opt8_lowsizegcc -march=native -mtune=native -Os -fwrapv -fPIC -fPIE -gdwarf-4 -Wall (14.2.0)

Passed TIMECOP


TIMECOP iterations: 10

Number of similar (implementation,compiler) pairs: 99, namely:
ImplementationCompiler
bi32clang -march=native -O2 -fwrapv -Qunused-arguments -fPIC -fPIE -gdwarf-4 -Wall (Debian_Clang_19.1.7_(1+b1))
bi32clang -march=native -O3 -fwrapv -Qunused-arguments -fPIC -fPIE -gdwarf-4 -Wall (Debian_Clang_19.1.7_(1+b1))
bi32clang -march=native -O -fwrapv -Qunused-arguments -fPIC -fPIE -gdwarf-4 -Wall (Debian_Clang_19.1.7_(1+b1))
bi32clang -march=native -Os -fwrapv -Qunused-arguments -fPIC -fPIE -gdwarf-4 -Wall (Debian_Clang_19.1.7_(1+b1))
bi32clang -mcpu=native -O3 -fwrapv -Qunused-arguments -fPIC -fPIE -gdwarf-4 -Wall (Debian_Clang_19.1.7_(1+b1))
bi32gcc -march=native -mtune=native -O2 -fwrapv -fPIC -fPIE -gdwarf-4 -Wall (14.2.0)
bi32gcc -march=native -mtune=native -O3 -fwrapv -fPIC -fPIE -gdwarf-4 -Wall (14.2.0)
bi32gcc -march=native -mtune=native -O -fwrapv -fPIC -fPIE -gdwarf-4 -Wall (14.2.0)
bi32gcc -march=native -mtune=native -Os -fwrapv -fPIC -fPIE -gdwarf-4 -Wall (14.2.0)
bi32_lowregclang -march=native -O2 -fwrapv -Qunused-arguments -fPIC -fPIE -gdwarf-4 -Wall (Debian_Clang_19.1.7_(1+b1))
bi32_lowregclang -march=native -O3 -fwrapv -Qunused-arguments -fPIC -fPIE -gdwarf-4 -Wall (Debian_Clang_19.1.7_(1+b1))
bi32_lowregclang -march=native -O -fwrapv -Qunused-arguments -fPIC -fPIE -gdwarf-4 -Wall (Debian_Clang_19.1.7_(1+b1))
bi32_lowregclang -march=native -Os -fwrapv -Qunused-arguments -fPIC -fPIE -gdwarf-4 -Wall (Debian_Clang_19.1.7_(1+b1))
bi32_lowregclang -mcpu=native -O3 -fwrapv -Qunused-arguments -fPIC -fPIE -gdwarf-4 -Wall (Debian_Clang_19.1.7_(1+b1))
bi32_lowreggcc -march=native -mtune=native -O2 -fwrapv -fPIC -fPIE -gdwarf-4 -Wall (14.2.0)
bi32_lowreggcc -march=native -mtune=native -O3 -fwrapv -fPIC -fPIE -gdwarf-4 -Wall (14.2.0)
bi32_lowreggcc -march=native -mtune=native -O -fwrapv -fPIC -fPIE -gdwarf-4 -Wall (14.2.0)
bi32_lowreggcc -march=native -mtune=native -Os -fwrapv -fPIC -fPIE -gdwarf-4 -Wall (14.2.0)
bi32_lowsizeclang -march=native -O2 -fwrapv -Qunused-arguments -fPIC -fPIE -gdwarf-4 -Wall (Debian_Clang_19.1.7_(1+b1))
bi32_lowsizeclang -march=native -O3 -fwrapv -Qunused-arguments -fPIC -fPIE -gdwarf-4 -Wall (Debian_Clang_19.1.7_(1+b1))
bi32_lowsizeclang -march=native -O -fwrapv -Qunused-arguments -fPIC -fPIE -gdwarf-4 -Wall (Debian_Clang_19.1.7_(1+b1))
bi32_lowsizeclang -march=native -Os -fwrapv -Qunused-arguments -fPIC -fPIE -gdwarf-4 -Wall (Debian_Clang_19.1.7_(1+b1))
bi32_lowsizeclang -mcpu=native -O3 -fwrapv -Qunused-arguments -fPIC -fPIE -gdwarf-4 -Wall (Debian_Clang_19.1.7_(1+b1))
bi32_lowsizegcc -march=native -mtune=native -O2 -fwrapv -fPIC -fPIE -gdwarf-4 -Wall (14.2.0)
bi32_lowsizegcc -march=native -mtune=native -O3 -fwrapv -fPIC -fPIE -gdwarf-4 -Wall (14.2.0)
bi32_lowsizegcc -march=native -mtune=native -O -fwrapv -fPIC -fPIE -gdwarf-4 -Wall (14.2.0)
bi32_lowsizegcc -march=native -mtune=native -Os -fwrapv -fPIC -fPIE -gdwarf-4 -Wall (14.2.0)
bi8clang -march=native -O2 -fwrapv -Qunused-arguments -fPIC -fPIE -gdwarf-4 -Wall (Debian_Clang_19.1.7_(1+b1))
bi8clang -march=native -O3 -fwrapv -Qunused-arguments -fPIC -fPIE -gdwarf-4 -Wall (Debian_Clang_19.1.7_(1+b1))
bi8clang -march=native -O -fwrapv -Qunused-arguments -fPIC -fPIE -gdwarf-4 -Wall (Debian_Clang_19.1.7_(1+b1))
bi8clang -march=native -Os -fwrapv -Qunused-arguments -fPIC -fPIE -gdwarf-4 -Wall (Debian_Clang_19.1.7_(1+b1))
bi8clang -mcpu=native -O3 -fwrapv -Qunused-arguments -fPIC -fPIE -gdwarf-4 -Wall (Debian_Clang_19.1.7_(1+b1))
bi8gcc -march=native -mtune=native -O2 -fwrapv -fPIC -fPIE -gdwarf-4 -Wall (14.2.0)
bi8gcc -march=native -mtune=native -O3 -fwrapv -fPIC -fPIE -gdwarf-4 -Wall (14.2.0)
bi8gcc -march=native -mtune=native -O -fwrapv -fPIC -fPIE -gdwarf-4 -Wall (14.2.0)
bi8gcc -march=native -mtune=native -Os -fwrapv -fPIC -fPIE -gdwarf-4 -Wall (14.2.0)
opt32clang -march=native -O2 -fwrapv -Qunused-arguments -fPIC -fPIE -gdwarf-4 -Wall (Debian_Clang_19.1.7_(1+b1))
opt32clang -march=native -O3 -fwrapv -Qunused-arguments -fPIC -fPIE -gdwarf-4 -Wall (Debian_Clang_19.1.7_(1+b1))
opt32clang -march=native -O -fwrapv -Qunused-arguments -fPIC -fPIE -gdwarf-4 -Wall (Debian_Clang_19.1.7_(1+b1))
opt32clang -march=native -Os -fwrapv -Qunused-arguments -fPIC -fPIE -gdwarf-4 -Wall (Debian_Clang_19.1.7_(1+b1))
opt32clang -mcpu=native -O3 -fwrapv -Qunused-arguments -fPIC -fPIE -gdwarf-4 -Wall (Debian_Clang_19.1.7_(1+b1))
opt32gcc -march=native -mtune=native -O2 -fwrapv -fPIC -fPIE -gdwarf-4 -Wall (14.2.0)
opt32gcc -march=native -mtune=native -O3 -fwrapv -fPIC -fPIE -gdwarf-4 -Wall (14.2.0)
opt32gcc -march=native -mtune=native -O -fwrapv -fPIC -fPIE -gdwarf-4 -Wall (14.2.0)
opt32gcc -march=native -mtune=native -Os -fwrapv -fPIC -fPIE -gdwarf-4 -Wall (14.2.0)
opt32_lowsizeclang -march=native -O2 -fwrapv -Qunused-arguments -fPIC -fPIE -gdwarf-4 -Wall (Debian_Clang_19.1.7_(1+b1))
opt32_lowsizeclang -march=native -O3 -fwrapv -Qunused-arguments -fPIC -fPIE -gdwarf-4 -Wall (Debian_Clang_19.1.7_(1+b1))
opt32_lowsizeclang -march=native -O -fwrapv -Qunused-arguments -fPIC -fPIE -gdwarf-4 -Wall (Debian_Clang_19.1.7_(1+b1))
opt32_lowsizeclang -march=native -Os -fwrapv -Qunused-arguments -fPIC -fPIE -gdwarf-4 -Wall (Debian_Clang_19.1.7_(1+b1))
opt32_lowsizeclang -mcpu=native -O3 -fwrapv -Qunused-arguments -fPIC -fPIE -gdwarf-4 -Wall (Debian_Clang_19.1.7_(1+b1))
opt32_lowsizegcc -march=native -mtune=native -O2 -fwrapv -fPIC -fPIE -gdwarf-4 -Wall (14.2.0)
opt32_lowsizegcc -march=native -mtune=native -O3 -fwrapv -fPIC -fPIE -gdwarf-4 -Wall (14.2.0)
opt32_lowsizegcc -march=native -mtune=native -O -fwrapv -fPIC -fPIE -gdwarf-4 -Wall (14.2.0)
opt32_lowsizegcc -march=native -mtune=native -Os -fwrapv -fPIC -fPIE -gdwarf-4 -Wall (14.2.0)
opt64clang -march=native -O2 -fwrapv -Qunused-arguments -fPIC -fPIE -gdwarf-4 -Wall (Debian_Clang_19.1.7_(1+b1))
opt64clang -march=native -O3 -fwrapv -Qunused-arguments -fPIC -fPIE -gdwarf-4 -Wall (Debian_Clang_19.1.7_(1+b1))
opt64clang -march=native -O -fwrapv -Qunused-arguments -fPIC -fPIE -gdwarf-4 -Wall (Debian_Clang_19.1.7_(1+b1))
opt64clang -march=native -Os -fwrapv -Qunused-arguments -fPIC -fPIE -gdwarf-4 -Wall (Debian_Clang_19.1.7_(1+b1))
opt64clang -mcpu=native -O3 -fwrapv -Qunused-arguments -fPIC -fPIE -gdwarf-4 -Wall (Debian_Clang_19.1.7_(1+b1))
opt64gcc -march=native -mtune=native -O2 -fwrapv -fPIC -fPIE -gdwarf-4 -Wall (14.2.0)
opt64gcc -march=native -mtune=native -O3 -fwrapv -fPIC -fPIE -gdwarf-4 -Wall (14.2.0)
opt64gcc -march=native -mtune=native -O -fwrapv -fPIC -fPIE -gdwarf-4 -Wall (14.2.0)
opt64gcc -march=native -mtune=native -Os -fwrapv -fPIC -fPIE -gdwarf-4 -Wall (14.2.0)
opt64_lowsizeclang -march=native -O2 -fwrapv -Qunused-arguments -fPIC -fPIE -gdwarf-4 -Wall (Debian_Clang_19.1.7_(1+b1))
opt64_lowsizeclang -march=native -O3 -fwrapv -Qunused-arguments -fPIC -fPIE -gdwarf-4 -Wall (Debian_Clang_19.1.7_(1+b1))
opt64_lowsizeclang -march=native -O -fwrapv -Qunused-arguments -fPIC -fPIE -gdwarf-4 -Wall (Debian_Clang_19.1.7_(1+b1))
opt64_lowsizeclang -march=native -Os -fwrapv -Qunused-arguments -fPIC -fPIE -gdwarf-4 -Wall (Debian_Clang_19.1.7_(1+b1))
opt64_lowsizeclang -mcpu=native -O3 -fwrapv -Qunused-arguments -fPIC -fPIE -gdwarf-4 -Wall (Debian_Clang_19.1.7_(1+b1))
opt64_lowsizegcc -march=native -mtune=native -O2 -fwrapv -fPIC -fPIE -gdwarf-4 -Wall (14.2.0)
opt64_lowsizegcc -march=native -mtune=native -O3 -fwrapv -fPIC -fPIE -gdwarf-4 -Wall (14.2.0)
opt64_lowsizegcc -march=native -mtune=native -O -fwrapv -fPIC -fPIE -gdwarf-4 -Wall (14.2.0)
opt64_lowsizegcc -march=native -mtune=native -Os -fwrapv -fPIC -fPIE -gdwarf-4 -Wall (14.2.0)
opt8clang -march=native -O2 -fwrapv -Qunused-arguments -fPIC -fPIE -gdwarf-4 -Wall (Debian_Clang_19.1.7_(1+b1))
opt8clang -march=native -O3 -fwrapv -Qunused-arguments -fPIC -fPIE -gdwarf-4 -Wall (Debian_Clang_19.1.7_(1+b1))
opt8clang -march=native -O -fwrapv -Qunused-arguments -fPIC -fPIE -gdwarf-4 -Wall (Debian_Clang_19.1.7_(1+b1))
opt8clang -march=native -Os -fwrapv -Qunused-arguments -fPIC -fPIE -gdwarf-4 -Wall (Debian_Clang_19.1.7_(1+b1))
opt8clang -mcpu=native -O3 -fwrapv -Qunused-arguments -fPIC -fPIE -gdwarf-4 -Wall (Debian_Clang_19.1.7_(1+b1))
opt8gcc -march=native -mtune=native -O2 -fwrapv -fPIC -fPIE -gdwarf-4 -Wall (14.2.0)
opt8gcc -march=native -mtune=native -O3 -fwrapv -fPIC -fPIE -gdwarf-4 -Wall (14.2.0)
opt8gcc -march=native -mtune=native -O -fwrapv -fPIC -fPIE -gdwarf-4 -Wall (14.2.0)
opt8gcc -march=native -mtune=native -Os -fwrapv -fPIC -fPIE -gdwarf-4 -Wall (14.2.0)
opt8_lowsizeclang -march=native -O2 -fwrapv -Qunused-arguments -fPIC -fPIE -gdwarf-4 -Wall (Debian_Clang_19.1.7_(1+b1))
opt8_lowsizeclang -march=native -O3 -fwrapv -Qunused-arguments -fPIC -fPIE -gdwarf-4 -Wall (Debian_Clang_19.1.7_(1+b1))
opt8_lowsizeclang -march=native -O -fwrapv -Qunused-arguments -fPIC -fPIE -gdwarf-4 -Wall (Debian_Clang_19.1.7_(1+b1))
opt8_lowsizeclang -march=native -Os -fwrapv -Qunused-arguments -fPIC -fPIE -gdwarf-4 -Wall (Debian_Clang_19.1.7_(1+b1))
opt8_lowsizeclang -mcpu=native -O3 -fwrapv -Qunused-arguments -fPIC -fPIE -gdwarf-4 -Wall (Debian_Clang_19.1.7_(1+b1))
opt8_lowsizegcc -march=native -mtune=native -O2 -fwrapv -fPIC -fPIE -gdwarf-4 -Wall (14.2.0)
opt8_lowsizegcc -march=native -mtune=native -O3 -fwrapv -fPIC -fPIE -gdwarf-4 -Wall (14.2.0)
opt8_lowsizegcc -march=native -mtune=native -O -fwrapv -fPIC -fPIE -gdwarf-4 -Wall (14.2.0)
opt8_lowsizegcc -march=native -mtune=native -Os -fwrapv -fPIC -fPIE -gdwarf-4 -Wall (14.2.0)
refclang -march=native -O2 -fwrapv -Qunused-arguments -fPIC -fPIE -gdwarf-4 -Wall (Debian_Clang_19.1.7_(1+b1))
refclang -march=native -O3 -fwrapv -Qunused-arguments -fPIC -fPIE -gdwarf-4 -Wall (Debian_Clang_19.1.7_(1+b1))
refclang -march=native -O -fwrapv -Qunused-arguments -fPIC -fPIE -gdwarf-4 -Wall (Debian_Clang_19.1.7_(1+b1))
refclang -march=native -Os -fwrapv -Qunused-arguments -fPIC -fPIE -gdwarf-4 -Wall (Debian_Clang_19.1.7_(1+b1))
refclang -mcpu=native -O3 -fwrapv -Qunused-arguments -fPIC -fPIE -gdwarf-4 -Wall (Debian_Clang_19.1.7_(1+b1))
refgcc -march=native -mtune=native -O2 -fwrapv -fPIC -fPIE -gdwarf-4 -Wall (14.2.0)
refgcc -march=native -mtune=native -O3 -fwrapv -fPIC -fPIE -gdwarf-4 -Wall (14.2.0)
refgcc -march=native -mtune=native -O -fwrapv -fPIC -fPIE -gdwarf-4 -Wall (14.2.0)
refgcc -march=native -mtune=native -Os -fwrapv -fPIC -fPIE -gdwarf-4 -Wall (14.2.0)