Test results for amd64, samba, crypto_kem/titaniumccahi

[Page version: 20250313 00:14:40]

Measurements for amd64, samba, crypto_kem Test results for amd64, samba, crypto_kem Test results for crypto_kem/titaniumccahi
Computer: samba
Microarchitecture: amd64; Skylake (506e3)
Architecture: amd64
CPU ID: GenuineIntel-000506e3-bfebfbff
SUPERCOP version: 20250307
Operation: crypto_kem
Primitive: titaniumccahi
TimeObject sizeTest sizeImplementationCompilerBenchmark dateSUPERCOP version
3486037108985 0 36231733 868 1792T:avx2clang -march=native -O2 -fwrapv -Qunused-arguments -fPIC -fPIE -gdwarf-4 -Wall2025031120250307
3492541105024 0 36224117 868 1792T:avx2clang -march=native -O -fwrapv -Qunused-arguments -fPIC -fPIE -gdwarf-4 -Wall2025031120250307
3500709103211 0 36223063 860 1888T:avx2clang -march=native -Os -fwrapv -Qunused-arguments -fPIC -fPIE -gdwarf-4 -Wall2025031120250307
3502745111548 0 36234597 868 1888T:avx2clang -march=native -O3 -fwrapv -Qunused-arguments -fPIC -fPIE -gdwarf-4 -Wall2025031120250307
3614054109614 0 64231915 828 1856T:avx2gcc -march=native -mtune=native -O3 -fwrapv -fPIC -fPIE -gdwarf-4 -Wall2025031120250307
3740341108719 0 64229011 828 1856T:avx2gcc -march=native -mtune=native -O2 -fwrapv -fPIC -fPIE -gdwarf-4 -Wall2025031120250307
3933712108430 0 64228235 828 1856T:avx2gcc -march=native -mtune=native -O -fwrapv -fPIC -fPIE -gdwarf-4 -Wall2025031120250307
4291803135081 0 36257021 868 1888T:optclang -march=native -O3 -fwrapv -Qunused-arguments -fPIC -fPIE -gdwarf-4 -Wall2025031120250307
4303464104869 0 36226741 868 1792T:optclang -march=native -O2 -fwrapv -Qunused-arguments -fPIC -fPIE -gdwarf-4 -Wall2025031120250307
453890755932 0 36176087 860 1888T:optclang -march=native -Os -fwrapv -Qunused-arguments -fPIC -fPIE -gdwarf-4 -Wall2025031120250307
471390454259 0 36173821 868 1792T:optclang -march=native -O -fwrapv -Qunused-arguments -fPIC -fPIE -gdwarf-4 -Wall2025031120250307
476045473986 0 36195861 868 1792T:optclang -mcpu=native -O3 -fwrapv -Qunused-arguments -fPIC -fPIE -gdwarf-4 -Wall2025031120250307
504566679753 0 64201987 828 1856T:optgcc -march=native -mtune=native -O3 -fwrapv -fPIC -fPIE -gdwarf-4 -Wall2025031120250307
510713057167 0 64177643 828 1856T:optgcc -march=native -mtune=native -O2 -fwrapv -fPIC -fPIE -gdwarf-4 -Wall2025031120250307
556012257407 0 64177403 828 1856T:optgcc -march=native -mtune=native -O -fwrapv -fPIC -fPIE -gdwarf-4 -Wall2025031120250307
80608227386307 0 36209589 868 1888T:refclang -march=native -O3 -fwrapv -Qunused-arguments -fPIC -fPIE -gdwarf-4 -Wall2025031120250307
80622841058023 0 36181005 868 1792T:refclang -march=native -O2 -fwrapv -Qunused-arguments -fPIC -fPIE -gdwarf-4 -Wall2025031120250307
81912020144689 0 36164815 860 1888T:refclang -march=native -Os -fwrapv -Qunused-arguments -fPIC -fPIE -gdwarf-4 -Wall2025031120250307
82828251164013 0 36185845 868 1792T:refclang -mcpu=native -O3 -fwrapv -Qunused-arguments -fPIC -fPIE -gdwarf-4 -Wall2025031120250307
82871434343982 0 64164299 828 1856T:refgcc -march=native -mtune=native -O2 -fwrapv -fPIC -fPIE -gdwarf-4 -Wall2025031120250307
83556685558092 0 64180323 828 1856T:refgcc -march=native -mtune=native -O3 -fwrapv -fPIC -fPIE -gdwarf-4 -Wall2025031120250307
84737736543649 0 36163157 868 1792T:refclang -march=native -O -fwrapv -Qunused-arguments -fPIC -fPIE -gdwarf-4 -Wall2025031120250307
92743834344197 0 64164035 828 1856T:refgcc -march=native -mtune=native -O -fwrapv -fPIC -fPIE -gdwarf-4 -Wall2025031120250307
243361996243046 0 64161779 820 1824T:refgcc -march=native -mtune=native -Os -fwrapv -fPIC -fPIE -gdwarf-4 -Wall2025031120250307

Compiler output


encrypt.c: encrypt.c:63:8: error: always_inline function '_mm256_loadu_si256' requires target feature 'avx', but would be inlined into function 'crypto_encrypt_keypair' that is compiled without support for 'avx'
encrypt.c:                         u = _mm256_loadu_si256((__m256i *)(a[i] + j));
encrypt.c:                             ^
encrypt.c: encrypt.c:63:8: error: AVX vector return of type '__m256i' (vector of 4 'long long' values) without 'avx' enabled changes the ABI
encrypt.c: encrypt.c:64:8: error: always_inline function '_mm256_loadu_si256' requires target feature 'avx', but would be inlined into function 'crypto_encrypt_keypair' that is compiled without support for 'avx'
encrypt.c:                         v = _mm256_loadu_si256((__m256i *)(s + j));
encrypt.c:                             ^
encrypt.c: encrypt.c:64:8: error: AVX vector return of type '__m256i' (vector of 4 'long long' values) without 'avx' enabled changes the ABI
encrypt.c: encrypt.c:65:8: error: always_inline function '_mm256_mul_epu32' requires target feature 'avx2', but would be inlined into function 'crypto_encrypt_keypair' that is compiled without support for 'avx2'
encrypt.c:                         t = _mm256_mul_epu32(u, v);
encrypt.c:                             ^
encrypt.c: encrypt.c:65:8: error: AVX vector argument of type '__m256i' (vector of 4 'long long' values) without 'avx' enabled changes the ABI
encrypt.c: encrypt.c:66:4: error: always_inline function '_mm256_storeu_si256' requires target feature 'avx', but would be inlined into function 'crypto_encrypt_keypair' that is compiled without support for 'avx'
encrypt.c:                         _mm256_storeu_si256((__m256i *)(a[i] + j), t);
encrypt.c:                         ^
encrypt.c: encrypt.c:66:4: error: AVX vector argument of type '__m256i' (vector of 4 'long long' values) without 'avx' enabled changes the ABI
encrypt.c: encrypt.c:78:8: error: always_inline function '_mm256_loadu_si256' requires target feature 'avx', but would be inlined into function 'crypto_encrypt_keypair' that is compiled without support for 'avx'
encrypt.c:                         u = _mm256_loadu_si256((__m256i *)(a[i] + j));
encrypt.c:                             ^
encrypt.c: encrypt.c:78:8: error: AVX vector return of type '__m256i' (vector of 4 'long long' values) without 'avx' enabled changes the ABI
encrypt.c: encrypt.c:79:8: error: always_inline function '_mm256_loadu_si256' requires target feature 'avx', but would be inlined into function 'crypto_encrypt_keypair' that is compiled without support for 'avx'
encrypt.c:                         v = _mm256_loadu_si256((__m256i *)(e[i] + j));
encrypt.c:                             ^
encrypt.c: encrypt.c:79:8: error: AVX vector return of type '__m256i' (vector of 4 'long long' values) without 'avx' enabled changes the ABI
encrypt.c: encrypt.c:80:8: error: always_inline function '_mm256_add_epi64' requires target feature 'avx2', but would be inlined into function 'crypto_encrypt_keypair' that is compiled without support for 'avx2'
encrypt.c: ...

Number of similar (implementation,compiler) pairs: 1, namely:
ImplementationCompiler
T:avx2clang -mcpu=native -O3 -fwrapv -Qunused-arguments -fPIC -fPIE -gdwarf-4 -Wall (Ubuntu_Clang_14.0.0)

Compiler output


try.c: /usr/bin/ld: libcrypto_kem_titaniumccahi.a(sampler.o): in function `sampler_zq':
try.c: .../supercop-data/samba/amd64/try/c/gcc_-march=native_-mtune=native_-Os_-fwrapv_-fPIC_-fPIE_-gdwarf-4_-Wall/timingleaks/crypto_kem/titaniumccahi/avx2/work/sampler.c:160: undefined reference to `barrett_zq'
try.c: collect2: error: ld returned 1 exit status

Number of similar (implementation,compiler) pairs: 1, namely:
ImplementationCompiler
T:avx2gcc -march=native -mtune=native -Os -fwrapv -fPIC -fPIE -gdwarf-4 -Wall (11.4.0)

Compiler output


try.c: /usr/bin/ld: libcrypto_kem_titaniumccahi.a(encrypt.o): in function `crypto_encrypt_keypair':
try.c: .../supercop-data/samba/amd64/try/c/gcc_-march=native_-mtune=native_-Os_-fwrapv_-fPIC_-fPIE_-gdwarf-4_-Wall/timingleaks/crypto_kem/titaniumccahi/opt/work/encrypt.c:55: undefined reference to `barrett_4q2'
try.c: /usr/bin/ld: .../supercop-data/samba/amd64/try/c/gcc_-march=native_-mtune=native_-Os_-fwrapv_-fPIC_-fPIE_-gdwarf-4_-Wall/timingleaks/crypto_kem/titaniumccahi/opt/work/encrypt.c:63: undefined reference to `barrett_4q'
try.c: /usr/bin/ld: libcrypto_kem_titaniumccahi.a(encrypt.o): in function `crypto_encrypt':
try.c: .../supercop-data/samba/amd64/try/c/gcc_-march=native_-mtune=native_-Os_-fwrapv_-fPIC_-fPIE_-gdwarf-4_-Wall/timingleaks/crypto_kem/titaniumccahi/opt/work/encrypt.c:140: undefined reference to `barrett_4q2'
try.c: /usr/bin/ld: .../supercop-data/samba/amd64/try/c/gcc_-march=native_-mtune=native_-Os_-fwrapv_-fPIC_-fPIE_-gdwarf-4_-Wall/timingleaks/crypto_kem/titaniumccahi/opt/work/encrypt.c:150: undefined reference to `barrett_4q2'
try.c: /usr/bin/ld: libcrypto_kem_titaniumccahi.a(encrypt.o): in function `crypto_encrypt_open':
try.c: .../supercop-data/samba/amd64/try/c/gcc_-march=native_-mtune=native_-Os_-fwrapv_-fPIC_-fPIE_-gdwarf-4_-Wall/timingleaks/crypto_kem/titaniumccahi/opt/work/encrypt.c:194: undefined reference to `barrett_4q2'
try.c: /usr/bin/ld: libcrypto_kem_titaniumccahi.a(ntt.o): in function `ntt_butterfly_1536_2560':
try.c: .../supercop-data/samba/amd64/try/c/gcc_-march=native_-mtune=native_-Os_-fwrapv_-fPIC_-fPIE_-gdwarf-4_-Wall/timingleaks/crypto_kem/titaniumccahi/opt/work/ntt.c:361: undefined reference to `barrett_16q'
try.c: /usr/bin/ld: libcrypto_kem_titaniumccahi.a(ntt.o): in function `ntt_butterfly_2560_1024':
try.c: .../supercop-data/samba/amd64/try/c/gcc_-march=native_-mtune=native_-Os_-fwrapv_-fPIC_-fPIE_-gdwarf-4_-Wall/timingleaks/crypto_kem/titaniumccahi/opt/work/ntt.c:389: undefined reference to `barrett_32q'
try.c: /usr/bin/ld: libcrypto_kem_titaniumccahi.a(ntt.o): in function `ntt_butterfly_768_2304':
try.c: .../supercop-data/samba/amd64/try/c/gcc_-march=native_-mtune=native_-Os_-fwrapv_-fPIC_-fPIE_-gdwarf-4_-Wall/timingleaks/crypto_kem/titaniumccahi/opt/work/ntt.c:404: undefined reference to `barrett_8q'
try.c: /usr/bin/ld: libcrypto_kem_titaniumccahi.a(ntt.o): in function `ntt_butterfly_1536_2304':
try.c: .../supercop-data/samba/amd64/try/c/gcc_-march=native_-mtune=native_-Os_-fwrapv_-fPIC_-fPIE_-gdwarf-4_-Wall/timingleaks/crypto_kem/titaniumccahi/opt/work/ntt.c:427: undefined reference to `barrett_16q'
try.c: /usr/bin/ld: libcrypto_kem_titaniumccahi.a(ntt.o): in function `ntt_butterfly_2304_2304_inv':
try.c: .../supercop-data/samba/amd64/try/c/gcc_-march=native_-mtune=native_-Os_-fwrapv_-fPIC_-fPIE_-gdwarf-4_-Wall/timingleaks/crypto_kem/titaniumccahi/opt/work/ntt.c:453: undefined reference to `barrett_32q'
try.c: /usr/bin/ld: libcrypto_kem_titaniumccahi.a(ntt.o): in function `ntt_butterfly_1024_1024_inv':
try.c: .../supercop-data/samba/amd64/try/c/gcc_-march=native_-mtune=native_-Os_-fwrapv_-fPIC_-fPIE_-gdwarf-4_-Wall/timingleaks/crypto_kem/titaniumccahi/opt/work/ntt.c:474: undefined reference to `barrett_8q'
try.c: /usr/bin/ld: libcrypto_kem_titaniumccahi.a(ntt.o): in function `ntt_butterfly_768_1024':
try.c: .../supercop-data/samba/amd64/try/c/gcc_-march=native_-mtune=native_-Os_-fwrapv_-fPIC_-fPIE_-gdwarf-4_-Wall/timingleaks/crypto_kem/titaniumccahi/opt/work/ntt.c:489: undefined reference to `barrett_8q'
try.c: /usr/bin/ld: libcrypto_kem_titaniumccahi.a(ntt.o): in function `ntt_butterfly_1024_256':
try.c: .../supercop-data/samba/amd64/try/c/gcc_-march=native_-mtune=native_-Os_-fwrapv_-fPIC_-fPIE_-gdwarf-4_-Wall/timingleaks/crypto_kem/titaniumccahi/opt/work/ntt.c:498: undefined reference to `barrett_8q'
try.c: /usr/bin/ld: libcrypto_kem_titaniumccahi.a(ntt.o): in function `ntt_butterfly_2304_2560':
try.c: ...

Number of similar (implementation,compiler) pairs: 1, namely:
ImplementationCompiler
T:optgcc -march=native -mtune=native -Os -fwrapv -fPIC -fPIE -gdwarf-4 -Wall (11.4.0)

Namespace violations


encrypt.o crypto_encrypt T
encrypt.o crypto_encrypt_keypair T
encrypt.o crypto_encrypt_open T
fastrandombytes.o fastrandombytes T
fastrandombytes.o fastrandombytes_setseed T
fastrandombytes.o iv B
fastrandombytes.o key B
ntt.o intt_1024_256 T
ntt.o intt_2304_2304_inv T
ntt.o intt_2560_1024 T
ntt.o intt_2560_256 T
ntt.o ntt_1024_1024_inv T
ntt.o ntt_1536_2304 T
ntt.o ntt_1536_2560 T
ntt.o ntt_2304_2560 T
ntt.o ntt_768_1024 T
ntt.o ntt_768_2304 T
pack.o poly_decode T
pack.o poly_decode_c2 T
pack.o poly_encode T
pack.o poly_encode_c2 T
sampler.o sampler_binomial T
sampler.o sampler_zb T
sampler.o sampler_zq T

Number of similar (implementation,compiler) pairs: 15, namely:
ImplementationCompiler
T:avx2clang -march=native -O2 -fwrapv -Qunused-arguments -fPIC -fPIE -gdwarf-4 -Wall (Ubuntu_Clang_14.0.0)
T:avx2clang -march=native -O3 -fwrapv -Qunused-arguments -fPIC -fPIE -gdwarf-4 -Wall (Ubuntu_Clang_14.0.0)
T:avx2clang -march=native -O -fwrapv -Qunused-arguments -fPIC -fPIE -gdwarf-4 -Wall (Ubuntu_Clang_14.0.0)
T:avx2clang -march=native -Os -fwrapv -Qunused-arguments -fPIC -fPIE -gdwarf-4 -Wall (Ubuntu_Clang_14.0.0)
T:avx2gcc -march=native -mtune=native -O2 -fwrapv -fPIC -fPIE -gdwarf-4 -Wall (11.4.0)
T:avx2gcc -march=native -mtune=native -O3 -fwrapv -fPIC -fPIE -gdwarf-4 -Wall (11.4.0)
T:avx2gcc -march=native -mtune=native -O -fwrapv -fPIC -fPIE -gdwarf-4 -Wall (11.4.0)
T:optclang -march=native -O2 -fwrapv -Qunused-arguments -fPIC -fPIE -gdwarf-4 -Wall (Ubuntu_Clang_14.0.0)
T:optclang -march=native -O3 -fwrapv -Qunused-arguments -fPIC -fPIE -gdwarf-4 -Wall (Ubuntu_Clang_14.0.0)
T:optclang -march=native -O -fwrapv -Qunused-arguments -fPIC -fPIE -gdwarf-4 -Wall (Ubuntu_Clang_14.0.0)
T:optclang -march=native -Os -fwrapv -Qunused-arguments -fPIC -fPIE -gdwarf-4 -Wall (Ubuntu_Clang_14.0.0)
T:optclang -mcpu=native -O3 -fwrapv -Qunused-arguments -fPIC -fPIE -gdwarf-4 -Wall (Ubuntu_Clang_14.0.0)
T:optgcc -march=native -mtune=native -O2 -fwrapv -fPIC -fPIE -gdwarf-4 -Wall (11.4.0)
T:optgcc -march=native -mtune=native -O3 -fwrapv -fPIC -fPIE -gdwarf-4 -Wall (11.4.0)
T:optgcc -march=native -mtune=native -O -fwrapv -fPIC -fPIE -gdwarf-4 -Wall (11.4.0)

Namespace violations


encrypt.o crypto_encrypt T
encrypt.o crypto_encrypt_keypair T
encrypt.o crypto_encrypt_open T
fastrandombytes.o fastrandombytes T
fastrandombytes.o fastrandombytes_setseed T
fastrandombytes.o iv B
fastrandombytes.o key B
ntt.o intt_1024_1024 T
ntt.o intt_2304_2304_inv T
ntt.o intt_2560_2560 T
ntt.o ntt_1024_1024_inv T
ntt.o ntt_2304_2304 T
pack.o poly_decode T
pack.o poly_decode_c2 T
pack.o poly_encode T
pack.o poly_encode_c2 T
product.o mp T
product.o product T
sampler.o sampler_binomial T
sampler.o sampler_zb T
sampler.o sampler_zq T

Number of similar (implementation,compiler) pairs: 9, namely:
ImplementationCompiler
T:refclang -march=native -O2 -fwrapv -Qunused-arguments -fPIC -fPIE -gdwarf-4 -Wall (Ubuntu_Clang_14.0.0)
T:refclang -march=native -O3 -fwrapv -Qunused-arguments -fPIC -fPIE -gdwarf-4 -Wall (Ubuntu_Clang_14.0.0)
T:refclang -march=native -O -fwrapv -Qunused-arguments -fPIC -fPIE -gdwarf-4 -Wall (Ubuntu_Clang_14.0.0)
T:refclang -march=native -Os -fwrapv -Qunused-arguments -fPIC -fPIE -gdwarf-4 -Wall (Ubuntu_Clang_14.0.0)
T:refclang -mcpu=native -O3 -fwrapv -Qunused-arguments -fPIC -fPIE -gdwarf-4 -Wall (Ubuntu_Clang_14.0.0)
T:refgcc -march=native -mtune=native -O2 -fwrapv -fPIC -fPIE -gdwarf-4 -Wall (11.4.0)
T:refgcc -march=native -mtune=native -O3 -fwrapv -fPIC -fPIE -gdwarf-4 -Wall (11.4.0)
T:refgcc -march=native -mtune=native -O -fwrapv -fPIC -fPIE -gdwarf-4 -Wall (11.4.0)
T:refgcc -march=native -mtune=native -Os -fwrapv -fPIC -fPIE -gdwarf-4 -Wall (11.4.0)