Test results for amd64, saber214, crypto_stream/chacha8

[Page version: 20250326 01:21:01]

Measurements for amd64, saber214, crypto_stream Test results for amd64, saber214, crypto_stream Test results for crypto_stream/chacha8
Computer: saber214
Microarchitecture: amd64; Bulldozer (600f20)
Architecture: amd64
CPU ID: AuthenticAMD-00600f20-1789c3f5
SUPERCOP version: 20250307
Operation: crypto_stream
Primitive: chacha8
TimeObject sizeTest sizeImplementationCompilerBenchmark dateSUPERCOP version
17323003 0 015749 768 864moon/xop/64gcc -march=native -mtune=native -O -fwrapv -fPIC -fPIE -gdwarf-4 -Wall2025031020250307
17352942 0 014838 808 792moon/xop/64clang -march=native -Os -fwrapv -Qunused-arguments -fPIC -fPIE -gdwarf-4 -Wall2025031020250307
17412953 0 016564 816 792moon/xop/64clang -march=native -O2 -fwrapv -Qunused-arguments -fPIC -fPIE -gdwarf-4 -Wall2025031020250307
17412953 0 018924 816 808moon/xop/64clang -march=native -O3 -fwrapv -Qunused-arguments -fPIC -fPIE -gdwarf-4 -Wall2025031020250307
17412995 0 016006 776 864moon/xop/64gcc -march=native -mtune=native -O2 -fwrapv -fPIC -fPIE -gdwarf-4 -Wall2025031020250307
17412995 0 017566 776 864moon/xop/64gcc -march=native -mtune=native -O3 -fwrapv -fPIC -fPIE -gdwarf-4 -Wall2025031020250307
17422982 0 014593 752 832moon/xop/64gcc -march=native -mtune=native -Os -fwrapv -fPIC -fPIE -gdwarf-4 -Wall2025031020250307
17772953 0 015228 816 792moon/xop/64clang -march=native -O -fwrapv -Qunused-arguments -fPIC -fPIE -gdwarf-4 -Wall2025031020250307
17862953 0 017644 816 792moon/xop/64clang -mcpu=native -O3 -fwrapv -Qunused-arguments -fPIC -fPIE -gdwarf-4 -Wall2025031020250307
18705053 0 121060 816 816dolbeau/amd64-avx2clang -march=native -O3 -fwrapv -Qunused-arguments -fPIC -fPIE -gdwarf-4 -Wall2025031020250307
18753569 0 115494 808 792dolbeau/amd64-avx2clang -march=native -Os -fwrapv -Qunused-arguments -fPIC -fPIE -gdwarf-4 -Wall2025031020250307
18923782 0 116108 816 800dolbeau/amd64-avx2clang -march=native -O -fwrapv -Qunused-arguments -fPIC -fPIE -gdwarf-4 -Wall2025031020250307
19004285 0 117900 816 800dolbeau/amd64-avx2clang -march=native -O2 -fwrapv -Qunused-arguments -fPIC -fPIE -gdwarf-4 -Wall2025031020250307
22533331 0 016342 776 864moon/avx/64gcc -march=native -mtune=native -O2 -fwrapv -fPIC -fPIE -gdwarf-4 -Wall2025031020250307
22553331 0 017902 776 864moon/avx/64gcc -march=native -mtune=native -O3 -fwrapv -fPIC -fPIE -gdwarf-4 -Wall2025031020250307
22563289 0 016900 816 792moon/avx/64clang -march=native -O2 -fwrapv -Qunused-arguments -fPIC -fPIE -gdwarf-4 -Wall2025031020250307
22563289 0 019260 816 808moon/avx/64clang -march=native -O3 -fwrapv -Qunused-arguments -fPIC -fPIE -gdwarf-4 -Wall2025031020250307
22563278 0 015174 808 792moon/avx/64clang -march=native -Os -fwrapv -Qunused-arguments -fPIC -fPIE -gdwarf-4 -Wall2025031020250307
22563318 0 014929 752 832moon/avx/64gcc -march=native -mtune=native -Os -fwrapv -fPIC -fPIE -gdwarf-4 -Wall2025031020250307
22623289 0 015564 816 792moon/avx/64clang -march=native -O -fwrapv -Qunused-arguments -fPIC -fPIE -gdwarf-4 -Wall2025031020250307
22713289 0 017980 816 792moon/avx/64clang -mcpu=native -O3 -fwrapv -Qunused-arguments -fPIC -fPIE -gdwarf-4 -Wall2025031020250307
22833339 0 016085 768 864moon/avx/64gcc -march=native -mtune=native -O -fwrapv -fPIC -fPIE -gdwarf-4 -Wall2025031020250307
23083782 0 015393 752 832moon/ssse3/64gcc -march=native -mtune=native -Os -fwrapv -fPIC -fPIE -gdwarf-4 -Wall2025031020250307
23173742 0 015638 808 792moon/ssse3/64clang -march=native -Os -fwrapv -Qunused-arguments -fPIC -fPIE -gdwarf-4 -Wall2025031020250307
23173803 0 016549 768 864moon/ssse3/64gcc -march=native -mtune=native -O -fwrapv -fPIC -fPIE -gdwarf-4 -Wall2025031020250307
23183753 0 017364 816 792moon/ssse3/64clang -march=native -O2 -fwrapv -Qunused-arguments -fPIC -fPIE -gdwarf-4 -Wall2025031020250307
23183795 0 018366 776 864moon/ssse3/64gcc -march=native -mtune=native -O3 -fwrapv -fPIC -fPIE -gdwarf-4 -Wall2025031020250307
23193753 0 018444 816 792moon/ssse3/64clang -mcpu=native -O3 -fwrapv -Qunused-arguments -fPIC -fPIE -gdwarf-4 -Wall2025031020250307
23233753 0 019724 816 808moon/ssse3/64clang -march=native -O3 -fwrapv -Qunused-arguments -fPIC -fPIE -gdwarf-4 -Wall2025031020250307
23353795 0 016806 776 864moon/ssse3/64gcc -march=native -mtune=native -O2 -fwrapv -fPIC -fPIE -gdwarf-4 -Wall2025031020250307
23513753 0 016028 816 792moon/ssse3/64clang -march=native -O -fwrapv -Qunused-arguments -fPIC -fPIE -gdwarf-4 -Wall2025031020250307
25303981 0 015601 752 832moon/sse2/64gcc -march=native -mtune=native -Os -fwrapv -fPIC -fPIE -gdwarf-4 -Wall2025031020250307
25353994 0 017014 776 864moon/sse2/64gcc -march=native -mtune=native -O2 -fwrapv -fPIC -fPIE -gdwarf-4 -Wall2025031020250307
25353994 0 018574 776 864moon/sse2/64gcc -march=native -mtune=native -O3 -fwrapv -fPIC -fPIE -gdwarf-4 -Wall2025031020250307
25633952 0 017572 816 792moon/sse2/64clang -march=native -O2 -fwrapv -Qunused-arguments -fPIC -fPIE -gdwarf-4 -Wall2025031020250307
25643941 0 015846 808 792moon/sse2/64clang -march=native -Os -fwrapv -Qunused-arguments -fPIC -fPIE -gdwarf-4 -Wall2025031020250307
25644002 0 016757 768 864moon/sse2/64gcc -march=native -mtune=native -O -fwrapv -fPIC -fPIE -gdwarf-4 -Wall2025031020250307
25653952 0 018652 816 792moon/sse2/64clang -mcpu=native -O3 -fwrapv -Qunused-arguments -fPIC -fPIE -gdwarf-4 -Wall2025031020250307
25693952 0 019932 816 808moon/sse2/64clang -march=native -O3 -fwrapv -Qunused-arguments -fPIC -fPIE -gdwarf-4 -Wall2025031020250307
25693952 0 016236 816 792moon/sse2/64clang -march=native -O -fwrapv -Qunused-arguments -fPIC -fPIE -gdwarf-4 -Wall2025031020250307
27115049 0 418502 776 872dolbeau/amd64-avx2gcc -march=native -mtune=native -O2 -fwrapv -fPIC -fPIE -gdwarf-4 -Wall2025031020250307
27367169 0 422142 776 872dolbeau/amd64-avx2gcc -march=native -mtune=native -O3 -fwrapv -fPIC -fPIE -gdwarf-4 -Wall2025031020250307
27675469 0 418605 768 872dolbeau/amd64-avx2gcc -march=native -mtune=native -O -fwrapv -fPIC -fPIE -gdwarf-4 -Wall2025031020250307
28224625 0 417445 768 872amd64-ssse3gcc -march=native -mtune=native -O -fwrapv -fPIC -fPIE -gdwarf-4 -Wall2025031020250307
28244365 0 116374 808 792amd64-ssse3clang -march=native -Os -fwrapv -Qunused-arguments -fPIC -fPIE -gdwarf-4 -Wall2025031020250307
28344429 0 116796 816 800amd64-ssse3clang -march=native -O -fwrapv -Qunused-arguments -fPIC -fPIE -gdwarf-4 -Wall2025031020250307
28464904 0 416905 752 840dolbeau/amd64-avx2gcc -march=native -mtune=native -Os -fwrapv -fPIC -fPIE -gdwarf-4 -Wall2025031020250307
28514644 0 417734 776 872amd64-ssse3gcc -march=native -mtune=native -O2 -fwrapv -fPIC -fPIE -gdwarf-4 -Wall2025031020250307
28524429 0 118052 816 800amd64-ssse3clang -march=native -O2 -fwrapv -Qunused-arguments -fPIC -fPIE -gdwarf-4 -Wall2025031020250307
28544429 0 120444 816 816amd64-ssse3clang -march=native -O3 -fwrapv -Qunused-arguments -fPIC -fPIE -gdwarf-4 -Wall2025031020250307
28544644 0 419278 776 872amd64-ssse3gcc -march=native -mtune=native -O3 -fwrapv -fPIC -fPIE -gdwarf-4 -Wall2025031020250307
28934474 0 416145 752 840amd64-ssse3gcc -march=native -mtune=native -Os -fwrapv -fPIC -fPIE -gdwarf-4 -Wall2025031020250307
29214429 0 119164 816 800amd64-ssse3clang -mcpu=native -O3 -fwrapv -Qunused-arguments -fPIC -fPIE -gdwarf-4 -Wall2025031020250307
311317299 2368 01769814 146880 10232T:cryptoppg++ -march=native -mtune=native -O3 -fwrapv -fPIC -fPIE -gdwarf-4 -Wall2025031020250307
31134621 0 120620 816 816e/amd64-xmm6clang -march=native -O3 -fwrapv -Qunused-arguments -fPIC -fPIE -gdwarf-4 -Wall2025031020250307
31164621 0 118228 816 800e/amd64-xmm6clang -march=native -O2 -fwrapv -Qunused-arguments -fPIC -fPIE -gdwarf-4 -Wall2025031020250307
31184557 0 116502 808 792e/amd64-xmm6clang -march=native -Os -fwrapv -Qunused-arguments -fPIC -fPIE -gdwarf-4 -Wall2025031020250307
31184621 0 119340 816 800e/amd64-xmm6clang -mcpu=native -O3 -fwrapv -Qunused-arguments -fPIC -fPIE -gdwarf-4 -Wall2025031020250307
31214836 0 417894 776 872e/amd64-xmm6gcc -march=native -mtune=native -O2 -fwrapv -fPIC -fPIE -gdwarf-4 -Wall2025031020250307
31244621 0 116924 816 800e/amd64-xmm6clang -march=native -O -fwrapv -Qunused-arguments -fPIC -fPIE -gdwarf-4 -Wall2025031020250307
315417346 2368 01768476 146888 10232T:cryptoppg++ -march=native -mtune=native -O2 -fwrapv -fPIC -fPIE -gdwarf-4 -Wall2025031020250307
31824817 0 417573 768 872e/amd64-xmm6gcc -march=native -mtune=native -O -fwrapv -fPIC -fPIE -gdwarf-4 -Wall2025031020250307
32064666 0 416305 752 840e/amd64-xmm6gcc -march=native -mtune=native -Os -fwrapv -fPIC -fPIE -gdwarf-4 -Wall2025031020250307
32184836 0 419422 776 872e/amd64-xmm6gcc -march=native -mtune=native -O3 -fwrapv -fPIC -fPIE -gdwarf-4 -Wall2025031020250307
32368183 2880 01761439 147544 10200T:cryptoppg++ -march=native -mtune=native -Os -fwrapv -fPIC -fPIE -gdwarf-4 -Wall2025031020250307
329517221 2368 01767623 146888 10232T:cryptoppg++ -march=native -mtune=native -O -fwrapv -fPIC -fPIE -gdwarf-4 -Wall2025031020250307
62732688 0 116276 816 800e/amd64-3clang -march=native -O2 -fwrapv -Qunused-arguments -fPIC -fPIE -gdwarf-4 -Wall2025031020250307
62782688 0 118668 816 816e/amd64-3clang -march=native -O3 -fwrapv -Qunused-arguments -fPIC -fPIE -gdwarf-4 -Wall2025031020250307
63032733 0 414337 752 840e/amd64-3gcc -march=native -mtune=native -Os -fwrapv -fPIC -fPIE -gdwarf-4 -Wall2025031020250307
63122688 0 117388 816 800e/amd64-3clang -mcpu=native -O3 -fwrapv -Qunused-arguments -fPIC -fPIE -gdwarf-4 -Wall2025031020250307
63162882 0 415637 768 872e/amd64-3gcc -march=native -mtune=native -O -fwrapv -fPIC -fPIE -gdwarf-4 -Wall2025031020250307
63182901 0 417486 776 872e/amd64-3gcc -march=native -mtune=native -O3 -fwrapv -fPIC -fPIE -gdwarf-4 -Wall2025031020250307
63412688 0 114972 816 800e/amd64-3clang -march=native -O -fwrapv -Qunused-arguments -fPIC -fPIE -gdwarf-4 -Wall2025031020250307
63432628 0 114566 808 792e/amd64-3clang -march=native -Os -fwrapv -Qunused-arguments -fPIC -fPIE -gdwarf-4 -Wall2025031020250307
63532901 0 415958 776 872e/amd64-3gcc -march=native -mtune=native -O2 -fwrapv -fPIC -fPIE -gdwarf-4 -Wall2025031020250307
63732665 0 416118 776 872e/mergedgcc -march=native -mtune=native -O2 -fwrapv -fPIC -fPIE -gdwarf-4 -Wall2025031020250307
85032758 0 115052 816 800e/mergedclang -march=native -O -fwrapv -Qunused-arguments -fPIC -fPIE -gdwarf-4 -Wall2025031020250307
85472661 0 116244 816 800e/mergedclang -march=native -O2 -fwrapv -Qunused-arguments -fPIC -fPIE -gdwarf-4 -Wall2025031020250307
86333589 0 118300 816 800e/mergedclang -mcpu=native -O3 -fwrapv -Qunused-arguments -fPIC -fPIE -gdwarf-4 -Wall2025031020250307
87332176 0 114118 808 792e/mergedclang -march=native -Os -fwrapv -Qunused-arguments -fPIC -fPIE -gdwarf-4 -Wall2025031020250307
87673173 0 119148 816 816e/mergedclang -march=native -O3 -fwrapv -Qunused-arguments -fPIC -fPIE -gdwarf-4 -Wall2025031020250307
90063125 0 117836 816 800e/regsclang -mcpu=native -O3 -fwrapv -Qunused-arguments -fPIC -fPIE -gdwarf-4 -Wall2025031020250307
92812774 0 414753 752 840e/mergedgcc -march=native -mtune=native -Os -fwrapv -fPIC -fPIE -gdwarf-4 -Wall2025031020250307
93884108 0 417245 768 872e/mergedgcc -march=native -mtune=native -O -fwrapv -fPIC -fPIE -gdwarf-4 -Wall2025031020250307
95583125 0 117836 816 800e/refclang -mcpu=native -O3 -fwrapv -Qunused-arguments -fPIC -fPIE -gdwarf-4 -Wall2025031020250307
97874537 0 419518 776 872e/mergedgcc -march=native -mtune=native -O3 -fwrapv -fPIC -fPIE -gdwarf-4 -Wall2025031020250307
98512893 0 116476 816 800e/regsclang -march=native -O2 -fwrapv -Qunused-arguments -fPIC -fPIE -gdwarf-4 -Wall2025031020250307
98512893 0 118868 816 816e/regsclang -march=native -O3 -fwrapv -Qunused-arguments -fPIC -fPIE -gdwarf-4 -Wall2025031020250307
100602579 0 416038 776 872e/regsgcc -march=native -mtune=native -O2 -fwrapv -fPIC -fPIE -gdwarf-4 -Wall2025031020250307
100844131 0 419118 776 872e/refgcc -march=native -mtune=native -O3 -fwrapv -fPIC -fPIE -gdwarf-4 -Wall2025031020250307
101072893 0 118868 816 816e/refclang -march=native -O3 -fwrapv -Qunused-arguments -fPIC -fPIE -gdwarf-4 -Wall2025031020250307
104972221 0 115804 816 800e/refclang -march=native -O2 -fwrapv -Qunused-arguments -fPIC -fPIE -gdwarf-4 -Wall2025031020250307
106275468 0 420462 776 872e/regsgcc -march=native -mtune=native -O3 -fwrapv -fPIC -fPIE -gdwarf-4 -Wall2025031020250307
116102022 0 114316 816 800e/refclang -march=native -O -fwrapv -Qunused-arguments -fPIC -fPIE -gdwarf-4 -Wall2025031020250307
117372534 0 114828 816 800e/regsclang -march=native -O -fwrapv -Qunused-arguments -fPIC -fPIE -gdwarf-4 -Wall2025031020250307
129872407 0 114350 808 792e/regsclang -march=native -Os -fwrapv -Qunused-arguments -fPIC -fPIE -gdwarf-4 -Wall2025031020250307
136802906 0 416045 768 872e/refgcc -march=native -mtune=native -O -fwrapv -fPIC -fPIE -gdwarf-4 -Wall2025031020250307
137443644 0 416781 768 872e/regsgcc -march=native -mtune=native -O -fwrapv -fPIC -fPIE -gdwarf-4 -Wall2025031020250307
141912611 0 416070 776 872e/refgcc -march=native -mtune=native -O2 -fwrapv -fPIC -fPIE -gdwarf-4 -Wall2025031020250307
144212551 0 414529 752 840e/regsgcc -march=native -mtune=native -Os -fwrapv -fPIC -fPIE -gdwarf-4 -Wall2025031020250307
160322297 0 414265 752 840e/refgcc -march=native -mtune=native -Os -fwrapv -fPIC -fPIE -gdwarf-4 -Wall2025031020250307
226171811 0 113734 808 792e/refclang -march=native -Os -fwrapv -Qunused-arguments -fPIC -fPIE -gdwarf-4 -Wall2025031020250307

Test failure


error 139
timeout: the monitored command dumped core
Segmentation fault

Number of similar (implementation,compiler) pairs: 9, namely:
ImplementationCompiler
krovetz/vec128clang -march=native -O2 -fwrapv -Qunused-arguments -fPIC -fPIE -gdwarf-4 -Wall (Ubuntu_Clang_14.0.0)
krovetz/vec128clang -march=native -O3 -fwrapv -Qunused-arguments -fPIC -fPIE -gdwarf-4 -Wall (Ubuntu_Clang_14.0.0)
krovetz/vec128clang -march=native -O -fwrapv -Qunused-arguments -fPIC -fPIE -gdwarf-4 -Wall (Ubuntu_Clang_14.0.0)
krovetz/vec128clang -march=native -Os -fwrapv -Qunused-arguments -fPIC -fPIE -gdwarf-4 -Wall (Ubuntu_Clang_14.0.0)
krovetz/vec128clang -mcpu=native -O3 -fwrapv -Qunused-arguments -fPIC -fPIE -gdwarf-4 -Wall (Ubuntu_Clang_14.0.0)
krovetz/vec128gcc -march=native -mtune=native -O2 -fwrapv -fPIC -fPIE -gdwarf-4 -Wall (11.4.0)
krovetz/vec128gcc -march=native -mtune=native -O3 -fwrapv -fPIC -fPIE -gdwarf-4 -Wall (11.4.0)
krovetz/vec128gcc -march=native -mtune=native -O -fwrapv -fPIC -fPIE -gdwarf-4 -Wall (11.4.0)
krovetz/vec128gcc -march=native -mtune=native -Os -fwrapv -fPIC -fPIE -gdwarf-4 -Wall (11.4.0)

Test failure


error 132
timeout: the monitored command dumped core
Illegal instruction

Number of similar (implementation,compiler) pairs: 9, namely:
ImplementationCompiler
moon/avx2/64clang -march=native -O2 -fwrapv -Qunused-arguments -fPIC -fPIE -gdwarf-4 -Wall (Ubuntu_Clang_14.0.0)
moon/avx2/64clang -march=native -O3 -fwrapv -Qunused-arguments -fPIC -fPIE -gdwarf-4 -Wall (Ubuntu_Clang_14.0.0)
moon/avx2/64clang -march=native -O -fwrapv -Qunused-arguments -fPIC -fPIE -gdwarf-4 -Wall (Ubuntu_Clang_14.0.0)
moon/avx2/64clang -march=native -Os -fwrapv -Qunused-arguments -fPIC -fPIE -gdwarf-4 -Wall (Ubuntu_Clang_14.0.0)
moon/avx2/64clang -mcpu=native -O3 -fwrapv -Qunused-arguments -fPIC -fPIE -gdwarf-4 -Wall (Ubuntu_Clang_14.0.0)
moon/avx2/64gcc -march=native -mtune=native -O2 -fwrapv -fPIC -fPIE -gdwarf-4 -Wall (11.4.0)
moon/avx2/64gcc -march=native -mtune=native -O3 -fwrapv -fPIC -fPIE -gdwarf-4 -Wall (11.4.0)
moon/avx2/64gcc -march=native -mtune=native -O -fwrapv -fPIC -fPIE -gdwarf-4 -Wall (11.4.0)
moon/avx2/64gcc -march=native -mtune=native -Os -fwrapv -fPIC -fPIE -gdwarf-4 -Wall (11.4.0)

Compiler output


chacha.c: In file included from chacha.c:103:
chacha.c: ./u4.h:122:7: error: always_inline function '_mm_shuffle_epi8' requires target feature 'ssse3', but would be inlined into function 'crypto_stream_chacha8_dolbeau_amd64_avx2_constbranchindex_ECRYPT_encrypt_bytes' that is compiled without support for 'ssse3'
chacha.c:       VEC4_QUARTERROUND( 0, 4, 8,12);
chacha.c:       ^
chacha.c: ./u4.h:17:36: note: expanded from macro 'VEC4_QUARTERROUND'
chacha.c: #define VEC4_QUARTERROUND(a,b,c,d) VEC4_QUARTERROUND_SHUFFLE(a,b,c,d)
chacha.c:                                    ^
chacha.c: ./u4.h:12:86: note: expanded from macro 'VEC4_QUARTERROUND_SHUFFLE'
chacha.c:    x_##a = _mm_add_epi32(x_##a, x_##b); t_##a = _mm_xor_si128(x_##d, x_##a); x_##d = _mm_shuffle_epi8(t_##a, rot16); \
chacha.c:                                                                                      ^
chacha.c: ./u4.h:122:7: error: always_inline function '_mm_shuffle_epi8' requires target feature 'ssse3', but would be inlined into function 'crypto_stream_chacha8_dolbeau_amd64_avx2_constbranchindex_ECRYPT_encrypt_bytes' that is compiled without support for 'ssse3'
chacha.c: ./u4.h:17:36: note: expanded from macro 'VEC4_QUARTERROUND'
chacha.c: #define VEC4_QUARTERROUND(a,b,c,d) VEC4_QUARTERROUND_SHUFFLE(a,b,c,d)
chacha.c:                                    ^
chacha.c: ./u4.h:14:86: note: expanded from macro 'VEC4_QUARTERROUND_SHUFFLE'
chacha.c:    x_##a = _mm_add_epi32(x_##a, x_##b); t_##a = _mm_xor_si128(x_##d, x_##a); x_##d = _mm_shuffle_epi8(t_##a, rot8); \
chacha.c:                                                                                      ^
chacha.c: ./u4.h:123:7: error: always_inline function '_mm_shuffle_epi8' requires target feature 'ssse3', but would be inlined into function 'crypto_stream_chacha8_dolbeau_amd64_avx2_constbranchindex_ECRYPT_encrypt_bytes' that is compiled without support for 'ssse3'
chacha.c:       VEC4_QUARTERROUND( 1, 5, 9,13);
chacha.c:       ^
chacha.c: ./u4.h:17:36: note: expanded from macro 'VEC4_QUARTERROUND'
chacha.c: #define VEC4_QUARTERROUND(a,b,c,d) VEC4_QUARTERROUND_SHUFFLE(a,b,c,d)
chacha.c:                                    ^
chacha.c: ./u4.h:12:86: note: expanded from macro 'VEC4_QUARTERROUND_SHUFFLE'
chacha.c:    x_##a = _mm_add_epi32(x_##a, x_##b); t_##a = _mm_xor_si128(x_##d, x_##a); x_##d = _mm_shuffle_epi8(t_##a, rot16); \
chacha.c: ...

Number of similar (implementation,compiler) pairs: 1, namely:
ImplementationCompiler
dolbeau/amd64-avx2clang -mcpu=native -O3 -fwrapv -Qunused-arguments -fPIC -fPIE -gdwarf-4 -Wall (Ubuntu_Clang_14.0.0)

Compiler output


chacha.c: In file included from chacha.c:11:
chacha.c: /usr/lib/llvm-14/lib/clang/14.0.0/include/arm_neon.h:28:2: error: "NEON intrinsics not available with the soft-float ABI. Please use -mfloat-abi=softfp or -mfloat-abi=hard"
chacha.c: #error "NEON intrinsics not available with the soft-float ABI. Please use -mfloat-abi=softfp or -mfloat-abi=hard"
chacha.c:  ^
chacha.c: 1 error generated.

Number of similar (implementation,compiler) pairs: 5, namely:
ImplementationCompiler
dolbeau/mipsel-msaclang -march=native -O2 -fwrapv -Qunused-arguments -fPIC -fPIE -gdwarf-4 -Wall (Ubuntu_Clang_14.0.0)
dolbeau/mipsel-msaclang -march=native -O3 -fwrapv -Qunused-arguments -fPIC -fPIE -gdwarf-4 -Wall (Ubuntu_Clang_14.0.0)
dolbeau/mipsel-msaclang -march=native -O -fwrapv -Qunused-arguments -fPIC -fPIE -gdwarf-4 -Wall (Ubuntu_Clang_14.0.0)
dolbeau/mipsel-msaclang -march=native -Os -fwrapv -Qunused-arguments -fPIC -fPIE -gdwarf-4 -Wall (Ubuntu_Clang_14.0.0)
dolbeau/mipsel-msaclang -mcpu=native -O3 -fwrapv -Qunused-arguments -fPIC -fPIE -gdwarf-4 -Wall (Ubuntu_Clang_14.0.0)

Compiler output


chacha.c: chacha.c:11:10: fatal error: arm_neon.h: No such file or directory
chacha.c:    11 | #include <arm_neon.h>
chacha.c:       |          ^~~~~~~~~~~~
chacha.c: compilation terminated.

Number of similar (implementation,compiler) pairs: 4, namely:
ImplementationCompiler
dolbeau/mipsel-msagcc -march=native -mtune=native -O2 -fwrapv -fPIC -fPIE -gdwarf-4 -Wall (11.4.0)
dolbeau/mipsel-msagcc -march=native -mtune=native -O3 -fwrapv -fPIC -fPIE -gdwarf-4 -Wall (11.4.0)
dolbeau/mipsel-msagcc -march=native -mtune=native -O -fwrapv -fPIC -fPIE -gdwarf-4 -Wall (11.4.0)
dolbeau/mipsel-msagcc -march=native -mtune=native -Os -fwrapv -fPIC -fPIE -gdwarf-4 -Wall (11.4.0)

Compiler output


chacha.c: In file included from chacha.c:1:
chacha.c: e/chacha.c: In function 'crypto_stream_chacha8_e_merged_constbranchindex_ECRYPT_encrypt_bytes':
chacha.c: e/chacha.c:179:46: warning: 'ctarget' may be used uninitialized in this function [-Wmaybe-uninitialized]
chacha.c:   179 |         for (i = 0;i < bytes;++i) ctarget[i] = c[i];
chacha.c:       |                                   ~~~~~~~~~~~^~~~~~

Number of similar (implementation,compiler) pairs: 4, namely:
ImplementationCompiler
e/mergedgcc -march=native -mtune=native -O2 -fwrapv -fPIC -fPIE -gdwarf-4 -Wall (11.4.0)
e/mergedgcc -march=native -mtune=native -O3 -fwrapv -fPIC -fPIE -gdwarf-4 -Wall (11.4.0)
e/mergedgcc -march=native -mtune=native -O -fwrapv -fPIC -fPIE -gdwarf-4 -Wall (11.4.0)
e/mergedgcc -march=native -mtune=native -Os -fwrapv -fPIC -fPIE -gdwarf-4 -Wall (11.4.0)

Compiler output


stream.c: stream.c:126:2: error: -- Implementation supports only microarchitectures with support for Advanced Vector Extensions (AVX2 or AVX512).
stream.c: #error -- Implementation supports only microarchitectures with support for Advanced Vector Extensions (AVX2 or AVX512).
stream.c:  ^
stream.c: 1 error generated.

Number of similar (implementation,compiler) pairs: 5, namely:
ImplementationCompiler
goll_gueronclang -march=native -O2 -fwrapv -Qunused-arguments -fPIC -fPIE -gdwarf-4 -Wall (Ubuntu_Clang_14.0.0)
goll_gueronclang -march=native -O3 -fwrapv -Qunused-arguments -fPIC -fPIE -gdwarf-4 -Wall (Ubuntu_Clang_14.0.0)
goll_gueronclang -march=native -O -fwrapv -Qunused-arguments -fPIC -fPIE -gdwarf-4 -Wall (Ubuntu_Clang_14.0.0)
goll_gueronclang -march=native -Os -fwrapv -Qunused-arguments -fPIC -fPIE -gdwarf-4 -Wall (Ubuntu_Clang_14.0.0)
goll_gueronclang -mcpu=native -O3 -fwrapv -Qunused-arguments -fPIC -fPIE -gdwarf-4 -Wall (Ubuntu_Clang_14.0.0)

Compiler output


stream.c: stream.c:126:2: error: #error -- Implementation supports only microarchitectures with support for Advanced Vector Extensions (AVX2 or AVX512).
stream.c:   126 | #error -- Implementation supports only microarchitectures with support for Advanced Vector Extensions (AVX2 or AVX512).
stream.c:       |  ^~~~~

Number of similar (implementation,compiler) pairs: 4, namely:
ImplementationCompiler
goll_guerongcc -march=native -mtune=native -O2 -fwrapv -fPIC -fPIE -gdwarf-4 -Wall (11.4.0)
goll_guerongcc -march=native -mtune=native -O3 -fwrapv -fPIC -fPIE -gdwarf-4 -Wall (11.4.0)
goll_guerongcc -march=native -mtune=native -O -fwrapv -fPIC -fPIE -gdwarf-4 -Wall (11.4.0)
goll_guerongcc -march=native -mtune=native -Os -fwrapv -fPIC -fPIE -gdwarf-4 -Wall (11.4.0)

Compiler output


stream.c: stream.c:56:43: error: passing '__m128i *' to parameter of incompatible type '__m128i' (vector of 2 'long long' values); dereference with *
stream.c:     __m256i s0 = _mm_broadcastsi128_si256((__m128i *)sigma);
stream.c:                                           ^~~~~~~~~~~~~~~~
stream.c:                                           *
stream.c: /usr/lib/llvm-14/lib/clang/14.0.0/include/avx2intrin.h:743:65: note: expanded from macro '_mm_broadcastsi128_si256'
stream.c: #define _mm_broadcastsi128_si256(X) _mm256_broadcastsi128_si256(X)
stream.c:                                                                 ^
stream.c: /usr/lib/llvm-14/lib/clang/14.0.0/include/avx2intrin.h:738:37: note: passing argument to parameter '__X' here
stream.c: _mm256_broadcastsi128_si256(__m128i __X)
stream.c:                                     ^
stream.c: 1 error generated.

Number of similar (implementation,compiler) pairs: 5, namely:
ImplementationCompiler
krovetz/avx2clang -march=native -O2 -fwrapv -Qunused-arguments -fPIC -fPIE -gdwarf-4 -Wall (Ubuntu_Clang_14.0.0)
krovetz/avx2clang -march=native -O3 -fwrapv -Qunused-arguments -fPIC -fPIE -gdwarf-4 -Wall (Ubuntu_Clang_14.0.0)
krovetz/avx2clang -march=native -O -fwrapv -Qunused-arguments -fPIC -fPIE -gdwarf-4 -Wall (Ubuntu_Clang_14.0.0)
krovetz/avx2clang -march=native -Os -fwrapv -Qunused-arguments -fPIC -fPIE -gdwarf-4 -Wall (Ubuntu_Clang_14.0.0)
krovetz/avx2clang -mcpu=native -O3 -fwrapv -Qunused-arguments -fPIC -fPIE -gdwarf-4 -Wall (Ubuntu_Clang_14.0.0)

Compiler output


stream.c: In file included from /usr/lib/gcc/x86_64-linux-gnu/11/include/immintrin.h:47,
stream.c:                  from stream.c:8:
stream.c: stream.c: In function 'crypto_stream_chacha8_krovetz_avx2_constbranchindex_xor':
stream.c: /usr/lib/gcc/x86_64-linux-gnu/11/include/avx2intrin.h:574:1: error: inlining failed in call to 'always_inline' '_mm256_or_si256': target specific option mismatch
stream.c:   574 | _mm256_or_si256 (__m256i __A, __m256i __B)
stream.c:       | ^~~~~~~~~~~~~~~
stream.c: stream.c:63:18: note: called from here
stream.c:    63 |     __m256i s3 = _mm256_or_si256(
stream.c:       |                  ^~~~~~~~~~~~~~~~
stream.c:    64 |         _mm256_slli_si256(_mm256_broadcastq_epi64(*(__m128i *)n), 8),
stream.c:       |         ~~~~~~~~~~~~~~~~~~~~~~~~~~~~~~~~~~~~~~~~~~~~~~~~~~~~~~~~~~~~~
stream.c:    65 |         _mm256_set_epi32(0,0,0,1,0,0,0,0)
stream.c:       |         ~~~~~~~~~~~~~~~~~~~~~~~~~~~~~~~~~
stream.c:    66 |     );
stream.c:       |     ~
stream.c: In file included from /usr/lib/gcc/x86_64-linux-gnu/11/include/immintrin.h:47,
stream.c:                  from stream.c:8:
stream.c: /usr/lib/gcc/x86_64-linux-gnu/11/include/avx2intrin.h:655:1: error: inlining failed in call to 'always_inline' '_mm256_slli_si256': target specific option mismatch
stream.c:   655 | _mm256_slli_si256 (__m256i __A, const int __N)
stream.c:       | ^~~~~~~~~~~~~~~~~
stream.c: stream.c:63:18: note: called from here
stream.c:    63 |     __m256i s3 = _mm256_or_si256(
stream.c:       |                  ^~~~~~~~~~~~~~~~
stream.c:    64 |         _mm256_slli_si256(_mm256_broadcastq_epi64(*(__m128i *)n), 8),
stream.c:       |         ~~~~~~~~~~~~~~~~~~~~~~~~~~~~~~~~~~~~~~~~~~~~~~~~~~~~~~~~~~~~~
stream.c: ...

Number of similar (implementation,compiler) pairs: 4, namely:
ImplementationCompiler
krovetz/avx2gcc -march=native -mtune=native -O2 -fwrapv -fPIC -fPIE -gdwarf-4 -Wall (11.4.0)
krovetz/avx2gcc -march=native -mtune=native -O3 -fwrapv -fPIC -fPIE -gdwarf-4 -Wall (11.4.0)
krovetz/avx2gcc -march=native -mtune=native -O -fwrapv -fPIC -fPIE -gdwarf-4 -Wall (11.4.0)
krovetz/avx2gcc -march=native -mtune=native -Os -fwrapv -fPIC -fPIE -gdwarf-4 -Wall (11.4.0)

Compiler output


stream.c: stream.c:133:45: warning: unused variable 'key' [-Wunused-variable]
stream.c:     __attribute__ ((aligned (16))) unsigned key[8], nonce[2];
stream.c:                                             ^
stream.c: stream.c:133:53: warning: unused variable 'nonce' [-Wunused-variable]
stream.c:     __attribute__ ((aligned (16))) unsigned key[8], nonce[2];
stream.c:                                                     ^
stream.c: 2 warnings generated.

Number of similar (implementation,compiler) pairs: 5, namely:
ImplementationCompiler
krovetz/vec128clang -march=native -O2 -fwrapv -Qunused-arguments -fPIC -fPIE -gdwarf-4 -Wall (Ubuntu_Clang_14.0.0)
krovetz/vec128clang -march=native -O3 -fwrapv -Qunused-arguments -fPIC -fPIE -gdwarf-4 -Wall (Ubuntu_Clang_14.0.0)
krovetz/vec128clang -march=native -O -fwrapv -Qunused-arguments -fPIC -fPIE -gdwarf-4 -Wall (Ubuntu_Clang_14.0.0)
krovetz/vec128clang -march=native -Os -fwrapv -Qunused-arguments -fPIC -fPIE -gdwarf-4 -Wall (Ubuntu_Clang_14.0.0)
krovetz/vec128clang -mcpu=native -O3 -fwrapv -Qunused-arguments -fPIC -fPIE -gdwarf-4 -Wall (Ubuntu_Clang_14.0.0)

Compiler output


stream.c: stream.c: In function 'crypto_stream_chacha8_krovetz_vec128_constbranchindex_xor':
stream.c: stream.c:133:53: warning: unused variable 'nonce' [-Wunused-variable]
stream.c:   133 |     __attribute__ ((aligned (16))) unsigned key[8], nonce[2];
stream.c:       |                                                     ^~~~~
stream.c: stream.c:133:45: warning: unused variable 'key' [-Wunused-variable]
stream.c:   133 |     __attribute__ ((aligned (16))) unsigned key[8], nonce[2];
stream.c:       |                                             ^~~

Number of similar (implementation,compiler) pairs: 4, namely:
ImplementationCompiler
krovetz/vec128gcc -march=native -mtune=native -O2 -fwrapv -fPIC -fPIE -gdwarf-4 -Wall (11.4.0)
krovetz/vec128gcc -march=native -mtune=native -O3 -fwrapv -fPIC -fPIE -gdwarf-4 -Wall (11.4.0)
krovetz/vec128gcc -march=native -mtune=native -O -fwrapv -fPIC -fPIE -gdwarf-4 -Wall (11.4.0)
krovetz/vec128gcc -march=native -mtune=native -Os -fwrapv -fPIC -fPIE -gdwarf-4 -Wall (11.4.0)

TIMECOP error (can be valgrind bug)


error 132

Process terminating with default action of signal 4 (SIGILL)
 Illegal opcode at address 0x10A44D
   at 0x...: salsa20.part.0 (try-anything.c:102)
   by 0x...: salsa20 (try-anything.c:85)
   by 0x...: testvector (try-anything.c:124)
   by 0x...: myrandom (try-anything.c:132)
   by 0x...: test (try.c:114)
   by 0x...: main (try-anything.c:345)
timeout: the monitored command dumped core
Illegal instruction

Number of similar (implementation,compiler) pairs: 3, namely:
ImplementationCompiler
amd64-ssse3gcc -march=native -mtune=native -O2 -fwrapv -fPIC -fPIE -gdwarf-4 -Wall (11.4.0)
e/amd64-3gcc -march=native -mtune=native -O2 -fwrapv -fPIC -fPIE -gdwarf-4 -Wall (11.4.0)
e/amd64-xmm6gcc -march=native -mtune=native -O2 -fwrapv -fPIC -fPIE -gdwarf-4 -Wall (11.4.0)

TIMECOP error (can be valgrind bug)


error 132

Process terminating with default action of signal 4 (SIGILL)
 Illegal opcode at address 0x10A0EA
   at 0x...: core (try-anything.c:53)
   by 0x...: salsa20 (try-anything.c:101)
   by 0x...: salsa20 (try-anything.c:81)
   by 0x...: testvector (try-anything.c:124)
   by 0x...: myrandom (try-anything.c:132)
   by 0x...: test (try.c:114)
   by 0x...: main (try-anything.c:345)
timeout: the monitored command dumped core
Illegal instruction

Number of similar (implementation,compiler) pairs: 3, namely:
ImplementationCompiler
amd64-ssse3gcc -march=native -mtune=native -O3 -fwrapv -fPIC -fPIE -gdwarf-4 -Wall (11.4.0)
e/amd64-3gcc -march=native -mtune=native -O3 -fwrapv -fPIC -fPIE -gdwarf-4 -Wall (11.4.0)
e/amd64-xmm6gcc -march=native -mtune=native -O3 -fwrapv -fPIC -fPIE -gdwarf-4 -Wall (11.4.0)

TIMECOP error (can be valgrind bug)


error 132

Process terminating with default action of signal 4 (SIGILL)
 Illegal opcode at address 0x10B1BC
   at 0x...: crypto_stream_chacha8_dolbeau_amd64_avx2_constbranchindex_ECRYPT_encrypt_bytes (u4.h:122)
   by 0x...: crypto_stream_chacha8_dolbeau_amd64_avx2_constbranchindex (include/estream-convert-api.h:83)
   by 0x...: test (try.c:123)
   by 0x...: main (try-anything.c:345)
timeout: the monitored command dumped core
Illegal instruction

Number of similar (implementation,compiler) pairs: 1, namely:
ImplementationCompiler
dolbeau/amd64-avx2clang -march=native -O2 -fwrapv -Qunused-arguments -fPIC -fPIE -gdwarf-4 -Wall (Ubuntu_Clang_14.0.0)

TIMECOP error (can be valgrind bug)


error 132

Process terminating with default action of signal 4 (SIGILL)
 Illegal opcode at address 0x10B24C
   at 0x...: crypto_stream_chacha8_dolbeau_amd64_avx2_constbranchindex_ECRYPT_encrypt_bytes (u4.h:122)
   by 0x...: crypto_stream_chacha8_dolbeau_amd64_avx2_constbranchindex (include/estream-convert-api.h:83)
   by 0x...: test (try.c:123)
   by 0x...: main (try-anything.c:345)
timeout: the monitored command dumped core
Illegal instruction

Number of similar (implementation,compiler) pairs: 1, namely:
ImplementationCompiler
dolbeau/amd64-avx2clang -march=native -O3 -fwrapv -Qunused-arguments -fPIC -fPIE -gdwarf-4 -Wall (Ubuntu_Clang_14.0.0)

TIMECOP error (can be valgrind bug)


error 132

Process terminating with default action of signal 4 (SIGILL)
 Illegal opcode at address 0x10AD29
   at 0x...: crypto_stream_chacha8_dolbeau_amd64_avx2_constbranchindex_ECRYPT_encrypt_bytes (u4.h:122)
   by 0x...: crypto_stream_chacha8_dolbeau_amd64_avx2_constbranchindex_ECRYPT_keystream_bytes (chacha.c:138)
   by 0x...: crypto_stream_chacha8_dolbeau_amd64_avx2_constbranchindex (include/estream-convert-api.h:83)
   by 0x...: test (try.c:123)
   by 0x...: main (try-anything.c:345)
timeout: the monitored command dumped core
Illegal instruction

Number of similar (implementation,compiler) pairs: 1, namely:
ImplementationCompiler
dolbeau/amd64-avx2clang -march=native -O -fwrapv -Qunused-arguments -fPIC -fPIE -gdwarf-4 -Wall (Ubuntu_Clang_14.0.0)

TIMECOP error (can be valgrind bug)


error 132

Process terminating with default action of signal 4 (SIGILL)
 Illegal opcode at address 0x10AA57
   at 0x...: crypto_stream_chacha8_dolbeau_amd64_avx2_constbranchindex_ECRYPT_encrypt_bytes (u4.h:122)
   by 0x...: crypto_stream_chacha8_dolbeau_amd64_avx2_constbranchindex (include/estream-convert-api.h:83)
   by 0x...: test (try.c:123)
   by 0x...: main (try-anything.c:345)
timeout: the monitored command dumped core
Illegal instruction

Number of similar (implementation,compiler) pairs: 1, namely:
ImplementationCompiler
dolbeau/amd64-avx2clang -march=native -Os -fwrapv -Qunused-arguments -fPIC -fPIE -gdwarf-4 -Wall (Ubuntu_Clang_14.0.0)

TIMECOP error (can be valgrind bug)


error 132

Process terminating with default action of signal 4 (SIGILL)
 Illegal opcode at address 0x10A5AD
   at 0x...: salsa20.part.0 (try-anything.c:102)
   by 0x...: salsa20 (try-anything.c:85)
   by 0x...: testvector (try-anything.c:124)
   by 0x...: myrandom (try-anything.c:132)
   by 0x...: test (try.c:114)
   by 0x...: main (try-anything.c:345)
timeout: the monitored command dumped core
Illegal instruction

Number of similar (implementation,compiler) pairs: 4, namely:
ImplementationCompiler
dolbeau/amd64-avx2gcc -march=native -mtune=native -O2 -fwrapv -fPIC -fPIE -gdwarf-4 -Wall (11.4.0)
e/mergedgcc -march=native -mtune=native -O2 -fwrapv -fPIC -fPIE -gdwarf-4 -Wall (11.4.0)
e/refgcc -march=native -mtune=native -O2 -fwrapv -fPIC -fPIE -gdwarf-4 -Wall (11.4.0)
e/regsgcc -march=native -mtune=native -O2 -fwrapv -fPIC -fPIE -gdwarf-4 -Wall (11.4.0)

TIMECOP error (can be valgrind bug)


error 132

Process terminating with default action of signal 4 (SIGILL)
 Illegal opcode at address 0x10A24A
   at 0x...: core (try-anything.c:53)
   by 0x...: salsa20 (try-anything.c:101)
   by 0x...: salsa20 (try-anything.c:81)
   by 0x...: testvector (try-anything.c:124)
   by 0x...: myrandom (try-anything.c:132)
   by 0x...: test (try.c:114)
   by 0x...: main (try-anything.c:345)
timeout: the monitored command dumped core
Illegal instruction

Number of similar (implementation,compiler) pairs: 4, namely:
ImplementationCompiler
dolbeau/amd64-avx2gcc -march=native -mtune=native -O3 -fwrapv -fPIC -fPIE -gdwarf-4 -Wall (11.4.0)
e/mergedgcc -march=native -mtune=native -O3 -fwrapv -fPIC -fPIE -gdwarf-4 -Wall (11.4.0)
e/refgcc -march=native -mtune=native -O3 -fwrapv -fPIC -fPIE -gdwarf-4 -Wall (11.4.0)
e/regsgcc -march=native -mtune=native -O3 -fwrapv -fPIC -fPIE -gdwarf-4 -Wall (11.4.0)

TIMECOP error (can be valgrind bug)


error 132

Process terminating with default action of signal 4 (SIGILL)
 Illegal opcode at address 0x10B1F5
   at 0x...: crypto_stream_chacha8_e_merged_constbranchindex_ECRYPT_encrypt_bytes (chacha.c:112)
   by 0x...: crypto_stream_chacha8_e_merged_constbranchindex (include/estream-convert-api.h:83)
   by 0x...: test (try.c:123)
   by 0x...: main (try-anything.c:345)
timeout: the monitored command dumped core
Illegal instruction

Number of similar (implementation,compiler) pairs: 1, namely:
ImplementationCompiler
e/mergedclang -march=native -O2 -fwrapv -Qunused-arguments -fPIC -fPIE -gdwarf-4 -Wall (Ubuntu_Clang_14.0.0)

TIMECOP error (can be valgrind bug)


error 132

Process terminating with default action of signal 4 (SIGILL)
 Illegal opcode at address 0x10B297
   at 0x...: crypto_stream_chacha8_e_merged_constbranchindex_ECRYPT_encrypt_bytes (chacha.c:112)
   by 0x...: crypto_stream_chacha8_e_merged_constbranchindex (include/estream-convert-api.h:83)
   by 0x...: test (try.c:123)
   by 0x...: main (try-anything.c:345)
timeout: the monitored command dumped core
Illegal instruction

Number of similar (implementation,compiler) pairs: 1, namely:
ImplementationCompiler
e/mergedclang -march=native -O3 -fwrapv -Qunused-arguments -fPIC -fPIE -gdwarf-4 -Wall (Ubuntu_Clang_14.0.0)

TIMECOP error (can be valgrind bug)


error 132

Process terminating with default action of signal 4 (SIGILL)
 Illegal opcode at address 0x10A9A8
   at 0x...: crypto_stream_chacha8_e_merged_constbranchindex_ECRYPT_encrypt_bytes (chacha.c:112)
   by 0x...: crypto_stream_chacha8_e_merged_constbranchindex (include/estream-convert-api.h:83)
   by 0x...: test (try.c:123)
   by 0x...: main (try-anything.c:345)
timeout: the monitored command dumped core
Illegal instruction

Number of similar (implementation,compiler) pairs: 1, namely:
ImplementationCompiler
e/mergedclang -march=native -Os -fwrapv -Qunused-arguments -fPIC -fPIE -gdwarf-4 -Wall (Ubuntu_Clang_14.0.0)

TIMECOP error (can be valgrind bug)


error 132

Process terminating with default action of signal 4 (SIGILL)
 Illegal opcode at address 0x10B0E1
   at 0x...: salsa20_wordtobyte (chacha.c:30)
   by 0x...: crypto_stream_chacha8_e_ref_constbranchindex_ECRYPT_encrypt_bytes (chacha.c:87)
   by 0x...: crypto_stream_chacha8_e_ref_constbranchindex (include/estream-convert-api.h:83)
   by 0x...: test (try.c:123)
   by 0x...: main (try-anything.c:345)
timeout: the monitored command dumped core
Illegal instruction

Number of similar (implementation,compiler) pairs: 1, namely:
ImplementationCompiler
e/refclang -march=native -O2 -fwrapv -Qunused-arguments -fPIC -fPIE -gdwarf-4 -Wall (Ubuntu_Clang_14.0.0)

TIMECOP error (can be valgrind bug)


error 132

Process terminating with default action of signal 4 (SIGILL)
 Illegal opcode at address 0x10A979
   at 0x...: salsa20_wordtobyte (chacha.c:27)
   by 0x...: crypto_stream_chacha8_e_ref_constbranchindex_ECRYPT_encrypt_bytes (chacha.c:87)
   by 0x...: crypto_stream_chacha8_e_ref_constbranchindex (include/estream-convert-api.h:83)
   by 0x...: test (try.c:123)
   by 0x...: main (try-anything.c:345)
timeout: the monitored command dumped core
Illegal instruction

Number of similar (implementation,compiler) pairs: 1, namely:
ImplementationCompiler
e/refclang -march=native -Os -fwrapv -Qunused-arguments -fPIC -fPIE -gdwarf-4 -Wall (Ubuntu_Clang_14.0.0)

TIMECOP error (can be valgrind bug)


error 132

Process terminating with default action of signal 4 (SIGILL)
 Illegal opcode at address 0x10A46D
   at 0x...: salsa20.part.0 (try-anything.c:102)
   by 0x...: salsa20 (try-anything.c:85)
   by 0x...: testvector (try-anything.c:124)
   by 0x...: myrandom (try-anything.c:132)
   by 0x...: test (try.c:114)
   by 0x...: main (try-anything.c:345)
timeout: the monitored command dumped core
Illegal instruction

Number of similar (implementation,compiler) pairs: 4, namely:
ImplementationCompiler
moon/avx/64gcc -march=native -mtune=native -O2 -fwrapv -fPIC -fPIE -gdwarf-4 -Wall (11.4.0)
moon/sse2/64gcc -march=native -mtune=native -O2 -fwrapv -fPIC -fPIE -gdwarf-4 -Wall (11.4.0)
moon/ssse3/64gcc -march=native -mtune=native -O2 -fwrapv -fPIC -fPIE -gdwarf-4 -Wall (11.4.0)
moon/xop/64gcc -march=native -mtune=native -O2 -fwrapv -fPIC -fPIE -gdwarf-4 -Wall (11.4.0)

TIMECOP error (can be valgrind bug)


error 132

Process terminating with default action of signal 4 (SIGILL)
 Illegal opcode at address 0x10A10A
   at 0x...: core (try-anything.c:53)
   by 0x...: salsa20 (try-anything.c:101)
   by 0x...: salsa20 (try-anything.c:81)
   by 0x...: testvector (try-anything.c:124)
   by 0x...: myrandom (try-anything.c:132)
   by 0x...: test (try.c:114)
   by 0x...: main (try-anything.c:345)
timeout: the monitored command dumped core
Illegal instruction

Number of similar (implementation,compiler) pairs: 4, namely:
ImplementationCompiler
moon/avx/64gcc -march=native -mtune=native -O3 -fwrapv -fPIC -fPIE -gdwarf-4 -Wall (11.4.0)
moon/sse2/64gcc -march=native -mtune=native -O3 -fwrapv -fPIC -fPIE -gdwarf-4 -Wall (11.4.0)
moon/ssse3/64gcc -march=native -mtune=native -O3 -fwrapv -fPIC -fPIE -gdwarf-4 -Wall (11.4.0)
moon/xop/64gcc -march=native -mtune=native -O3 -fwrapv -fPIC -fPIE -gdwarf-4 -Wall (11.4.0)

TIMECOP error (can be valgrind bug)


error 132

Process terminating with default action of signal 4 (SIGILL)
 Illegal opcode at address 0x10B0A1
   at 0x...: crypto_stream_chacha8_moon_xop_64_constbranchindex_blocks_xop (chacha.S:101)
   by 0x...: ???
   by 0x...: crypto_stream_chacha8_moon_xop_64_constbranchindex (crypto_stream.c:14)
   by 0x...: test (try.c:123)
   by 0x...: main (try-anything.c:345)
timeout: the monitored command dumped core
Illegal instruction

Number of similar (implementation,compiler) pairs: 1, namely:
ImplementationCompiler
moon/xop/64clang -march=native -O2 -fwrapv -Qunused-arguments -fPIC -fPIE -gdwarf-4 -Wall (Ubuntu_Clang_14.0.0)

TIMECOP error (can be valgrind bug)


error 132

Process terminating with default action of signal 4 (SIGILL)
 Illegal opcode at address 0x10B121
   at 0x...: crypto_stream_chacha8_moon_xop_64_constbranchindex_blocks_xop (chacha.S:101)
   by 0x...: ???
   by 0x...: crypto_stream_chacha8_moon_xop_64_constbranchindex (crypto_stream.c:14)
   by 0x...: test (try.c:123)
   by 0x...: main (try-anything.c:345)
timeout: the monitored command dumped core
Illegal instruction

Number of similar (implementation,compiler) pairs: 1, namely:
ImplementationCompiler
moon/xop/64clang -march=native -O3 -fwrapv -Qunused-arguments -fPIC -fPIE -gdwarf-4 -Wall (Ubuntu_Clang_14.0.0)

TIMECOP error (can be valgrind bug)


error 132

Process terminating with default action of signal 4 (SIGILL)
 Illegal opcode at address 0x10AC21
   at 0x...: crypto_stream_chacha8_moon_xop_64_constbranchindex_blocks_xop (chacha.S:101)
   by 0x...: ???
   by 0x...: crypto_stream_chacha8_moon_xop_64_constbranchindex (crypto_stream.c:14)
   by 0x...: test (try.c:123)
   by 0x...: main (try-anything.c:345)
timeout: the monitored command dumped core
Illegal instruction

Number of similar (implementation,compiler) pairs: 1, namely:
ImplementationCompiler
moon/xop/64clang -march=native -O -fwrapv -Qunused-arguments -fPIC -fPIE -gdwarf-4 -Wall (Ubuntu_Clang_14.0.0)

TIMECOP error (can be valgrind bug)


error 132

Process terminating with default action of signal 4 (SIGILL)
 Illegal opcode at address 0x10A9A1
   at 0x...: crypto_stream_chacha8_moon_xop_64_constbranchindex_blocks_xop (chacha.S:101)
timeout: the monitored command dumped core
Illegal instruction

Number of similar (implementation,compiler) pairs: 1, namely:
ImplementationCompiler
moon/xop/64clang -march=native -Os -fwrapv -Qunused-arguments -fPIC -fPIE -gdwarf-4 -Wall (Ubuntu_Clang_14.0.0)

TIMECOP error (can be valgrind bug)


error 132

Process terminating with default action of signal 4 (SIGILL)
 Illegal opcode at address 0x10B261
   at 0x...: crypto_stream_chacha8_moon_xop_64_constbranchindex_blocks_xop (chacha.S:101)
   by 0x...: ???
   by 0x...: crypto_stream_chacha8_moon_xop_64_constbranchindex (crypto_stream.c:14)
   by 0x...: test (try.c:123)
   by 0x...: main (try-anything.c:345)
timeout: the monitored command dumped core
Illegal instruction

Number of similar (implementation,compiler) pairs: 1, namely:
ImplementationCompiler
moon/xop/64clang -mcpu=native -O3 -fwrapv -Qunused-arguments -fPIC -fPIE -gdwarf-4 -Wall (Ubuntu_Clang_14.0.0)

TIMECOP error (can be valgrind bug)


error 132

Process terminating with default action of signal 4 (SIGILL)
 Illegal opcode at address 0x10AD61
   at 0x...: crypto_stream_chacha8_moon_xop_64_constbranchindex_blocks_xop (chacha.S:101)
timeout: the monitored command dumped core
Illegal instruction

Number of similar (implementation,compiler) pairs: 1, namely:
ImplementationCompiler
moon/xop/64gcc -march=native -mtune=native -O -fwrapv -fPIC -fPIE -gdwarf-4 -Wall (11.4.0)

TIMECOP error (can be valgrind bug)


error 132

Process terminating with default action of signal 4 (SIGILL)
 Illegal opcode at address 0x10A9E1
   at 0x...: crypto_stream_chacha8_moon_xop_64_constbranchindex_blocks_xop (chacha.S:101)
timeout: the monitored command dumped core
Illegal instruction

Number of similar (implementation,compiler) pairs: 1, namely:
ImplementationCompiler
moon/xop/64gcc -march=native -mtune=native -Os -fwrapv -fPIC -fPIE -gdwarf-4 -Wall (11.4.0)

Passed TIMECOP


TIMECOP iterations: 10

Number of similar (implementation,compiler) pairs: 60, namely:
ImplementationCompiler
amd64-ssse3clang -march=native -O2 -fwrapv -Qunused-arguments -fPIC -fPIE -gdwarf-4 -Wall (Ubuntu_Clang_14.0.0)
amd64-ssse3clang -march=native -O3 -fwrapv -Qunused-arguments -fPIC -fPIE -gdwarf-4 -Wall (Ubuntu_Clang_14.0.0)
amd64-ssse3clang -march=native -O -fwrapv -Qunused-arguments -fPIC -fPIE -gdwarf-4 -Wall (Ubuntu_Clang_14.0.0)
amd64-ssse3clang -march=native -Os -fwrapv -Qunused-arguments -fPIC -fPIE -gdwarf-4 -Wall (Ubuntu_Clang_14.0.0)
amd64-ssse3clang -mcpu=native -O3 -fwrapv -Qunused-arguments -fPIC -fPIE -gdwarf-4 -Wall (Ubuntu_Clang_14.0.0)
amd64-ssse3gcc -march=native -mtune=native -O -fwrapv -fPIC -fPIE -gdwarf-4 -Wall (11.4.0)
amd64-ssse3gcc -march=native -mtune=native -Os -fwrapv -fPIC -fPIE -gdwarf-4 -Wall (11.4.0)
dolbeau/amd64-avx2gcc -march=native -mtune=native -O -fwrapv -fPIC -fPIE -gdwarf-4 -Wall (11.4.0)
dolbeau/amd64-avx2gcc -march=native -mtune=native -Os -fwrapv -fPIC -fPIE -gdwarf-4 -Wall (11.4.0)
e/amd64-3clang -march=native -O2 -fwrapv -Qunused-arguments -fPIC -fPIE -gdwarf-4 -Wall (Ubuntu_Clang_14.0.0)
e/amd64-3clang -march=native -O3 -fwrapv -Qunused-arguments -fPIC -fPIE -gdwarf-4 -Wall (Ubuntu_Clang_14.0.0)
e/amd64-3clang -march=native -O -fwrapv -Qunused-arguments -fPIC -fPIE -gdwarf-4 -Wall (Ubuntu_Clang_14.0.0)
e/amd64-3clang -march=native -Os -fwrapv -Qunused-arguments -fPIC -fPIE -gdwarf-4 -Wall (Ubuntu_Clang_14.0.0)
e/amd64-3clang -mcpu=native -O3 -fwrapv -Qunused-arguments -fPIC -fPIE -gdwarf-4 -Wall (Ubuntu_Clang_14.0.0)
e/amd64-3gcc -march=native -mtune=native -O -fwrapv -fPIC -fPIE -gdwarf-4 -Wall (11.4.0)
e/amd64-3gcc -march=native -mtune=native -Os -fwrapv -fPIC -fPIE -gdwarf-4 -Wall (11.4.0)
e/amd64-xmm6clang -march=native -O2 -fwrapv -Qunused-arguments -fPIC -fPIE -gdwarf-4 -Wall (Ubuntu_Clang_14.0.0)
e/amd64-xmm6clang -march=native -O3 -fwrapv -Qunused-arguments -fPIC -fPIE -gdwarf-4 -Wall (Ubuntu_Clang_14.0.0)
e/amd64-xmm6clang -march=native -O -fwrapv -Qunused-arguments -fPIC -fPIE -gdwarf-4 -Wall (Ubuntu_Clang_14.0.0)
e/amd64-xmm6clang -march=native -Os -fwrapv -Qunused-arguments -fPIC -fPIE -gdwarf-4 -Wall (Ubuntu_Clang_14.0.0)
e/amd64-xmm6clang -mcpu=native -O3 -fwrapv -Qunused-arguments -fPIC -fPIE -gdwarf-4 -Wall (Ubuntu_Clang_14.0.0)
e/amd64-xmm6gcc -march=native -mtune=native -O -fwrapv -fPIC -fPIE -gdwarf-4 -Wall (11.4.0)
e/amd64-xmm6gcc -march=native -mtune=native -Os -fwrapv -fPIC -fPIE -gdwarf-4 -Wall (11.4.0)
e/mergedclang -march=native -O -fwrapv -Qunused-arguments -fPIC -fPIE -gdwarf-4 -Wall (Ubuntu_Clang_14.0.0)
e/mergedclang -mcpu=native -O3 -fwrapv -Qunused-arguments -fPIC -fPIE -gdwarf-4 -Wall (Ubuntu_Clang_14.0.0)
e/mergedgcc -march=native -mtune=native -O -fwrapv -fPIC -fPIE -gdwarf-4 -Wall (11.4.0)
e/mergedgcc -march=native -mtune=native -Os -fwrapv -fPIC -fPIE -gdwarf-4 -Wall (11.4.0)
e/refclang -march=native -O3 -fwrapv -Qunused-arguments -fPIC -fPIE -gdwarf-4 -Wall (Ubuntu_Clang_14.0.0)
e/refclang -march=native -O -fwrapv -Qunused-arguments -fPIC -fPIE -gdwarf-4 -Wall (Ubuntu_Clang_14.0.0)
e/refclang -mcpu=native -O3 -fwrapv -Qunused-arguments -fPIC -fPIE -gdwarf-4 -Wall (Ubuntu_Clang_14.0.0)
e/refgcc -march=native -mtune=native -O -fwrapv -fPIC -fPIE -gdwarf-4 -Wall (11.4.0)
e/refgcc -march=native -mtune=native -Os -fwrapv -fPIC -fPIE -gdwarf-4 -Wall (11.4.0)
e/regsclang -march=native -O2 -fwrapv -Qunused-arguments -fPIC -fPIE -gdwarf-4 -Wall (Ubuntu_Clang_14.0.0)
e/regsclang -march=native -O3 -fwrapv -Qunused-arguments -fPIC -fPIE -gdwarf-4 -Wall (Ubuntu_Clang_14.0.0)
e/regsclang -march=native -O -fwrapv -Qunused-arguments -fPIC -fPIE -gdwarf-4 -Wall (Ubuntu_Clang_14.0.0)
e/regsclang -march=native -Os -fwrapv -Qunused-arguments -fPIC -fPIE -gdwarf-4 -Wall (Ubuntu_Clang_14.0.0)
e/regsclang -mcpu=native -O3 -fwrapv -Qunused-arguments -fPIC -fPIE -gdwarf-4 -Wall (Ubuntu_Clang_14.0.0)
e/regsgcc -march=native -mtune=native -O -fwrapv -fPIC -fPIE -gdwarf-4 -Wall (11.4.0)
e/regsgcc -march=native -mtune=native -Os -fwrapv -fPIC -fPIE -gdwarf-4 -Wall (11.4.0)
moon/avx/64clang -march=native -O2 -fwrapv -Qunused-arguments -fPIC -fPIE -gdwarf-4 -Wall (Ubuntu_Clang_14.0.0)
moon/avx/64clang -march=native -O3 -fwrapv -Qunused-arguments -fPIC -fPIE -gdwarf-4 -Wall (Ubuntu_Clang_14.0.0)
moon/avx/64clang -march=native -O -fwrapv -Qunused-arguments -fPIC -fPIE -gdwarf-4 -Wall (Ubuntu_Clang_14.0.0)
moon/avx/64clang -march=native -Os -fwrapv -Qunused-arguments -fPIC -fPIE -gdwarf-4 -Wall (Ubuntu_Clang_14.0.0)
moon/avx/64clang -mcpu=native -O3 -fwrapv -Qunused-arguments -fPIC -fPIE -gdwarf-4 -Wall (Ubuntu_Clang_14.0.0)
moon/avx/64gcc -march=native -mtune=native -O -fwrapv -fPIC -fPIE -gdwarf-4 -Wall (11.4.0)
moon/avx/64gcc -march=native -mtune=native -Os -fwrapv -fPIC -fPIE -gdwarf-4 -Wall (11.4.0)
moon/sse2/64clang -march=native -O2 -fwrapv -Qunused-arguments -fPIC -fPIE -gdwarf-4 -Wall (Ubuntu_Clang_14.0.0)
moon/sse2/64clang -march=native -O3 -fwrapv -Qunused-arguments -fPIC -fPIE -gdwarf-4 -Wall (Ubuntu_Clang_14.0.0)
moon/sse2/64clang -march=native -O -fwrapv -Qunused-arguments -fPIC -fPIE -gdwarf-4 -Wall (Ubuntu_Clang_14.0.0)
moon/sse2/64clang -march=native -Os -fwrapv -Qunused-arguments -fPIC -fPIE -gdwarf-4 -Wall (Ubuntu_Clang_14.0.0)
moon/sse2/64clang -mcpu=native -O3 -fwrapv -Qunused-arguments -fPIC -fPIE -gdwarf-4 -Wall (Ubuntu_Clang_14.0.0)
moon/sse2/64gcc -march=native -mtune=native -O -fwrapv -fPIC -fPIE -gdwarf-4 -Wall (11.4.0)
moon/sse2/64gcc -march=native -mtune=native -Os -fwrapv -fPIC -fPIE -gdwarf-4 -Wall (11.4.0)
moon/ssse3/64clang -march=native -O2 -fwrapv -Qunused-arguments -fPIC -fPIE -gdwarf-4 -Wall (Ubuntu_Clang_14.0.0)
moon/ssse3/64clang -march=native -O3 -fwrapv -Qunused-arguments -fPIC -fPIE -gdwarf-4 -Wall (Ubuntu_Clang_14.0.0)
moon/ssse3/64clang -march=native -O -fwrapv -Qunused-arguments -fPIC -fPIE -gdwarf-4 -Wall (Ubuntu_Clang_14.0.0)
moon/ssse3/64clang -march=native -Os -fwrapv -Qunused-arguments -fPIC -fPIE -gdwarf-4 -Wall (Ubuntu_Clang_14.0.0)
moon/ssse3/64clang -mcpu=native -O3 -fwrapv -Qunused-arguments -fPIC -fPIE -gdwarf-4 -Wall (Ubuntu_Clang_14.0.0)
moon/ssse3/64gcc -march=native -mtune=native -O -fwrapv -fPIC -fPIE -gdwarf-4 -Wall (11.4.0)
moon/ssse3/64gcc -march=native -mtune=native -Os -fwrapv -fPIC -fPIE -gdwarf-4 -Wall (11.4.0)