Test results for amd64, panther, crypto_hash/sha256

[Page version: 20250315 02:02:15]

Measurements for amd64, panther, crypto_hash Test results for amd64, panther, crypto_hash Test results for crypto_hash/sha256
Computer: panther
Microarchitecture: amd64; Tiger Lake (806c1)
Architecture: amd64
CPU ID: GenuineIntel-000806c1-00-bfebfbff
SUPERCOP version: 20250307
Operation: crypto_hash
Primitive: sha256
TimeObject sizeTest sizeImplementationCompilerBenchmark dateSUPERCOP version
3589933 0 015024 780 952refgcc -march=native -mtune=native -O3 -fwrapv -fPIC -fPIE -gdwarf-4 -Wall2025030820250307
3590707 0 014549 828 888refclang -mcpu=native -O3 -fwrapv -Qunused-arguments -fPIC -fPIE -gdwarf-4 -Wall2025030820250307
3591574 0 014997 828 920refclang -march=native -O2 -fwrapv -Qunused-arguments -fPIC -fPIE -gdwarf-4 -Wall2025030820250307
3592577 0 011875 820 888refclang -march=native -Os -fwrapv -Qunused-arguments -fPIC -fPIE -gdwarf-4 -Wall2025030820250307
3593578 0 012051 820 888refclang -march=native -O -fwrapv -Qunused-arguments -fPIC -fPIE -gdwarf-4 -Wall2025030820250307
3616574 0 015013 828 920refclang -march=native -O3 -fwrapv -Qunused-arguments -fPIC -fPIE -gdwarf-4 -Wall2025030820250307
3624990 0 012984 780 952refgcc -march=native -mtune=native -O2 -fwrapv -fPIC -fPIE -gdwarf-4 -Wall2025030820250307
3719556 0 012095 772 952refgcc -march=native -mtune=native -O -fwrapv -fPIC -fPIE -gdwarf-4 -Wall2025030820250307
3762379 0 010979 756 920refgcc -march=native -mtune=native -Os -fwrapv -fPIC -fPIE -gdwarf-4 -Wall2025030820250307
38894738 992 01405669 144524 10296cryptoppclang++ -march=native -O3 -fwrapv -Qunused-arguments -fPIC -fPIE -gdwarf-4 -Wall2025030820250307
38934763 928 01695396 144732 10360cryptoppg++ -march=native -mtune=native -O -fwrapv -fPIC -fPIE -gdwarf-4 -Wall2025030820250307
39345071 928 01696170 144732 10360cryptoppg++ -march=native -mtune=native -O2 -fwrapv -fPIC -fPIE -gdwarf-4 -Wall2025030820250307
397770 0 09515 780 920opensslgcc -march=native -mtune=native -Os -fwrapv -fPIC -fPIE -gdwarf-4 -Wall2025030820250307
398070 0 013368 836 920opensslclang -march=native -O3 -fwrapv -Qunused-arguments -fPIC -fPIE -gdwarf-4 -Wall2025030820250307
398070 0 012776 836 888opensslclang -mcpu=native -O3 -fwrapv -Qunused-arguments -fPIC -fPIE -gdwarf-4 -Wall2025030820250307
398170 0 013352 836 920opensslclang -march=native -O2 -fwrapv -Qunused-arguments -fPIC -fPIE -gdwarf-4 -Wall2025030820250307
398176 0 010920 804 920opensslgcc -march=native -mtune=native -O2 -fwrapv -fPIC -fPIE -gdwarf-4 -Wall2025030820250307
398270 0 010406 828 888opensslclang -march=native -O -fwrapv -Qunused-arguments -fPIC -fPIE -gdwarf-4 -Wall2025030820250307
398279 0 010479 796 920opensslgcc -march=native -mtune=native -O -fwrapv -fPIC -fPIE -gdwarf-4 -Wall2025030820250307
398570 0 010230 828 888opensslclang -march=native -Os -fwrapv -Qunused-arguments -fPIC -fPIE -gdwarf-4 -Wall2025030820250307
40488315 1576 01409815 145108 10264cryptoppclang++ -march=native -O -fwrapv -Qunused-arguments -fPIC -fPIE -gdwarf-4 -Wall2025030820250307
41023668 992 01693418 144732 10328cryptoppg++ -march=native -mtune=native -Os -fwrapv -fPIC -fPIE -gdwarf-4 -Wall2025030820250307
41144937 704 01697412 144500 10360cryptoppg++ -march=native -mtune=native -O3 -fwrapv -fPIC -fPIE -gdwarf-4 -Wall2025030820250307
41174792 992 01405733 144524 10296cryptoppclang++ -march=native -O2 -fwrapv -Qunused-arguments -fPIC -fPIE -gdwarf-4 -Wall2025030820250307
41284622 768 01402762 144516 10264cryptoppclang++ -march=native -Os -fwrapv -Qunused-arguments -fPIC -fPIE -gdwarf-4 -Wall2025030820250307
522976 0 013056 804 920opensslgcc -march=native -mtune=native -O3 -fwrapv -fPIC -fPIE -gdwarf-4 -Wall2025030820250307
1672610655 0 020067 756 920sphlib-smallgcc -march=native -mtune=native -Os -fwrapv -fPIC -fPIE -gdwarf-4 -Wall2025030820250307
1687111041 0 021399 772 952sphlib-smallgcc -march=native -mtune=native -O -fwrapv -fPIC -fPIE -gdwarf-4 -Wall2025030820250307
1700013235 0 026136 780 952sphlib-smallgcc -march=native -mtune=native -O3 -fwrapv -fPIC -fPIE -gdwarf-4 -Wall2025030820250307
1771911926 0 022736 780 952sphlib-smallgcc -march=native -mtune=native -O2 -fwrapv -fPIC -fPIE -gdwarf-4 -Wall2025030820250307
1774923510 0 036408 780 952sphlibgcc -march=native -mtune=native -O3 -fwrapv -fPIC -fPIE -gdwarf-4 -Wall2025030820250307
1775021926 0 032736 780 952sphlibgcc -march=native -mtune=native -O2 -fwrapv -fPIC -fPIE -gdwarf-4 -Wall2025030820250307
1804321207 0 030611 756 920sphlibgcc -march=native -mtune=native -Os -fwrapv -fPIC -fPIE -gdwarf-4 -Wall2025030820250307
1840721683 0 032039 772 952sphlibgcc -march=native -mtune=native -O -fwrapv -fPIC -fPIE -gdwarf-4 -Wall2025030820250307
1877120990 0 031107 820 888sphlibclang -march=native -Os -fwrapv -Qunused-arguments -fPIC -fPIE -gdwarf-4 -Wall2025030820250307
1884212279 0 025453 828 920sphlib-smallclang -march=native -O2 -fwrapv -Qunused-arguments -fPIC -fPIE -gdwarf-4 -Wall2025030820250307
1885712279 0 025469 828 920sphlib-smallclang -march=native -O3 -fwrapv -Qunused-arguments -fPIC -fPIE -gdwarf-4 -Wall2025030820250307
1893021607 0 034861 828 920sphlibclang -march=native -O3 -fwrapv -Qunused-arguments -fPIC -fPIE -gdwarf-4 -Wall2025030820250307
1896411804 0 021891 820 888sphlib-smallclang -march=native -Os -fwrapv -Qunused-arguments -fPIC -fPIE -gdwarf-4 -Wall2025030820250307
1902121607 0 034845 828 920sphlibclang -march=native -O2 -fwrapv -Qunused-arguments -fPIC -fPIE -gdwarf-4 -Wall2025030820250307
1973721525 0 031875 820 888sphlibclang -march=native -O -fwrapv -Qunused-arguments -fPIC -fPIE -gdwarf-4 -Wall2025030820250307
1979012533 0 022883 820 888sphlib-smallclang -march=native -O -fwrapv -Qunused-arguments -fPIC -fPIE -gdwarf-4 -Wall2025030820250307
2202112146 0 024797 828 888sphlib-smallclang -mcpu=native -O3 -fwrapv -Qunused-arguments -fPIC -fPIE -gdwarf-4 -Wall2025030820250307
2486721266 0 033917 828 888sphlibclang -mcpu=native -O3 -fwrapv -Qunused-arguments -fPIC -fPIE -gdwarf-4 -Wall2025030820250307

Compiler output


try.c: error: linking with `cc` failed: exit code: 1
try.c:   |
try.c:   = note: "cc" "-Wl,--as-needed" "-Wl,-z,noexecstack" "-m64" "-Wl,--eh-frame-hdr" "-L" "/usr/lib/rustlib/x86_64-unknown-linux-gnu/lib" ".../supercop-data/panther/amd64/try/c/clang_-march=native_-O2_-fwrapv_-Qunused-arguments_-fPIC_-fPIE_-gdwarf-4_-Wall/constbranchindex/crypto_hash/sha256/rust_crypto/work/target/release/deps/measure-e6f8efcfbea4e30e.measure.2yz52fdu-cgu.0.rcgu.o" ".../supercop-data/panther/amd64/try/c/clang_-march=native_-O2_-fwrapv_-Qunused-arguments_-fPIC_-fPIE_-gdwarf-4_-Wall/constbranchindex/crypto_hash/sha256/rust_crypto/work/target/release/deps/measure-e6f8efcfbea4e30e.measure.2yz52fdu-cgu.1.rcgu.o" ".../supercop-data/panther/amd64/try/c/clang_-march=native_-O2_-fwrapv_-Qunused-arguments_-fPIC_-fPIE_-gdwarf-4_-Wall/constbranchindex/crypto_hash/sha256/rust_crypto/work/target/release/deps/measure-e6f8efcfbea4e30e.measure.2yz52fdu-cgu.2.rcgu.o" ".../supercop-data/panther/amd64/try/c/clang_-march=native_-O2_-fwrapv_-Qunused-arguments_-fPIC_-fPIE_-gdwarf-4_-Wall/constbranchindex/crypto_hash/sha256/rust_crypto/work/target/release/deps/measure-e6f8efcfbea4e30e.measure.2yz52fdu-cgu.3.rcgu.o" ".../supercop-data/panther/amd64/try/c/clang_-march=native_-O2_-fwrapv_-Qunused-arguments_-fPIC_-fPIE_-gdwarf-4_-Wall/constbranchindex/crypto_hash/sha256/rust_crypto/work/target/release/deps/measure-e6f8efcfbea4e30e.measure.2yz52fdu-cgu.4.rcgu.o" "-o" ".../supercop-data/panther/amd64/try/c/clang_-march=native_-O2_-fwrapv_-Qunused-arguments_-fPIC_-fPIE_-gdwarf-4_-Wall/constbranchindex/crypto_hash/sha256/rust_crypto/work/target/release/deps/measure-e6f8efcfbea4e30e" ".../supercop-data/panther/amd64/try/c/clang_-march=native_-O2_-fwrapv_-Qunused-arguments_-fPIC_-fPIE_-gdwarf-4_-Wall/constbranchindex/crypto_hash/sha256/rust_crypto/work/target/release/deps/measure-e6f8efcfbea4e30e.2vbk2gyir92gcind.rcgu.o" "-Wl,--gc-sections" "-pie" "-Wl,-zrelro" "-Wl,-znow" "-Wl,-O1" "-nodefaultlibs" "-L" ".../supercop-data/panther/amd64/try/c/clang_-march=native_-O2_-fwrapv_-Qunused-arguments_-fPIC_-fPIE_-gdwarf-4_-Wall/constbranchindex/crypto_hash/sha256/rust_crypto/work/target/release/deps" "-L" ".../supercop-data/panther/amd64/lib" "-L" ".../supercop-data/panther/amd64/try/c/clang_-march=native_-O2_-fwrapv_-Qunused-arguments_-fPIC_-fPIE_-gdwarf-4_-Wall/constbranchindex/crypto_hash/sha256/rust_crypto/work/target/release/build/crypto_hash_sha256-5cd230be06f90398/out" "-L" ".../supercop-data/panther/amd64/try/c/clang_-march=native_-O2_-fwrapv_-Qunused-arguments_-fPIC_-fPIE_-gdwarf-4_-Wall/constbranchindex/crypto_hash/sha256/rust_crypto/work/target/release/build/rust-crypto-afe9b4ff19c80bbc/out" "-L" "/usr/lib/rustlib/x86_64-unknown-linux-gnu/lib" "-lmeasure-anything" "-lmeasure" "-lsupercop" "-lkernelrandombytes" "-lcpucycles" "-lcrypto" "-lntl" "-lnsl" "-lm" "-Wl,-Bstatic" ".../supercop-data/panther/amd64/try/c/clang_-march=native_-O2_-fwrapv_-Qunused-arguments_-fPIC_-fPIE_-gdwarf-4_-Wall/constbranchindex/crypto_hash/sha256/rust_crypto/work/target/release/deps/libcrypto_hash_sha256-b6dc07f49da86745.rlib" ".../supercop-data/panther/amd64/try/c/clang_-march=native_-O2_-fwrapv_-Qunused-arguments_-fPIC_-fPIE_-gdwarf-4_-Wall/constbranchindex/crypto_hash/sha256/rust_crypto/work/target/release/deps/libcrypto-83ceebf3c7290f98.rlib" ".../supercop-data/panther/amd64/try/c/clang_-march=native_-O2_-fwrapv_-Qunused-arguments_-fPIC_-fPIE_-gdwarf-4_-Wall/constbranchindex/crypto_hash/sha256/rust_crypto/work/target/release/deps/libtime-b473882f9f54487c.rlib" ".../supercop-data/panther/amd64/try/c/clang_-march=native_-O2_-fwrapv_-Qunused-arguments_-fPIC_-fPIE_-gdwarf-4_-Wall/constbranchindex/crypto_hash/sha256/rust_crypto/work/target/release/deps/librustc_serialize-72942cfdca4fb518.rlib" ".../supercop-data/panther/amd64/try/c/clang_-march=native_-O2_-fwrapv_-Qunused-arguments_-fPIC_-fPIE_-gdwarf-4_-Wall/constbranchindex/crypto_hash/sha256/rust_crypto/work/target/release/deps/librand-2cdf248a3f2ca473.rlib" ".../supercop-data/panther/amd64/try/c/clang_-march=native_-O2_-fwrapv_-Qunused-arguments_-fPIC_-fPIE_-gdwarf-4_-Wall/constbranchindex/crypto_hash/sha256/rust_crypto/work/target/release/deps/librand-7df229a95dbcb448.rlib" ".../supercop-data/panther/amd64/try/c/clang_-march=native_-O2_-fwrapv_-Qunused-arguments_-fPIC_-fPIE_-gdwarf-4_-Wall/constbranchindex/crypto_hash/sha256/rust_crypto/work/target/release/deps/liblibc-141c671f2ddc755d.rlib" "-Wl,--start-group" "/usr/lib/rustlib/x86_64-unknown-linux-gnu/lib/libstd-6bf3f16f340782ca.rlib" "/usr/lib/rustlib/x86_64-unknown-linux-gnu/lib/libpanic_unwind-13f3099d50c21bc6.rlib" "/usr/lib/rustlib/x86_64-unknown-linux-gnu/lib/libminiz_oxide-a2ba33c985785afe.rlib" "/usr/lib/rustlib/x86_64-unknown-linux-gnu/lib/libadler-3f6e9f8f4afbea6d.rlib" "/usr/lib/rustlib/x86_64-unknown-linux-gnu/lib/libobject-af517d7f13e7c960.rlib" "/usr/lib/rustlib/x86_64-unknown-linux-gnu/lib/libaddr2line-12740563628e601f.rlib" "/usr/lib/rustlib/x86_64-unknown-linux-gnu/lib/libgimli-0ac82a1e1820dd21.rlib" "/usr/lib/rustlib/x86_64-unknown-linux-gnu/lib/librustc_demangle-3ac2d0878c297d42.rlib" "/usr/lib/rustlib/x86_64-unknown-linux-gnu/lib/libhashbrown-c6632ca171f954dd.rlib" "/usr/lib/rustlib/x86_64-unknown-linux-gnu/lib/librustc_std_workspace_alloc-b5bfd0198c7b740d.rlib" "/usr/lib/rustlib/x86_64-unknown-linux-gnu/lib/libunwind-bd645b20c6c7b56d.rlib" "/usr/lib/rustlib/x86_64-unknown-linux-gnu/lib/libcfg_if-b9e1e523c0c29a77.rlib" "/usr/lib/rustlib/x86_64-unknown-linux-gnu/lib/liblibc-dfbef8c525de0186.rlib" "/usr/lib/rustlib/x86_64-unknown-linux-gnu/lib/liballoc-1ebf406bd4ea5769.rlib" "/usr/lib/rustlib/x86_64-unknown-linux-gnu/lib/librustc_std_workspace_core-5e0675f526ef5c6b.rlib" "/usr/lib/rustlib/x86_64-unknown-linux-gnu/lib/libcore-3375e4f89d420e7a.rlib" "-Wl,--end-group" "/usr/lib/rustlib/x86_64-unknown-linux-gnu/lib/libcompiler_builtins-f74b197469e67088.rlib" "-Wl,-Bdynamic" "-lgcc_s" "-lc" "-lm" "-lrt" "-lpthread" "-lutil" "-ldl" "-lutil"
try.c:   = note: /usr/bin/ld: cannot find -lcpucycles
try.c:           collect2: error: ld returned 1 exit status
try.c:
try.c:
try.c: error: aborting due to previous error
try.c:
try.c: error: could not compile `crypto_hash_sha256`.
try.c:
try.c: To learn more, run the command again with --verbose.

Number of similar (implementation,compiler) pairs: 1, namely:
ImplementationCompiler
rust_cryptoclang -march=native -O2 -fwrapv -Qunused-arguments -fPIC -fPIE -gdwarf-4 -Wall (Debian_Clang_11.0.1)

Compiler output


try.c: error: linking with `cc` failed: exit code: 1
try.c:   |
try.c:   = note: "cc" "-Wl,--as-needed" "-Wl,-z,noexecstack" "-m64" "-Wl,--eh-frame-hdr" "-L" "/usr/lib/rustlib/x86_64-unknown-linux-gnu/lib" ".../supercop-data/panther/amd64/try/c/clang_-march=native_-O3_-fwrapv_-Qunused-arguments_-fPIC_-fPIE_-gdwarf-4_-Wall/constbranchindex/crypto_hash/sha256/rust_crypto/work/target/release/deps/try_small-f566cacc72890263.try_small.83ks8n5m-cgu.0.rcgu.o" ".../supercop-data/panther/amd64/try/c/clang_-march=native_-O3_-fwrapv_-Qunused-arguments_-fPIC_-fPIE_-gdwarf-4_-Wall/constbranchindex/crypto_hash/sha256/rust_crypto/work/target/release/deps/try_small-f566cacc72890263.try_small.83ks8n5m-cgu.1.rcgu.o" ".../supercop-data/panther/amd64/try/c/clang_-march=native_-O3_-fwrapv_-Qunused-arguments_-fPIC_-fPIE_-gdwarf-4_-Wall/constbranchindex/crypto_hash/sha256/rust_crypto/work/target/release/deps/try_small-f566cacc72890263.try_small.83ks8n5m-cgu.2.rcgu.o" ".../supercop-data/panther/amd64/try/c/clang_-march=native_-O3_-fwrapv_-Qunused-arguments_-fPIC_-fPIE_-gdwarf-4_-Wall/constbranchindex/crypto_hash/sha256/rust_crypto/work/target/release/deps/try_small-f566cacc72890263.try_small.83ks8n5m-cgu.3.rcgu.o" ".../supercop-data/panther/amd64/try/c/clang_-march=native_-O3_-fwrapv_-Qunused-arguments_-fPIC_-fPIE_-gdwarf-4_-Wall/constbranchindex/crypto_hash/sha256/rust_crypto/work/target/release/deps/try_small-f566cacc72890263.try_small.83ks8n5m-cgu.4.rcgu.o" "-o" ".../supercop-data/panther/amd64/try/c/clang_-march=native_-O3_-fwrapv_-Qunused-arguments_-fPIC_-fPIE_-gdwarf-4_-Wall/constbranchindex/crypto_hash/sha256/rust_crypto/work/target/release/deps/try_small-f566cacc72890263" ".../supercop-data/panther/amd64/try/c/clang_-march=native_-O3_-fwrapv_-Qunused-arguments_-fPIC_-fPIE_-gdwarf-4_-Wall/constbranchindex/crypto_hash/sha256/rust_crypto/work/target/release/deps/try_small-f566cacc72890263.2yzzwl19n3ayhtwn.rcgu.o" "-Wl,--gc-sections" "-pie" "-Wl,-zrelro" "-Wl,-znow" "-Wl,-O1" "-nodefaultlibs" "-L" ".../supercop-data/panther/amd64/try/c/clang_-march=native_-O3_-fwrapv_-Qunused-arguments_-fPIC_-fPIE_-gdwarf-4_-Wall/constbranchindex/crypto_hash/sha256/rust_crypto/work/target/release/deps" "-L" ".../supercop-data/panther/amd64/lib" "-L" ".../supercop-data/panther/amd64/try/c/clang_-march=native_-O3_-fwrapv_-Qunused-arguments_-fPIC_-fPIE_-gdwarf-4_-Wall/constbranchindex/crypto_hash/sha256/rust_crypto/work/target/release/build/crypto_hash_sha256-5cd230be06f90398/out" "-L" ".../supercop-data/panther/amd64/try/c/clang_-march=native_-O3_-fwrapv_-Qunused-arguments_-fPIC_-fPIE_-gdwarf-4_-Wall/constbranchindex/crypto_hash/sha256/rust_crypto/work/target/release/build/rust-crypto-afe9b4ff19c80bbc/out" "-L" "/usr/lib/rustlib/x86_64-unknown-linux-gnu/lib" "-ltry-anything" "-ltry-small" "-lsupercop" "-lkernelrandombytes" "-lcpucycles" "-lcrypto" "-lntl" "-lnsl" "-lm" "-Wl,-Bstatic" ".../supercop-data/panther/amd64/try/c/clang_-march=native_-O3_-fwrapv_-Qunused-arguments_-fPIC_-fPIE_-gdwarf-4_-Wall/constbranchindex/crypto_hash/sha256/rust_crypto/work/target/release/deps/libcrypto_hash_sha256-b6dc07f49da86745.rlib" ".../supercop-data/panther/amd64/try/c/clang_-march=native_-O3_-fwrapv_-Qunused-arguments_-fPIC_-fPIE_-gdwarf-4_-Wall/constbranchindex/crypto_hash/sha256/rust_crypto/work/target/release/deps/libcrypto-83ceebf3c7290f98.rlib" ".../supercop-data/panther/amd64/try/c/clang_-march=native_-O3_-fwrapv_-Qunused-arguments_-fPIC_-fPIE_-gdwarf-4_-Wall/constbranchindex/crypto_hash/sha256/rust_crypto/work/target/release/deps/libtime-b473882f9f54487c.rlib" ".../supercop-data/panther/amd64/try/c/clang_-march=native_-O3_-fwrapv_-Qunused-arguments_-fPIC_-fPIE_-gdwarf-4_-Wall/constbranchindex/crypto_hash/sha256/rust_crypto/work/target/release/deps/librustc_serialize-72942cfdca4fb518.rlib" ".../supercop-data/panther/amd64/try/c/clang_-march=native_-O3_-fwrapv_-Qunused-arguments_-fPIC_-fPIE_-gdwarf-4_-Wall/constbranchindex/crypto_hash/sha256/rust_crypto/work/target/release/deps/librand-2cdf248a3f2ca473.rlib" ".../supercop-data/panther/amd64/try/c/clang_-march=native_-O3_-fwrapv_-Qunused-arguments_-fPIC_-fPIE_-gdwarf-4_-Wall/constbranchindex/crypto_hash/sha256/rust_crypto/work/target/release/deps/librand-7df229a95dbcb448.rlib" ".../supercop-data/panther/amd64/try/c/clang_-march=native_-O3_-fwrapv_-Qunused-arguments_-fPIC_-fPIE_-gdwarf-4_-Wall/constbranchindex/crypto_hash/sha256/rust_crypto/work/target/release/deps/liblibc-141c671f2ddc755d.rlib" "-Wl,--start-group" "/usr/lib/rustlib/x86_64-unknown-linux-gnu/lib/libstd-6bf3f16f340782ca.rlib" "/usr/lib/rustlib/x86_64-unknown-linux-gnu/lib/libpanic_unwind-13f3099d50c21bc6.rlib" "/usr/lib/rustlib/x86_64-unknown-linux-gnu/lib/libminiz_oxide-a2ba33c985785afe.rlib" "/usr/lib/rustlib/x86_64-unknown-linux-gnu/lib/libadler-3f6e9f8f4afbea6d.rlib" "/usr/lib/rustlib/x86_64-unknown-linux-gnu/lib/libobject-af517d7f13e7c960.rlib" "/usr/lib/rustlib/x86_64-unknown-linux-gnu/lib/libaddr2line-12740563628e601f.rlib" "/usr/lib/rustlib/x86_64-unknown-linux-gnu/lib/libgimli-0ac82a1e1820dd21.rlib" "/usr/lib/rustlib/x86_64-unknown-linux-gnu/lib/librustc_demangle-3ac2d0878c297d42.rlib" "/usr/lib/rustlib/x86_64-unknown-linux-gnu/lib/libhashbrown-c6632ca171f954dd.rlib" "/usr/lib/rustlib/x86_64-unknown-linux-gnu/lib/librustc_std_workspace_alloc-b5bfd0198c7b740d.rlib" "/usr/lib/rustlib/x86_64-unknown-linux-gnu/lib/libunwind-bd645b20c6c7b56d.rlib" "/usr/lib/rustlib/x86_64-unknown-linux-gnu/lib/libcfg_if-b9e1e523c0c29a77.rlib" "/usr/lib/rustlib/x86_64-unknown-linux-gnu/lib/liblibc-dfbef8c525de0186.rlib" "/usr/lib/rustlib/x86_64-unknown-linux-gnu/lib/liballoc-1ebf406bd4ea5769.rlib" "/usr/lib/rustlib/x86_64-unknown-linux-gnu/lib/librustc_std_workspace_core-5e0675f526ef5c6b.rlib" "/usr/lib/rustlib/x86_64-unknown-linux-gnu/lib/libcore-3375e4f89d420e7a.rlib" "-Wl,--end-group" "/usr/lib/rustlib/x86_64-unknown-linux-gnu/lib/libcompiler_builtins-f74b197469e67088.rlib" "-Wl,-Bdynamic" "-lgcc_s" "-lc" "-lm" "-lrt" "-lpthread" "-lutil" "-ldl" "-lutil"
try.c:   = note: /usr/bin/ld: cannot find -lcpucycles
try.c:           collect2: error: ld returned 1 exit status
try.c:
try.c:
try.c: error: aborting due to previous error
try.c:
try.c: error: could not compile `crypto_hash_sha256`.
try.c:
try.c: To learn more, run the command again with --verbose.

Number of similar (implementation,compiler) pairs: 1, namely:
ImplementationCompiler
rust_cryptoclang -march=native -O3 -fwrapv -Qunused-arguments -fPIC -fPIE -gdwarf-4 -Wall (Debian_Clang_11.0.1)

Compiler output


try.c: error: linking with `cc` failed: exit code: 1
try.c:   |
try.c:   = note: "cc" "-Wl,--as-needed" "-Wl,-z,noexecstack" "-m64" "-Wl,--eh-frame-hdr" "-L" "/usr/lib/rustlib/x86_64-unknown-linux-gnu/lib" ".../supercop-data/panther/amd64/try/c/clang_-march=native_-O_-fwrapv_-Qunused-arguments_-fPIC_-fPIE_-gdwarf-4_-Wall/constbranchindex/crypto_hash/sha256/rust_crypto/work/target/release/deps/measure-e6f8efcfbea4e30e.measure.2yz52fdu-cgu.0.rcgu.o" ".../supercop-data/panther/amd64/try/c/clang_-march=native_-O_-fwrapv_-Qunused-arguments_-fPIC_-fPIE_-gdwarf-4_-Wall/constbranchindex/crypto_hash/sha256/rust_crypto/work/target/release/deps/measure-e6f8efcfbea4e30e.measure.2yz52fdu-cgu.1.rcgu.o" ".../supercop-data/panther/amd64/try/c/clang_-march=native_-O_-fwrapv_-Qunused-arguments_-fPIC_-fPIE_-gdwarf-4_-Wall/constbranchindex/crypto_hash/sha256/rust_crypto/work/target/release/deps/measure-e6f8efcfbea4e30e.measure.2yz52fdu-cgu.2.rcgu.o" ".../supercop-data/panther/amd64/try/c/clang_-march=native_-O_-fwrapv_-Qunused-arguments_-fPIC_-fPIE_-gdwarf-4_-Wall/constbranchindex/crypto_hash/sha256/rust_crypto/work/target/release/deps/measure-e6f8efcfbea4e30e.measure.2yz52fdu-cgu.3.rcgu.o" ".../supercop-data/panther/amd64/try/c/clang_-march=native_-O_-fwrapv_-Qunused-arguments_-fPIC_-fPIE_-gdwarf-4_-Wall/constbranchindex/crypto_hash/sha256/rust_crypto/work/target/release/deps/measure-e6f8efcfbea4e30e.measure.2yz52fdu-cgu.4.rcgu.o" "-o" ".../supercop-data/panther/amd64/try/c/clang_-march=native_-O_-fwrapv_-Qunused-arguments_-fPIC_-fPIE_-gdwarf-4_-Wall/constbranchindex/crypto_hash/sha256/rust_crypto/work/target/release/deps/measure-e6f8efcfbea4e30e" ".../supercop-data/panther/amd64/try/c/clang_-march=native_-O_-fwrapv_-Qunused-arguments_-fPIC_-fPIE_-gdwarf-4_-Wall/constbranchindex/crypto_hash/sha256/rust_crypto/work/target/release/deps/measure-e6f8efcfbea4e30e.2vbk2gyir92gcind.rcgu.o" "-Wl,--gc-sections" "-pie" "-Wl,-zrelro" "-Wl,-znow" "-Wl,-O1" "-nodefaultlibs" "-L" ".../supercop-data/panther/amd64/try/c/clang_-march=native_-O_-fwrapv_-Qunused-arguments_-fPIC_-fPIE_-gdwarf-4_-Wall/constbranchindex/crypto_hash/sha256/rust_crypto/work/target/release/deps" "-L" ".../supercop-data/panther/amd64/lib" "-L" ".../supercop-data/panther/amd64/try/c/clang_-march=native_-O_-fwrapv_-Qunused-arguments_-fPIC_-fPIE_-gdwarf-4_-Wall/constbranchindex/crypto_hash/sha256/rust_crypto/work/target/release/build/crypto_hash_sha256-5cd230be06f90398/out" "-L" ".../supercop-data/panther/amd64/try/c/clang_-march=native_-O_-fwrapv_-Qunused-arguments_-fPIC_-fPIE_-gdwarf-4_-Wall/constbranchindex/crypto_hash/sha256/rust_crypto/work/target/release/build/rust-crypto-afe9b4ff19c80bbc/out" "-L" "/usr/lib/rustlib/x86_64-unknown-linux-gnu/lib" "-lmeasure-anything" "-lmeasure" "-lsupercop" "-lkernelrandombytes" "-lcpucycles" "-lcrypto" "-lntl" "-lnsl" "-lm" "-Wl,-Bstatic" ".../supercop-data/panther/amd64/try/c/clang_-march=native_-O_-fwrapv_-Qunused-arguments_-fPIC_-fPIE_-gdwarf-4_-Wall/constbranchindex/crypto_hash/sha256/rust_crypto/work/target/release/deps/libcrypto_hash_sha256-b6dc07f49da86745.rlib" ".../supercop-data/panther/amd64/try/c/clang_-march=native_-O_-fwrapv_-Qunused-arguments_-fPIC_-fPIE_-gdwarf-4_-Wall/constbranchindex/crypto_hash/sha256/rust_crypto/work/target/release/deps/libcrypto-83ceebf3c7290f98.rlib" ".../supercop-data/panther/amd64/try/c/clang_-march=native_-O_-fwrapv_-Qunused-arguments_-fPIC_-fPIE_-gdwarf-4_-Wall/constbranchindex/crypto_hash/sha256/rust_crypto/work/target/release/deps/libtime-b473882f9f54487c.rlib" ".../supercop-data/panther/amd64/try/c/clang_-march=native_-O_-fwrapv_-Qunused-arguments_-fPIC_-fPIE_-gdwarf-4_-Wall/constbranchindex/crypto_hash/sha256/rust_crypto/work/target/release/deps/librustc_serialize-72942cfdca4fb518.rlib" ".../supercop-data/panther/amd64/try/c/clang_-march=native_-O_-fwrapv_-Qunused-arguments_-fPIC_-fPIE_-gdwarf-4_-Wall/constbranchindex/crypto_hash/sha256/rust_crypto/work/target/release/deps/librand-2cdf248a3f2ca473.rlib" ".../supercop-data/panther/amd64/try/c/clang_-march=native_-O_-fwrapv_-Qunused-arguments_-fPIC_-fPIE_-gdwarf-4_-Wall/constbranchindex/crypto_hash/sha256/rust_crypto/work/target/release/deps/librand-7df229a95dbcb448.rlib" ".../supercop-data/panther/amd64/try/c/clang_-march=native_-O_-fwrapv_-Qunused-arguments_-fPIC_-fPIE_-gdwarf-4_-Wall/constbranchindex/crypto_hash/sha256/rust_crypto/work/target/release/deps/liblibc-141c671f2ddc755d.rlib" "-Wl,--start-group" "/usr/lib/rustlib/x86_64-unknown-linux-gnu/lib/libstd-6bf3f16f340782ca.rlib" "/usr/lib/rustlib/x86_64-unknown-linux-gnu/lib/libpanic_unwind-13f3099d50c21bc6.rlib" "/usr/lib/rustlib/x86_64-unknown-linux-gnu/lib/libminiz_oxide-a2ba33c985785afe.rlib" "/usr/lib/rustlib/x86_64-unknown-linux-gnu/lib/libadler-3f6e9f8f4afbea6d.rlib" "/usr/lib/rustlib/x86_64-unknown-linux-gnu/lib/libobject-af517d7f13e7c960.rlib" "/usr/lib/rustlib/x86_64-unknown-linux-gnu/lib/libaddr2line-12740563628e601f.rlib" "/usr/lib/rustlib/x86_64-unknown-linux-gnu/lib/libgimli-0ac82a1e1820dd21.rlib" "/usr/lib/rustlib/x86_64-unknown-linux-gnu/lib/librustc_demangle-3ac2d0878c297d42.rlib" "/usr/lib/rustlib/x86_64-unknown-linux-gnu/lib/libhashbrown-c6632ca171f954dd.rlib" "/usr/lib/rustlib/x86_64-unknown-linux-gnu/lib/librustc_std_workspace_alloc-b5bfd0198c7b740d.rlib" "/usr/lib/rustlib/x86_64-unknown-linux-gnu/lib/libunwind-bd645b20c6c7b56d.rlib" "/usr/lib/rustlib/x86_64-unknown-linux-gnu/lib/libcfg_if-b9e1e523c0c29a77.rlib" "/usr/lib/rustlib/x86_64-unknown-linux-gnu/lib/liblibc-dfbef8c525de0186.rlib" "/usr/lib/rustlib/x86_64-unknown-linux-gnu/lib/liballoc-1ebf406bd4ea5769.rlib" "/usr/lib/rustlib/x86_64-unknown-linux-gnu/lib/librustc_std_workspace_core-5e0675f526ef5c6b.rlib" "/usr/lib/rustlib/x86_64-unknown-linux-gnu/lib/libcore-3375e4f89d420e7a.rlib" "-Wl,--end-group" "/usr/lib/rustlib/x86_64-unknown-linux-gnu/lib/libcompiler_builtins-f74b197469e67088.rlib" "-Wl,-Bdynamic" "-lgcc_s" "-lc" "-lm" "-lrt" "-lpthread" "-lutil" "-ldl" "-lutil"
try.c:   = note: /usr/bin/ld: cannot find -lcpucycles
try.c:           collect2: error: ld returned 1 exit status
try.c:
try.c:
try.c: error: aborting due to previous error
try.c:
try.c: error: could not compile `crypto_hash_sha256`.
try.c:
try.c: To learn more, run the command again with --verbose.

Number of similar (implementation,compiler) pairs: 1, namely:
ImplementationCompiler
rust_cryptoclang -march=native -O -fwrapv -Qunused-arguments -fPIC -fPIE -gdwarf-4 -Wall (Debian_Clang_11.0.1)

Compiler output


try.c: error: linking with `cc` failed: exit code: 1
try.c:   |
try.c:   = note: "cc" "-Wl,--as-needed" "-Wl,-z,noexecstack" "-m64" "-Wl,--eh-frame-hdr" "-L" "/usr/lib/rustlib/x86_64-unknown-linux-gnu/lib" ".../supercop-data/panther/amd64/try/c/clang_-march=native_-Os_-fwrapv_-Qunused-arguments_-fPIC_-fPIE_-gdwarf-4_-Wall/constbranchindex/crypto_hash/sha256/rust_crypto/work/target/release/deps/measure-e6f8efcfbea4e30e.measure.2yz52fdu-cgu.0.rcgu.o" ".../supercop-data/panther/amd64/try/c/clang_-march=native_-Os_-fwrapv_-Qunused-arguments_-fPIC_-fPIE_-gdwarf-4_-Wall/constbranchindex/crypto_hash/sha256/rust_crypto/work/target/release/deps/measure-e6f8efcfbea4e30e.measure.2yz52fdu-cgu.1.rcgu.o" ".../supercop-data/panther/amd64/try/c/clang_-march=native_-Os_-fwrapv_-Qunused-arguments_-fPIC_-fPIE_-gdwarf-4_-Wall/constbranchindex/crypto_hash/sha256/rust_crypto/work/target/release/deps/measure-e6f8efcfbea4e30e.measure.2yz52fdu-cgu.2.rcgu.o" ".../supercop-data/panther/amd64/try/c/clang_-march=native_-Os_-fwrapv_-Qunused-arguments_-fPIC_-fPIE_-gdwarf-4_-Wall/constbranchindex/crypto_hash/sha256/rust_crypto/work/target/release/deps/measure-e6f8efcfbea4e30e.measure.2yz52fdu-cgu.3.rcgu.o" ".../supercop-data/panther/amd64/try/c/clang_-march=native_-Os_-fwrapv_-Qunused-arguments_-fPIC_-fPIE_-gdwarf-4_-Wall/constbranchindex/crypto_hash/sha256/rust_crypto/work/target/release/deps/measure-e6f8efcfbea4e30e.measure.2yz52fdu-cgu.4.rcgu.o" "-o" ".../supercop-data/panther/amd64/try/c/clang_-march=native_-Os_-fwrapv_-Qunused-arguments_-fPIC_-fPIE_-gdwarf-4_-Wall/constbranchindex/crypto_hash/sha256/rust_crypto/work/target/release/deps/measure-e6f8efcfbea4e30e" ".../supercop-data/panther/amd64/try/c/clang_-march=native_-Os_-fwrapv_-Qunused-arguments_-fPIC_-fPIE_-gdwarf-4_-Wall/constbranchindex/crypto_hash/sha256/rust_crypto/work/target/release/deps/measure-e6f8efcfbea4e30e.2vbk2gyir92gcind.rcgu.o" "-Wl,--gc-sections" "-pie" "-Wl,-zrelro" "-Wl,-znow" "-Wl,-O1" "-nodefaultlibs" "-L" ".../supercop-data/panther/amd64/try/c/clang_-march=native_-Os_-fwrapv_-Qunused-arguments_-fPIC_-fPIE_-gdwarf-4_-Wall/constbranchindex/crypto_hash/sha256/rust_crypto/work/target/release/deps" "-L" ".../supercop-data/panther/amd64/lib" "-L" ".../supercop-data/panther/amd64/try/c/clang_-march=native_-Os_-fwrapv_-Qunused-arguments_-fPIC_-fPIE_-gdwarf-4_-Wall/constbranchindex/crypto_hash/sha256/rust_crypto/work/target/release/build/crypto_hash_sha256-5cd230be06f90398/out" "-L" ".../supercop-data/panther/amd64/try/c/clang_-march=native_-Os_-fwrapv_-Qunused-arguments_-fPIC_-fPIE_-gdwarf-4_-Wall/constbranchindex/crypto_hash/sha256/rust_crypto/work/target/release/build/rust-crypto-afe9b4ff19c80bbc/out" "-L" "/usr/lib/rustlib/x86_64-unknown-linux-gnu/lib" "-lmeasure-anything" "-lmeasure" "-lsupercop" "-lkernelrandombytes" "-lcpucycles" "-lcrypto" "-lntl" "-lnsl" "-lm" "-Wl,-Bstatic" ".../supercop-data/panther/amd64/try/c/clang_-march=native_-Os_-fwrapv_-Qunused-arguments_-fPIC_-fPIE_-gdwarf-4_-Wall/constbranchindex/crypto_hash/sha256/rust_crypto/work/target/release/deps/libcrypto_hash_sha256-b6dc07f49da86745.rlib" ".../supercop-data/panther/amd64/try/c/clang_-march=native_-Os_-fwrapv_-Qunused-arguments_-fPIC_-fPIE_-gdwarf-4_-Wall/constbranchindex/crypto_hash/sha256/rust_crypto/work/target/release/deps/libcrypto-83ceebf3c7290f98.rlib" ".../supercop-data/panther/amd64/try/c/clang_-march=native_-Os_-fwrapv_-Qunused-arguments_-fPIC_-fPIE_-gdwarf-4_-Wall/constbranchindex/crypto_hash/sha256/rust_crypto/work/target/release/deps/libtime-b473882f9f54487c.rlib" ".../supercop-data/panther/amd64/try/c/clang_-march=native_-Os_-fwrapv_-Qunused-arguments_-fPIC_-fPIE_-gdwarf-4_-Wall/constbranchindex/crypto_hash/sha256/rust_crypto/work/target/release/deps/librustc_serialize-72942cfdca4fb518.rlib" ".../supercop-data/panther/amd64/try/c/clang_-march=native_-Os_-fwrapv_-Qunused-arguments_-fPIC_-fPIE_-gdwarf-4_-Wall/constbranchindex/crypto_hash/sha256/rust_crypto/work/target/release/deps/librand-2cdf248a3f2ca473.rlib" ".../supercop-data/panther/amd64/try/c/clang_-march=native_-Os_-fwrapv_-Qunused-arguments_-fPIC_-fPIE_-gdwarf-4_-Wall/constbranchindex/crypto_hash/sha256/rust_crypto/work/target/release/deps/librand-7df229a95dbcb448.rlib" ".../supercop-data/panther/amd64/try/c/clang_-march=native_-Os_-fwrapv_-Qunused-arguments_-fPIC_-fPIE_-gdwarf-4_-Wall/constbranchindex/crypto_hash/sha256/rust_crypto/work/target/release/deps/liblibc-141c671f2ddc755d.rlib" "-Wl,--start-group" "/usr/lib/rustlib/x86_64-unknown-linux-gnu/lib/libstd-6bf3f16f340782ca.rlib" "/usr/lib/rustlib/x86_64-unknown-linux-gnu/lib/libpanic_unwind-13f3099d50c21bc6.rlib" "/usr/lib/rustlib/x86_64-unknown-linux-gnu/lib/libminiz_oxide-a2ba33c985785afe.rlib" "/usr/lib/rustlib/x86_64-unknown-linux-gnu/lib/libadler-3f6e9f8f4afbea6d.rlib" "/usr/lib/rustlib/x86_64-unknown-linux-gnu/lib/libobject-af517d7f13e7c960.rlib" "/usr/lib/rustlib/x86_64-unknown-linux-gnu/lib/libaddr2line-12740563628e601f.rlib" "/usr/lib/rustlib/x86_64-unknown-linux-gnu/lib/libgimli-0ac82a1e1820dd21.rlib" "/usr/lib/rustlib/x86_64-unknown-linux-gnu/lib/librustc_demangle-3ac2d0878c297d42.rlib" "/usr/lib/rustlib/x86_64-unknown-linux-gnu/lib/libhashbrown-c6632ca171f954dd.rlib" "/usr/lib/rustlib/x86_64-unknown-linux-gnu/lib/librustc_std_workspace_alloc-b5bfd0198c7b740d.rlib" "/usr/lib/rustlib/x86_64-unknown-linux-gnu/lib/libunwind-bd645b20c6c7b56d.rlib" "/usr/lib/rustlib/x86_64-unknown-linux-gnu/lib/libcfg_if-b9e1e523c0c29a77.rlib" "/usr/lib/rustlib/x86_64-unknown-linux-gnu/lib/liblibc-dfbef8c525de0186.rlib" "/usr/lib/rustlib/x86_64-unknown-linux-gnu/lib/liballoc-1ebf406bd4ea5769.rlib" "/usr/lib/rustlib/x86_64-unknown-linux-gnu/lib/librustc_std_workspace_core-5e0675f526ef5c6b.rlib" "/usr/lib/rustlib/x86_64-unknown-linux-gnu/lib/libcore-3375e4f89d420e7a.rlib" "-Wl,--end-group" "/usr/lib/rustlib/x86_64-unknown-linux-gnu/lib/libcompiler_builtins-f74b197469e67088.rlib" "-Wl,-Bdynamic" "-lgcc_s" "-lc" "-lm" "-lrt" "-lpthread" "-lutil" "-ldl" "-lutil"
try.c:   = note: /usr/bin/ld: cannot find -lcpucycles
try.c:           collect2: error: ld returned 1 exit status
try.c:
try.c:
try.c: error: aborting due to previous error
try.c:
try.c: error: could not compile `crypto_hash_sha256`.
try.c:
try.c: To learn more, run the command again with --verbose.

Number of similar (implementation,compiler) pairs: 1, namely:
ImplementationCompiler
rust_cryptoclang -march=native -Os -fwrapv -Qunused-arguments -fPIC -fPIE -gdwarf-4 -Wall (Debian_Clang_11.0.1)

Compiler output


try.c: error: linking with `cc` failed: exit code: 1
try.c:   |
try.c:   = note: "cc" "-Wl,--as-needed" "-Wl,-z,noexecstack" "-m64" "-Wl,--eh-frame-hdr" "-L" "/usr/lib/rustlib/x86_64-unknown-linux-gnu/lib" ".../supercop-data/panther/amd64/try/c/clang_-mcpu=native_-O3_-fwrapv_-Qunused-arguments_-fPIC_-fPIE_-gdwarf-4_-Wall/constbranchindex/crypto_hash/sha256/rust_crypto/work/target/release/deps/try-baac04c777a2678c.try.dtsbxaoj-cgu.0.rcgu.o" ".../supercop-data/panther/amd64/try/c/clang_-mcpu=native_-O3_-fwrapv_-Qunused-arguments_-fPIC_-fPIE_-gdwarf-4_-Wall/constbranchindex/crypto_hash/sha256/rust_crypto/work/target/release/deps/try-baac04c777a2678c.try.dtsbxaoj-cgu.1.rcgu.o" ".../supercop-data/panther/amd64/try/c/clang_-mcpu=native_-O3_-fwrapv_-Qunused-arguments_-fPIC_-fPIE_-gdwarf-4_-Wall/constbranchindex/crypto_hash/sha256/rust_crypto/work/target/release/deps/try-baac04c777a2678c.try.dtsbxaoj-cgu.2.rcgu.o" ".../supercop-data/panther/amd64/try/c/clang_-mcpu=native_-O3_-fwrapv_-Qunused-arguments_-fPIC_-fPIE_-gdwarf-4_-Wall/constbranchindex/crypto_hash/sha256/rust_crypto/work/target/release/deps/try-baac04c777a2678c.try.dtsbxaoj-cgu.3.rcgu.o" ".../supercop-data/panther/amd64/try/c/clang_-mcpu=native_-O3_-fwrapv_-Qunused-arguments_-fPIC_-fPIE_-gdwarf-4_-Wall/constbranchindex/crypto_hash/sha256/rust_crypto/work/target/release/deps/try-baac04c777a2678c.try.dtsbxaoj-cgu.4.rcgu.o" "-o" ".../supercop-data/panther/amd64/try/c/clang_-mcpu=native_-O3_-fwrapv_-Qunused-arguments_-fPIC_-fPIE_-gdwarf-4_-Wall/constbranchindex/crypto_hash/sha256/rust_crypto/work/target/release/deps/try-baac04c777a2678c" ".../supercop-data/panther/amd64/try/c/clang_-mcpu=native_-O3_-fwrapv_-Qunused-arguments_-fPIC_-fPIE_-gdwarf-4_-Wall/constbranchindex/crypto_hash/sha256/rust_crypto/work/target/release/deps/try-baac04c777a2678c.1g22a3jq6o5wtxe0.rcgu.o" "-Wl,--gc-sections" "-pie" "-Wl,-zrelro" "-Wl,-znow" "-Wl,-O1" "-nodefaultlibs" "-L" ".../supercop-data/panther/amd64/try/c/clang_-mcpu=native_-O3_-fwrapv_-Qunused-arguments_-fPIC_-fPIE_-gdwarf-4_-Wall/constbranchindex/crypto_hash/sha256/rust_crypto/work/target/release/deps" "-L" ".../supercop-data/panther/amd64/lib" "-L" ".../supercop-data/panther/amd64/try/c/clang_-mcpu=native_-O3_-fwrapv_-Qunused-arguments_-fPIC_-fPIE_-gdwarf-4_-Wall/constbranchindex/crypto_hash/sha256/rust_crypto/work/target/release/build/crypto_hash_sha256-5cd230be06f90398/out" "-L" ".../supercop-data/panther/amd64/try/c/clang_-mcpu=native_-O3_-fwrapv_-Qunused-arguments_-fPIC_-fPIE_-gdwarf-4_-Wall/constbranchindex/crypto_hash/sha256/rust_crypto/work/target/release/build/rust-crypto-afe9b4ff19c80bbc/out" "-L" "/usr/lib/rustlib/x86_64-unknown-linux-gnu/lib" "-ltry-anything" "-ltry" "-lsupercop" "-lkernelrandombytes" "-lcpucycles" "-lcrypto" "-lntl" "-lnsl" "-lm" "-Wl,-Bstatic" ".../supercop-data/panther/amd64/try/c/clang_-mcpu=native_-O3_-fwrapv_-Qunused-arguments_-fPIC_-fPIE_-gdwarf-4_-Wall/constbranchindex/crypto_hash/sha256/rust_crypto/work/target/release/deps/libcrypto_hash_sha256-b6dc07f49da86745.rlib" ".../supercop-data/panther/amd64/try/c/clang_-mcpu=native_-O3_-fwrapv_-Qunused-arguments_-fPIC_-fPIE_-gdwarf-4_-Wall/constbranchindex/crypto_hash/sha256/rust_crypto/work/target/release/deps/libcrypto-83ceebf3c7290f98.rlib" ".../supercop-data/panther/amd64/try/c/clang_-mcpu=native_-O3_-fwrapv_-Qunused-arguments_-fPIC_-fPIE_-gdwarf-4_-Wall/constbranchindex/crypto_hash/sha256/rust_crypto/work/target/release/deps/libtime-b473882f9f54487c.rlib" ".../supercop-data/panther/amd64/try/c/clang_-mcpu=native_-O3_-fwrapv_-Qunused-arguments_-fPIC_-fPIE_-gdwarf-4_-Wall/constbranchindex/crypto_hash/sha256/rust_crypto/work/target/release/deps/librustc_serialize-72942cfdca4fb518.rlib" ".../supercop-data/panther/amd64/try/c/clang_-mcpu=native_-O3_-fwrapv_-Qunused-arguments_-fPIC_-fPIE_-gdwarf-4_-Wall/constbranchindex/crypto_hash/sha256/rust_crypto/work/target/release/deps/librand-2cdf248a3f2ca473.rlib" ".../supercop-data/panther/amd64/try/c/clang_-mcpu=native_-O3_-fwrapv_-Qunused-arguments_-fPIC_-fPIE_-gdwarf-4_-Wall/constbranchindex/crypto_hash/sha256/rust_crypto/work/target/release/deps/librand-7df229a95dbcb448.rlib" ".../supercop-data/panther/amd64/try/c/clang_-mcpu=native_-O3_-fwrapv_-Qunused-arguments_-fPIC_-fPIE_-gdwarf-4_-Wall/constbranchindex/crypto_hash/sha256/rust_crypto/work/target/release/deps/liblibc-141c671f2ddc755d.rlib" "-Wl,--start-group" "/usr/lib/rustlib/x86_64-unknown-linux-gnu/lib/libstd-6bf3f16f340782ca.rlib" "/usr/lib/rustlib/x86_64-unknown-linux-gnu/lib/libpanic_unwind-13f3099d50c21bc6.rlib" "/usr/lib/rustlib/x86_64-unknown-linux-gnu/lib/libminiz_oxide-a2ba33c985785afe.rlib" "/usr/lib/rustlib/x86_64-unknown-linux-gnu/lib/libadler-3f6e9f8f4afbea6d.rlib" "/usr/lib/rustlib/x86_64-unknown-linux-gnu/lib/libobject-af517d7f13e7c960.rlib" "/usr/lib/rustlib/x86_64-unknown-linux-gnu/lib/libaddr2line-12740563628e601f.rlib" "/usr/lib/rustlib/x86_64-unknown-linux-gnu/lib/libgimli-0ac82a1e1820dd21.rlib" "/usr/lib/rustlib/x86_64-unknown-linux-gnu/lib/librustc_demangle-3ac2d0878c297d42.rlib" "/usr/lib/rustlib/x86_64-unknown-linux-gnu/lib/libhashbrown-c6632ca171f954dd.rlib" "/usr/lib/rustlib/x86_64-unknown-linux-gnu/lib/librustc_std_workspace_alloc-b5bfd0198c7b740d.rlib" "/usr/lib/rustlib/x86_64-unknown-linux-gnu/lib/libunwind-bd645b20c6c7b56d.rlib" "/usr/lib/rustlib/x86_64-unknown-linux-gnu/lib/libcfg_if-b9e1e523c0c29a77.rlib" "/usr/lib/rustlib/x86_64-unknown-linux-gnu/lib/liblibc-dfbef8c525de0186.rlib" "/usr/lib/rustlib/x86_64-unknown-linux-gnu/lib/liballoc-1ebf406bd4ea5769.rlib" "/usr/lib/rustlib/x86_64-unknown-linux-gnu/lib/librustc_std_workspace_core-5e0675f526ef5c6b.rlib" "/usr/lib/rustlib/x86_64-unknown-linux-gnu/lib/libcore-3375e4f89d420e7a.rlib" "-Wl,--end-group" "/usr/lib/rustlib/x86_64-unknown-linux-gnu/lib/libcompiler_builtins-f74b197469e67088.rlib" "-Wl,-Bdynamic" "-lgcc_s" "-lc" "-lm" "-lrt" "-lpthread" "-lutil" "-ldl" "-lutil"
try.c:   = note: /usr/bin/ld: cannot find -lcpucycles
try.c:           collect2: error: ld returned 1 exit status
try.c:
try.c:
try.c: error: aborting due to previous error
try.c:
try.c: error: could not compile `crypto_hash_sha256`.
try.c:
try.c: To learn more, run the command again with --verbose.

Number of similar (implementation,compiler) pairs: 1, namely:
ImplementationCompiler
rust_cryptoclang -mcpu=native -O3 -fwrapv -Qunused-arguments -fPIC -fPIE -gdwarf-4 -Wall (Debian_Clang_11.0.1)

Compiler output


try.c: error: linking with `cc` failed: exit code: 1
try.c:   |
try.c:   = note: "cc" "-Wl,--as-needed" "-Wl,-z,noexecstack" "-m64" "-Wl,--eh-frame-hdr" "-L" "/usr/lib/rustlib/x86_64-unknown-linux-gnu/lib" ".../supercop-data/panther/amd64/try/c/gcc_-march=native_-mtune=native_-O2_-fwrapv_-fPIC_-fPIE_-gdwarf-4_-Wall/constbranchindex/crypto_hash/sha256/rust_crypto/work/target/release/deps/measure-e6f8efcfbea4e30e.measure.2yz52fdu-cgu.0.rcgu.o" ".../supercop-data/panther/amd64/try/c/gcc_-march=native_-mtune=native_-O2_-fwrapv_-fPIC_-fPIE_-gdwarf-4_-Wall/constbranchindex/crypto_hash/sha256/rust_crypto/work/target/release/deps/measure-e6f8efcfbea4e30e.measure.2yz52fdu-cgu.1.rcgu.o" ".../supercop-data/panther/amd64/try/c/gcc_-march=native_-mtune=native_-O2_-fwrapv_-fPIC_-fPIE_-gdwarf-4_-Wall/constbranchindex/crypto_hash/sha256/rust_crypto/work/target/release/deps/measure-e6f8efcfbea4e30e.measure.2yz52fdu-cgu.2.rcgu.o" ".../supercop-data/panther/amd64/try/c/gcc_-march=native_-mtune=native_-O2_-fwrapv_-fPIC_-fPIE_-gdwarf-4_-Wall/constbranchindex/crypto_hash/sha256/rust_crypto/work/target/release/deps/measure-e6f8efcfbea4e30e.measure.2yz52fdu-cgu.3.rcgu.o" ".../supercop-data/panther/amd64/try/c/gcc_-march=native_-mtune=native_-O2_-fwrapv_-fPIC_-fPIE_-gdwarf-4_-Wall/constbranchindex/crypto_hash/sha256/rust_crypto/work/target/release/deps/measure-e6f8efcfbea4e30e.measure.2yz52fdu-cgu.4.rcgu.o" "-o" ".../supercop-data/panther/amd64/try/c/gcc_-march=native_-mtune=native_-O2_-fwrapv_-fPIC_-fPIE_-gdwarf-4_-Wall/constbranchindex/crypto_hash/sha256/rust_crypto/work/target/release/deps/measure-e6f8efcfbea4e30e" ".../supercop-data/panther/amd64/try/c/gcc_-march=native_-mtune=native_-O2_-fwrapv_-fPIC_-fPIE_-gdwarf-4_-Wall/constbranchindex/crypto_hash/sha256/rust_crypto/work/target/release/deps/measure-e6f8efcfbea4e30e.2vbk2gyir92gcind.rcgu.o" "-Wl,--gc-sections" "-pie" "-Wl,-zrelro" "-Wl,-znow" "-Wl,-O1" "-nodefaultlibs" "-L" ".../supercop-data/panther/amd64/try/c/gcc_-march=native_-mtune=native_-O2_-fwrapv_-fPIC_-fPIE_-gdwarf-4_-Wall/constbranchindex/crypto_hash/sha256/rust_crypto/work/target/release/deps" "-L" ".../supercop-data/panther/amd64/lib" "-L" ".../supercop-data/panther/amd64/try/c/gcc_-march=native_-mtune=native_-O2_-fwrapv_-fPIC_-fPIE_-gdwarf-4_-Wall/constbranchindex/crypto_hash/sha256/rust_crypto/work/target/release/build/crypto_hash_sha256-5cd230be06f90398/out" "-L" ".../supercop-data/panther/amd64/try/c/gcc_-march=native_-mtune=native_-O2_-fwrapv_-fPIC_-fPIE_-gdwarf-4_-Wall/constbranchindex/crypto_hash/sha256/rust_crypto/work/target/release/build/rust-crypto-afe9b4ff19c80bbc/out" "-L" "/usr/lib/rustlib/x86_64-unknown-linux-gnu/lib" "-lmeasure-anything" "-lmeasure" "-lsupercop" "-lkernelrandombytes" "-lcpucycles" "-lcrypto" "-lntl" "-lnsl" "-lm" "-Wl,-Bstatic" ".../supercop-data/panther/amd64/try/c/gcc_-march=native_-mtune=native_-O2_-fwrapv_-fPIC_-fPIE_-gdwarf-4_-Wall/constbranchindex/crypto_hash/sha256/rust_crypto/work/target/release/deps/libcrypto_hash_sha256-b6dc07f49da86745.rlib" ".../supercop-data/panther/amd64/try/c/gcc_-march=native_-mtune=native_-O2_-fwrapv_-fPIC_-fPIE_-gdwarf-4_-Wall/constbranchindex/crypto_hash/sha256/rust_crypto/work/target/release/deps/libcrypto-83ceebf3c7290f98.rlib" ".../supercop-data/panther/amd64/try/c/gcc_-march=native_-mtune=native_-O2_-fwrapv_-fPIC_-fPIE_-gdwarf-4_-Wall/constbranchindex/crypto_hash/sha256/rust_crypto/work/target/release/deps/libtime-b473882f9f54487c.rlib" ".../supercop-data/panther/amd64/try/c/gcc_-march=native_-mtune=native_-O2_-fwrapv_-fPIC_-fPIE_-gdwarf-4_-Wall/constbranchindex/crypto_hash/sha256/rust_crypto/work/target/release/deps/librustc_serialize-72942cfdca4fb518.rlib" ".../supercop-data/panther/amd64/try/c/gcc_-march=native_-mtune=native_-O2_-fwrapv_-fPIC_-fPIE_-gdwarf-4_-Wall/constbranchindex/crypto_hash/sha256/rust_crypto/work/target/release/deps/librand-2cdf248a3f2ca473.rlib" ".../supercop-data/panther/amd64/try/c/gcc_-march=native_-mtune=native_-O2_-fwrapv_-fPIC_-fPIE_-gdwarf-4_-Wall/constbranchindex/crypto_hash/sha256/rust_crypto/work/target/release/deps/librand-7df229a95dbcb448.rlib" ".../supercop-data/panther/amd64/try/c/gcc_-march=native_-mtune=native_-O2_-fwrapv_-fPIC_-fPIE_-gdwarf-4_-Wall/constbranchindex/crypto_hash/sha256/rust_crypto/work/target/release/deps/liblibc-141c671f2ddc755d.rlib" "-Wl,--start-group" "/usr/lib/rustlib/x86_64-unknown-linux-gnu/lib/libstd-6bf3f16f340782ca.rlib" "/usr/lib/rustlib/x86_64-unknown-linux-gnu/lib/libpanic_unwind-13f3099d50c21bc6.rlib" "/usr/lib/rustlib/x86_64-unknown-linux-gnu/lib/libminiz_oxide-a2ba33c985785afe.rlib" "/usr/lib/rustlib/x86_64-unknown-linux-gnu/lib/libadler-3f6e9f8f4afbea6d.rlib" "/usr/lib/rustlib/x86_64-unknown-linux-gnu/lib/libobject-af517d7f13e7c960.rlib" "/usr/lib/rustlib/x86_64-unknown-linux-gnu/lib/libaddr2line-12740563628e601f.rlib" "/usr/lib/rustlib/x86_64-unknown-linux-gnu/lib/libgimli-0ac82a1e1820dd21.rlib" "/usr/lib/rustlib/x86_64-unknown-linux-gnu/lib/librustc_demangle-3ac2d0878c297d42.rlib" "/usr/lib/rustlib/x86_64-unknown-linux-gnu/lib/libhashbrown-c6632ca171f954dd.rlib" "/usr/lib/rustlib/x86_64-unknown-linux-gnu/lib/librustc_std_workspace_alloc-b5bfd0198c7b740d.rlib" "/usr/lib/rustlib/x86_64-unknown-linux-gnu/lib/libunwind-bd645b20c6c7b56d.rlib" "/usr/lib/rustlib/x86_64-unknown-linux-gnu/lib/libcfg_if-b9e1e523c0c29a77.rlib" "/usr/lib/rustlib/x86_64-unknown-linux-gnu/lib/liblibc-dfbef8c525de0186.rlib" "/usr/lib/rustlib/x86_64-unknown-linux-gnu/lib/liballoc-1ebf406bd4ea5769.rlib" "/usr/lib/rustlib/x86_64-unknown-linux-gnu/lib/librustc_std_workspace_core-5e0675f526ef5c6b.rlib" "/usr/lib/rustlib/x86_64-unknown-linux-gnu/lib/libcore-3375e4f89d420e7a.rlib" "-Wl,--end-group" "/usr/lib/rustlib/x86_64-unknown-linux-gnu/lib/libcompiler_builtins-f74b197469e67088.rlib" "-Wl,-Bdynamic" "-lgcc_s" "-lc" "-lm" "-lrt" "-lpthread" "-lutil" "-ldl" "-lutil"
try.c:   = note: /usr/bin/ld: cannot find -lcpucycles
try.c:           collect2: error: ld returned 1 exit status
try.c:
try.c:
try.c: error: aborting due to previous error
try.c:
try.c: error: could not compile `crypto_hash_sha256`.
try.c:
try.c: To learn more, run the command again with --verbose.

Number of similar (implementation,compiler) pairs: 1, namely:
ImplementationCompiler
rust_cryptogcc -march=native -mtune=native -O2 -fwrapv -fPIC -fPIE -gdwarf-4 -Wall (10.2.1_20210110)

Compiler output


try.c: error: linking with `cc` failed: exit code: 1
try.c:   |
try.c:   = note: "cc" "-Wl,--as-needed" "-Wl,-z,noexecstack" "-m64" "-Wl,--eh-frame-hdr" "-L" "/usr/lib/rustlib/x86_64-unknown-linux-gnu/lib" ".../supercop-data/panther/amd64/try/c/gcc_-march=native_-mtune=native_-O3_-fwrapv_-fPIC_-fPIE_-gdwarf-4_-Wall/constbranchindex/crypto_hash/sha256/rust_crypto/work/target/release/deps/try_small-f566cacc72890263.try_small.83ks8n5m-cgu.0.rcgu.o" ".../supercop-data/panther/amd64/try/c/gcc_-march=native_-mtune=native_-O3_-fwrapv_-fPIC_-fPIE_-gdwarf-4_-Wall/constbranchindex/crypto_hash/sha256/rust_crypto/work/target/release/deps/try_small-f566cacc72890263.try_small.83ks8n5m-cgu.1.rcgu.o" ".../supercop-data/panther/amd64/try/c/gcc_-march=native_-mtune=native_-O3_-fwrapv_-fPIC_-fPIE_-gdwarf-4_-Wall/constbranchindex/crypto_hash/sha256/rust_crypto/work/target/release/deps/try_small-f566cacc72890263.try_small.83ks8n5m-cgu.2.rcgu.o" ".../supercop-data/panther/amd64/try/c/gcc_-march=native_-mtune=native_-O3_-fwrapv_-fPIC_-fPIE_-gdwarf-4_-Wall/constbranchindex/crypto_hash/sha256/rust_crypto/work/target/release/deps/try_small-f566cacc72890263.try_small.83ks8n5m-cgu.3.rcgu.o" ".../supercop-data/panther/amd64/try/c/gcc_-march=native_-mtune=native_-O3_-fwrapv_-fPIC_-fPIE_-gdwarf-4_-Wall/constbranchindex/crypto_hash/sha256/rust_crypto/work/target/release/deps/try_small-f566cacc72890263.try_small.83ks8n5m-cgu.4.rcgu.o" "-o" ".../supercop-data/panther/amd64/try/c/gcc_-march=native_-mtune=native_-O3_-fwrapv_-fPIC_-fPIE_-gdwarf-4_-Wall/constbranchindex/crypto_hash/sha256/rust_crypto/work/target/release/deps/try_small-f566cacc72890263" ".../supercop-data/panther/amd64/try/c/gcc_-march=native_-mtune=native_-O3_-fwrapv_-fPIC_-fPIE_-gdwarf-4_-Wall/constbranchindex/crypto_hash/sha256/rust_crypto/work/target/release/deps/try_small-f566cacc72890263.2yzzwl19n3ayhtwn.rcgu.o" "-Wl,--gc-sections" "-pie" "-Wl,-zrelro" "-Wl,-znow" "-Wl,-O1" "-nodefaultlibs" "-L" ".../supercop-data/panther/amd64/try/c/gcc_-march=native_-mtune=native_-O3_-fwrapv_-fPIC_-fPIE_-gdwarf-4_-Wall/constbranchindex/crypto_hash/sha256/rust_crypto/work/target/release/deps" "-L" ".../supercop-data/panther/amd64/lib" "-L" ".../supercop-data/panther/amd64/try/c/gcc_-march=native_-mtune=native_-O3_-fwrapv_-fPIC_-fPIE_-gdwarf-4_-Wall/constbranchindex/crypto_hash/sha256/rust_crypto/work/target/release/build/crypto_hash_sha256-5cd230be06f90398/out" "-L" ".../supercop-data/panther/amd64/try/c/gcc_-march=native_-mtune=native_-O3_-fwrapv_-fPIC_-fPIE_-gdwarf-4_-Wall/constbranchindex/crypto_hash/sha256/rust_crypto/work/target/release/build/rust-crypto-afe9b4ff19c80bbc/out" "-L" "/usr/lib/rustlib/x86_64-unknown-linux-gnu/lib" "-ltry-anything" "-ltry-small" "-lsupercop" "-lkernelrandombytes" "-lcpucycles" "-lcrypto" "-lntl" "-lnsl" "-lm" "-Wl,-Bstatic" ".../supercop-data/panther/amd64/try/c/gcc_-march=native_-mtune=native_-O3_-fwrapv_-fPIC_-fPIE_-gdwarf-4_-Wall/constbranchindex/crypto_hash/sha256/rust_crypto/work/target/release/deps/libcrypto_hash_sha256-b6dc07f49da86745.rlib" ".../supercop-data/panther/amd64/try/c/gcc_-march=native_-mtune=native_-O3_-fwrapv_-fPIC_-fPIE_-gdwarf-4_-Wall/constbranchindex/crypto_hash/sha256/rust_crypto/work/target/release/deps/libcrypto-83ceebf3c7290f98.rlib" ".../supercop-data/panther/amd64/try/c/gcc_-march=native_-mtune=native_-O3_-fwrapv_-fPIC_-fPIE_-gdwarf-4_-Wall/constbranchindex/crypto_hash/sha256/rust_crypto/work/target/release/deps/libtime-b473882f9f54487c.rlib" ".../supercop-data/panther/amd64/try/c/gcc_-march=native_-mtune=native_-O3_-fwrapv_-fPIC_-fPIE_-gdwarf-4_-Wall/constbranchindex/crypto_hash/sha256/rust_crypto/work/target/release/deps/librustc_serialize-72942cfdca4fb518.rlib" ".../supercop-data/panther/amd64/try/c/gcc_-march=native_-mtune=native_-O3_-fwrapv_-fPIC_-fPIE_-gdwarf-4_-Wall/constbranchindex/crypto_hash/sha256/rust_crypto/work/target/release/deps/librand-2cdf248a3f2ca473.rlib" ".../supercop-data/panther/amd64/try/c/gcc_-march=native_-mtune=native_-O3_-fwrapv_-fPIC_-fPIE_-gdwarf-4_-Wall/constbranchindex/crypto_hash/sha256/rust_crypto/work/target/release/deps/librand-7df229a95dbcb448.rlib" ".../supercop-data/panther/amd64/try/c/gcc_-march=native_-mtune=native_-O3_-fwrapv_-fPIC_-fPIE_-gdwarf-4_-Wall/constbranchindex/crypto_hash/sha256/rust_crypto/work/target/release/deps/liblibc-141c671f2ddc755d.rlib" "-Wl,--start-group" "/usr/lib/rustlib/x86_64-unknown-linux-gnu/lib/libstd-6bf3f16f340782ca.rlib" "/usr/lib/rustlib/x86_64-unknown-linux-gnu/lib/libpanic_unwind-13f3099d50c21bc6.rlib" "/usr/lib/rustlib/x86_64-unknown-linux-gnu/lib/libminiz_oxide-a2ba33c985785afe.rlib" "/usr/lib/rustlib/x86_64-unknown-linux-gnu/lib/libadler-3f6e9f8f4afbea6d.rlib" "/usr/lib/rustlib/x86_64-unknown-linux-gnu/lib/libobject-af517d7f13e7c960.rlib" "/usr/lib/rustlib/x86_64-unknown-linux-gnu/lib/libaddr2line-12740563628e601f.rlib" "/usr/lib/rustlib/x86_64-unknown-linux-gnu/lib/libgimli-0ac82a1e1820dd21.rlib" "/usr/lib/rustlib/x86_64-unknown-linux-gnu/lib/librustc_demangle-3ac2d0878c297d42.rlib" "/usr/lib/rustlib/x86_64-unknown-linux-gnu/lib/libhashbrown-c6632ca171f954dd.rlib" "/usr/lib/rustlib/x86_64-unknown-linux-gnu/lib/librustc_std_workspace_alloc-b5bfd0198c7b740d.rlib" "/usr/lib/rustlib/x86_64-unknown-linux-gnu/lib/libunwind-bd645b20c6c7b56d.rlib" "/usr/lib/rustlib/x86_64-unknown-linux-gnu/lib/libcfg_if-b9e1e523c0c29a77.rlib" "/usr/lib/rustlib/x86_64-unknown-linux-gnu/lib/liblibc-dfbef8c525de0186.rlib" "/usr/lib/rustlib/x86_64-unknown-linux-gnu/lib/liballoc-1ebf406bd4ea5769.rlib" "/usr/lib/rustlib/x86_64-unknown-linux-gnu/lib/librustc_std_workspace_core-5e0675f526ef5c6b.rlib" "/usr/lib/rustlib/x86_64-unknown-linux-gnu/lib/libcore-3375e4f89d420e7a.rlib" "-Wl,--end-group" "/usr/lib/rustlib/x86_64-unknown-linux-gnu/lib/libcompiler_builtins-f74b197469e67088.rlib" "-Wl,-Bdynamic" "-lgcc_s" "-lc" "-lm" "-lrt" "-lpthread" "-lutil" "-ldl" "-lutil"
try.c:   = note: /usr/bin/ld: cannot find -lcpucycles
try.c:           collect2: error: ld returned 1 exit status
try.c:
try.c:
try.c: error: aborting due to previous error
try.c:
try.c: error: could not compile `crypto_hash_sha256`.
try.c:
try.c: To learn more, run the command again with --verbose.

Number of similar (implementation,compiler) pairs: 1, namely:
ImplementationCompiler
rust_cryptogcc -march=native -mtune=native -O3 -fwrapv -fPIC -fPIE -gdwarf-4 -Wall (10.2.1_20210110)

Compiler output


try.c: error: linking with `cc` failed: exit code: 1
try.c:   |
try.c:   = note: "cc" "-Wl,--as-needed" "-Wl,-z,noexecstack" "-m64" "-Wl,--eh-frame-hdr" "-L" "/usr/lib/rustlib/x86_64-unknown-linux-gnu/lib" ".../supercop-data/panther/amd64/try/c/gcc_-march=native_-mtune=native_-O_-fwrapv_-fPIC_-fPIE_-gdwarf-4_-Wall/constbranchindex/crypto_hash/sha256/rust_crypto/work/target/release/deps/try_small-f566cacc72890263.try_small.83ks8n5m-cgu.0.rcgu.o" ".../supercop-data/panther/amd64/try/c/gcc_-march=native_-mtune=native_-O_-fwrapv_-fPIC_-fPIE_-gdwarf-4_-Wall/constbranchindex/crypto_hash/sha256/rust_crypto/work/target/release/deps/try_small-f566cacc72890263.try_small.83ks8n5m-cgu.1.rcgu.o" ".../supercop-data/panther/amd64/try/c/gcc_-march=native_-mtune=native_-O_-fwrapv_-fPIC_-fPIE_-gdwarf-4_-Wall/constbranchindex/crypto_hash/sha256/rust_crypto/work/target/release/deps/try_small-f566cacc72890263.try_small.83ks8n5m-cgu.2.rcgu.o" ".../supercop-data/panther/amd64/try/c/gcc_-march=native_-mtune=native_-O_-fwrapv_-fPIC_-fPIE_-gdwarf-4_-Wall/constbranchindex/crypto_hash/sha256/rust_crypto/work/target/release/deps/try_small-f566cacc72890263.try_small.83ks8n5m-cgu.3.rcgu.o" ".../supercop-data/panther/amd64/try/c/gcc_-march=native_-mtune=native_-O_-fwrapv_-fPIC_-fPIE_-gdwarf-4_-Wall/constbranchindex/crypto_hash/sha256/rust_crypto/work/target/release/deps/try_small-f566cacc72890263.try_small.83ks8n5m-cgu.4.rcgu.o" "-o" ".../supercop-data/panther/amd64/try/c/gcc_-march=native_-mtune=native_-O_-fwrapv_-fPIC_-fPIE_-gdwarf-4_-Wall/constbranchindex/crypto_hash/sha256/rust_crypto/work/target/release/deps/try_small-f566cacc72890263" ".../supercop-data/panther/amd64/try/c/gcc_-march=native_-mtune=native_-O_-fwrapv_-fPIC_-fPIE_-gdwarf-4_-Wall/constbranchindex/crypto_hash/sha256/rust_crypto/work/target/release/deps/try_small-f566cacc72890263.2yzzwl19n3ayhtwn.rcgu.o" "-Wl,--gc-sections" "-pie" "-Wl,-zrelro" "-Wl,-znow" "-Wl,-O1" "-nodefaultlibs" "-L" ".../supercop-data/panther/amd64/try/c/gcc_-march=native_-mtune=native_-O_-fwrapv_-fPIC_-fPIE_-gdwarf-4_-Wall/constbranchindex/crypto_hash/sha256/rust_crypto/work/target/release/deps" "-L" ".../supercop-data/panther/amd64/lib" "-L" ".../supercop-data/panther/amd64/try/c/gcc_-march=native_-mtune=native_-O_-fwrapv_-fPIC_-fPIE_-gdwarf-4_-Wall/constbranchindex/crypto_hash/sha256/rust_crypto/work/target/release/build/crypto_hash_sha256-5cd230be06f90398/out" "-L" ".../supercop-data/panther/amd64/try/c/gcc_-march=native_-mtune=native_-O_-fwrapv_-fPIC_-fPIE_-gdwarf-4_-Wall/constbranchindex/crypto_hash/sha256/rust_crypto/work/target/release/build/rust-crypto-afe9b4ff19c80bbc/out" "-L" "/usr/lib/rustlib/x86_64-unknown-linux-gnu/lib" "-ltry-anything" "-ltry-small" "-lsupercop" "-lkernelrandombytes" "-lcpucycles" "-lcrypto" "-lntl" "-lnsl" "-lm" "-Wl,-Bstatic" ".../supercop-data/panther/amd64/try/c/gcc_-march=native_-mtune=native_-O_-fwrapv_-fPIC_-fPIE_-gdwarf-4_-Wall/constbranchindex/crypto_hash/sha256/rust_crypto/work/target/release/deps/libcrypto_hash_sha256-b6dc07f49da86745.rlib" ".../supercop-data/panther/amd64/try/c/gcc_-march=native_-mtune=native_-O_-fwrapv_-fPIC_-fPIE_-gdwarf-4_-Wall/constbranchindex/crypto_hash/sha256/rust_crypto/work/target/release/deps/libcrypto-83ceebf3c7290f98.rlib" ".../supercop-data/panther/amd64/try/c/gcc_-march=native_-mtune=native_-O_-fwrapv_-fPIC_-fPIE_-gdwarf-4_-Wall/constbranchindex/crypto_hash/sha256/rust_crypto/work/target/release/deps/libtime-b473882f9f54487c.rlib" ".../supercop-data/panther/amd64/try/c/gcc_-march=native_-mtune=native_-O_-fwrapv_-fPIC_-fPIE_-gdwarf-4_-Wall/constbranchindex/crypto_hash/sha256/rust_crypto/work/target/release/deps/librustc_serialize-72942cfdca4fb518.rlib" ".../supercop-data/panther/amd64/try/c/gcc_-march=native_-mtune=native_-O_-fwrapv_-fPIC_-fPIE_-gdwarf-4_-Wall/constbranchindex/crypto_hash/sha256/rust_crypto/work/target/release/deps/librand-2cdf248a3f2ca473.rlib" ".../supercop-data/panther/amd64/try/c/gcc_-march=native_-mtune=native_-O_-fwrapv_-fPIC_-fPIE_-gdwarf-4_-Wall/constbranchindex/crypto_hash/sha256/rust_crypto/work/target/release/deps/librand-7df229a95dbcb448.rlib" ".../supercop-data/panther/amd64/try/c/gcc_-march=native_-mtune=native_-O_-fwrapv_-fPIC_-fPIE_-gdwarf-4_-Wall/constbranchindex/crypto_hash/sha256/rust_crypto/work/target/release/deps/liblibc-141c671f2ddc755d.rlib" "-Wl,--start-group" "/usr/lib/rustlib/x86_64-unknown-linux-gnu/lib/libstd-6bf3f16f340782ca.rlib" "/usr/lib/rustlib/x86_64-unknown-linux-gnu/lib/libpanic_unwind-13f3099d50c21bc6.rlib" "/usr/lib/rustlib/x86_64-unknown-linux-gnu/lib/libminiz_oxide-a2ba33c985785afe.rlib" "/usr/lib/rustlib/x86_64-unknown-linux-gnu/lib/libadler-3f6e9f8f4afbea6d.rlib" "/usr/lib/rustlib/x86_64-unknown-linux-gnu/lib/libobject-af517d7f13e7c960.rlib" "/usr/lib/rustlib/x86_64-unknown-linux-gnu/lib/libaddr2line-12740563628e601f.rlib" "/usr/lib/rustlib/x86_64-unknown-linux-gnu/lib/libgimli-0ac82a1e1820dd21.rlib" "/usr/lib/rustlib/x86_64-unknown-linux-gnu/lib/librustc_demangle-3ac2d0878c297d42.rlib" "/usr/lib/rustlib/x86_64-unknown-linux-gnu/lib/libhashbrown-c6632ca171f954dd.rlib" "/usr/lib/rustlib/x86_64-unknown-linux-gnu/lib/librustc_std_workspace_alloc-b5bfd0198c7b740d.rlib" "/usr/lib/rustlib/x86_64-unknown-linux-gnu/lib/libunwind-bd645b20c6c7b56d.rlib" "/usr/lib/rustlib/x86_64-unknown-linux-gnu/lib/libcfg_if-b9e1e523c0c29a77.rlib" "/usr/lib/rustlib/x86_64-unknown-linux-gnu/lib/liblibc-dfbef8c525de0186.rlib" "/usr/lib/rustlib/x86_64-unknown-linux-gnu/lib/liballoc-1ebf406bd4ea5769.rlib" "/usr/lib/rustlib/x86_64-unknown-linux-gnu/lib/librustc_std_workspace_core-5e0675f526ef5c6b.rlib" "/usr/lib/rustlib/x86_64-unknown-linux-gnu/lib/libcore-3375e4f89d420e7a.rlib" "-Wl,--end-group" "/usr/lib/rustlib/x86_64-unknown-linux-gnu/lib/libcompiler_builtins-f74b197469e67088.rlib" "-Wl,-Bdynamic" "-lgcc_s" "-lc" "-lm" "-lrt" "-lpthread" "-lutil" "-ldl" "-lutil"
try.c:   = note: /usr/bin/ld: cannot find -lcpucycles
try.c:           collect2: error: ld returned 1 exit status
try.c:
try.c:
try.c: error: aborting due to previous error
try.c:
try.c: error: could not compile `crypto_hash_sha256`.
try.c:
try.c: To learn more, run the command again with --verbose.

Number of similar (implementation,compiler) pairs: 1, namely:
ImplementationCompiler
rust_cryptogcc -march=native -mtune=native -O -fwrapv -fPIC -fPIE -gdwarf-4 -Wall (10.2.1_20210110)

Compiler output


try.c: error: linking with `cc` failed: exit code: 1
try.c:   |
try.c:   = note: "cc" "-Wl,--as-needed" "-Wl,-z,noexecstack" "-m64" "-Wl,--eh-frame-hdr" "-L" "/usr/lib/rustlib/x86_64-unknown-linux-gnu/lib" ".../supercop-data/panther/amd64/try/c/gcc_-march=native_-mtune=native_-Os_-fwrapv_-fPIC_-fPIE_-gdwarf-4_-Wall/constbranchindex/crypto_hash/sha256/rust_crypto/work/target/release/deps/try_small-f566cacc72890263.try_small.83ks8n5m-cgu.0.rcgu.o" ".../supercop-data/panther/amd64/try/c/gcc_-march=native_-mtune=native_-Os_-fwrapv_-fPIC_-fPIE_-gdwarf-4_-Wall/constbranchindex/crypto_hash/sha256/rust_crypto/work/target/release/deps/try_small-f566cacc72890263.try_small.83ks8n5m-cgu.1.rcgu.o" ".../supercop-data/panther/amd64/try/c/gcc_-march=native_-mtune=native_-Os_-fwrapv_-fPIC_-fPIE_-gdwarf-4_-Wall/constbranchindex/crypto_hash/sha256/rust_crypto/work/target/release/deps/try_small-f566cacc72890263.try_small.83ks8n5m-cgu.2.rcgu.o" ".../supercop-data/panther/amd64/try/c/gcc_-march=native_-mtune=native_-Os_-fwrapv_-fPIC_-fPIE_-gdwarf-4_-Wall/constbranchindex/crypto_hash/sha256/rust_crypto/work/target/release/deps/try_small-f566cacc72890263.try_small.83ks8n5m-cgu.3.rcgu.o" ".../supercop-data/panther/amd64/try/c/gcc_-march=native_-mtune=native_-Os_-fwrapv_-fPIC_-fPIE_-gdwarf-4_-Wall/constbranchindex/crypto_hash/sha256/rust_crypto/work/target/release/deps/try_small-f566cacc72890263.try_small.83ks8n5m-cgu.4.rcgu.o" "-o" ".../supercop-data/panther/amd64/try/c/gcc_-march=native_-mtune=native_-Os_-fwrapv_-fPIC_-fPIE_-gdwarf-4_-Wall/constbranchindex/crypto_hash/sha256/rust_crypto/work/target/release/deps/try_small-f566cacc72890263" ".../supercop-data/panther/amd64/try/c/gcc_-march=native_-mtune=native_-Os_-fwrapv_-fPIC_-fPIE_-gdwarf-4_-Wall/constbranchindex/crypto_hash/sha256/rust_crypto/work/target/release/deps/try_small-f566cacc72890263.2yzzwl19n3ayhtwn.rcgu.o" "-Wl,--gc-sections" "-pie" "-Wl,-zrelro" "-Wl,-znow" "-Wl,-O1" "-nodefaultlibs" "-L" ".../supercop-data/panther/amd64/try/c/gcc_-march=native_-mtune=native_-Os_-fwrapv_-fPIC_-fPIE_-gdwarf-4_-Wall/constbranchindex/crypto_hash/sha256/rust_crypto/work/target/release/deps" "-L" ".../supercop-data/panther/amd64/lib" "-L" ".../supercop-data/panther/amd64/try/c/gcc_-march=native_-mtune=native_-Os_-fwrapv_-fPIC_-fPIE_-gdwarf-4_-Wall/constbranchindex/crypto_hash/sha256/rust_crypto/work/target/release/build/crypto_hash_sha256-5cd230be06f90398/out" "-L" ".../supercop-data/panther/amd64/try/c/gcc_-march=native_-mtune=native_-Os_-fwrapv_-fPIC_-fPIE_-gdwarf-4_-Wall/constbranchindex/crypto_hash/sha256/rust_crypto/work/target/release/build/rust-crypto-afe9b4ff19c80bbc/out" "-L" "/usr/lib/rustlib/x86_64-unknown-linux-gnu/lib" "-ltry-anything" "-ltry-small" "-lsupercop" "-lkernelrandombytes" "-lcpucycles" "-lcrypto" "-lntl" "-lnsl" "-lm" "-Wl,-Bstatic" ".../supercop-data/panther/amd64/try/c/gcc_-march=native_-mtune=native_-Os_-fwrapv_-fPIC_-fPIE_-gdwarf-4_-Wall/constbranchindex/crypto_hash/sha256/rust_crypto/work/target/release/deps/libcrypto_hash_sha256-b6dc07f49da86745.rlib" ".../supercop-data/panther/amd64/try/c/gcc_-march=native_-mtune=native_-Os_-fwrapv_-fPIC_-fPIE_-gdwarf-4_-Wall/constbranchindex/crypto_hash/sha256/rust_crypto/work/target/release/deps/libcrypto-83ceebf3c7290f98.rlib" ".../supercop-data/panther/amd64/try/c/gcc_-march=native_-mtune=native_-Os_-fwrapv_-fPIC_-fPIE_-gdwarf-4_-Wall/constbranchindex/crypto_hash/sha256/rust_crypto/work/target/release/deps/libtime-b473882f9f54487c.rlib" ".../supercop-data/panther/amd64/try/c/gcc_-march=native_-mtune=native_-Os_-fwrapv_-fPIC_-fPIE_-gdwarf-4_-Wall/constbranchindex/crypto_hash/sha256/rust_crypto/work/target/release/deps/librustc_serialize-72942cfdca4fb518.rlib" ".../supercop-data/panther/amd64/try/c/gcc_-march=native_-mtune=native_-Os_-fwrapv_-fPIC_-fPIE_-gdwarf-4_-Wall/constbranchindex/crypto_hash/sha256/rust_crypto/work/target/release/deps/librand-2cdf248a3f2ca473.rlib" ".../supercop-data/panther/amd64/try/c/gcc_-march=native_-mtune=native_-Os_-fwrapv_-fPIC_-fPIE_-gdwarf-4_-Wall/constbranchindex/crypto_hash/sha256/rust_crypto/work/target/release/deps/librand-7df229a95dbcb448.rlib" ".../supercop-data/panther/amd64/try/c/gcc_-march=native_-mtune=native_-Os_-fwrapv_-fPIC_-fPIE_-gdwarf-4_-Wall/constbranchindex/crypto_hash/sha256/rust_crypto/work/target/release/deps/liblibc-141c671f2ddc755d.rlib" "-Wl,--start-group" "/usr/lib/rustlib/x86_64-unknown-linux-gnu/lib/libstd-6bf3f16f340782ca.rlib" "/usr/lib/rustlib/x86_64-unknown-linux-gnu/lib/libpanic_unwind-13f3099d50c21bc6.rlib" "/usr/lib/rustlib/x86_64-unknown-linux-gnu/lib/libminiz_oxide-a2ba33c985785afe.rlib" "/usr/lib/rustlib/x86_64-unknown-linux-gnu/lib/libadler-3f6e9f8f4afbea6d.rlib" "/usr/lib/rustlib/x86_64-unknown-linux-gnu/lib/libobject-af517d7f13e7c960.rlib" "/usr/lib/rustlib/x86_64-unknown-linux-gnu/lib/libaddr2line-12740563628e601f.rlib" "/usr/lib/rustlib/x86_64-unknown-linux-gnu/lib/libgimli-0ac82a1e1820dd21.rlib" "/usr/lib/rustlib/x86_64-unknown-linux-gnu/lib/librustc_demangle-3ac2d0878c297d42.rlib" "/usr/lib/rustlib/x86_64-unknown-linux-gnu/lib/libhashbrown-c6632ca171f954dd.rlib" "/usr/lib/rustlib/x86_64-unknown-linux-gnu/lib/librustc_std_workspace_alloc-b5bfd0198c7b740d.rlib" "/usr/lib/rustlib/x86_64-unknown-linux-gnu/lib/libunwind-bd645b20c6c7b56d.rlib" "/usr/lib/rustlib/x86_64-unknown-linux-gnu/lib/libcfg_if-b9e1e523c0c29a77.rlib" "/usr/lib/rustlib/x86_64-unknown-linux-gnu/lib/liblibc-dfbef8c525de0186.rlib" "/usr/lib/rustlib/x86_64-unknown-linux-gnu/lib/liballoc-1ebf406bd4ea5769.rlib" "/usr/lib/rustlib/x86_64-unknown-linux-gnu/lib/librustc_std_workspace_core-5e0675f526ef5c6b.rlib" "/usr/lib/rustlib/x86_64-unknown-linux-gnu/lib/libcore-3375e4f89d420e7a.rlib" "-Wl,--end-group" "/usr/lib/rustlib/x86_64-unknown-linux-gnu/lib/libcompiler_builtins-f74b197469e67088.rlib" "-Wl,-Bdynamic" "-lgcc_s" "-lc" "-lm" "-lrt" "-lpthread" "-lutil" "-ldl" "-lutil"
try.c:   = note: /usr/bin/ld: cannot find -lcpucycles
try.c:           collect2: error: ld returned 1 exit status
try.c:
try.c:
try.c: error: aborting due to previous error
try.c:
try.c: error: could not compile `crypto_hash_sha256`.
try.c:
try.c: To learn more, run the command again with --verbose.

Number of similar (implementation,compiler) pairs: 1, namely:
ImplementationCompiler
rust_cryptogcc -march=native -mtune=native -Os -fwrapv -fPIC -fPIE -gdwarf-4 -Wall (10.2.1_20210110)

Compiler output


try.c: error: linking with `cc` failed: exit code: 1
try.c:   |
try.c:   = note: "cc" "-Wl,--as-needed" "-Wl,-z,noexecstack" "-m64" "-Wl,--eh-frame-hdr" "-L" "/usr/lib/rustlib/x86_64-unknown-linux-gnu/lib" ".../supercop-data/panther/amd64/try/c/clang_-march=native_-O2_-fwrapv_-Qunused-arguments_-fPIC_-fPIE_-gdwarf-4_-Wall/constbranchindex/crypto_hash/sha256/rust_sha2/work/target/release/deps/try-444f87ff176ff1a2.try.eh7uyr3c-cgu.0.rcgu.o" ".../supercop-data/panther/amd64/try/c/clang_-march=native_-O2_-fwrapv_-Qunused-arguments_-fPIC_-fPIE_-gdwarf-4_-Wall/constbranchindex/crypto_hash/sha256/rust_sha2/work/target/release/deps/try-444f87ff176ff1a2.try.eh7uyr3c-cgu.1.rcgu.o" ".../supercop-data/panther/amd64/try/c/clang_-march=native_-O2_-fwrapv_-Qunused-arguments_-fPIC_-fPIE_-gdwarf-4_-Wall/constbranchindex/crypto_hash/sha256/rust_sha2/work/target/release/deps/try-444f87ff176ff1a2.try.eh7uyr3c-cgu.2.rcgu.o" ".../supercop-data/panther/amd64/try/c/clang_-march=native_-O2_-fwrapv_-Qunused-arguments_-fPIC_-fPIE_-gdwarf-4_-Wall/constbranchindex/crypto_hash/sha256/rust_sha2/work/target/release/deps/try-444f87ff176ff1a2.try.eh7uyr3c-cgu.3.rcgu.o" ".../supercop-data/panther/amd64/try/c/clang_-march=native_-O2_-fwrapv_-Qunused-arguments_-fPIC_-fPIE_-gdwarf-4_-Wall/constbranchindex/crypto_hash/sha256/rust_sha2/work/target/release/deps/try-444f87ff176ff1a2.try.eh7uyr3c-cgu.4.rcgu.o" "-o" ".../supercop-data/panther/amd64/try/c/clang_-march=native_-O2_-fwrapv_-Qunused-arguments_-fPIC_-fPIE_-gdwarf-4_-Wall/constbranchindex/crypto_hash/sha256/rust_sha2/work/target/release/deps/try-444f87ff176ff1a2" ".../supercop-data/panther/amd64/try/c/clang_-march=native_-O2_-fwrapv_-Qunused-arguments_-fPIC_-fPIE_-gdwarf-4_-Wall/constbranchindex/crypto_hash/sha256/rust_sha2/work/target/release/deps/try-444f87ff176ff1a2.4qvuycn7jdjdfii3.rcgu.o" "-Wl,--gc-sections" "-pie" "-Wl,-zrelro" "-Wl,-znow" "-Wl,-O1" "-nodefaultlibs" "-L" ".../supercop-data/panther/amd64/try/c/clang_-march=native_-O2_-fwrapv_-Qunused-arguments_-fPIC_-fPIE_-gdwarf-4_-Wall/constbranchindex/crypto_hash/sha256/rust_sha2/work/target/release/deps" "-L" ".../supercop-data/panther/amd64/lib" "-L" ".../supercop-data/panther/amd64/try/c/clang_-march=native_-O2_-fwrapv_-Qunused-arguments_-fPIC_-fPIE_-gdwarf-4_-Wall/constbranchindex/crypto_hash/sha256/rust_sha2/work/target/release/build/crypto_hash_sha256-5cd230be06f90398/out" "-L" "/usr/lib/rustlib/x86_64-unknown-linux-gnu/lib" "-ltry-anything" "-ltry" "-lsupercop" "-lkernelrandombytes" "-lcpucycles" "-lcrypto" "-lntl" "-lnsl" "-lm" "-Wl,-Bstatic" ".../supercop-data/panther/amd64/try/c/clang_-march=native_-O2_-fwrapv_-Qunused-arguments_-fPIC_-fPIE_-gdwarf-4_-Wall/constbranchindex/crypto_hash/sha256/rust_sha2/work/target/release/deps/libcrypto_hash_sha256-59a535abfecfde21.rlib" ".../supercop-data/panther/amd64/try/c/clang_-march=native_-O2_-fwrapv_-Qunused-arguments_-fPIC_-fPIE_-gdwarf-4_-Wall/constbranchindex/crypto_hash/sha256/rust_sha2/work/target/release/deps/libsha2-fee2faec0cc98b9d.rlib" ".../supercop-data/panther/amd64/try/c/clang_-march=native_-O2_-fwrapv_-Qunused-arguments_-fPIC_-fPIE_-gdwarf-4_-Wall/constbranchindex/crypto_hash/sha256/rust_sha2/work/target/release/deps/libcpuid_bool-a511188b3e8fb9e7.rlib" ".../supercop-data/panther/amd64/try/c/clang_-march=native_-O2_-fwrapv_-Qunused-arguments_-fPIC_-fPIE_-gdwarf-4_-Wall/constbranchindex/crypto_hash/sha256/rust_sha2/work/target/release/deps/libcfg_if-11669ae4b1851f60.rlib" ".../supercop-data/panther/amd64/try/c/clang_-march=native_-O2_-fwrapv_-Qunused-arguments_-fPIC_-fPIE_-gdwarf-4_-Wall/constbranchindex/crypto_hash/sha256/rust_sha2/work/target/release/deps/libopaque_debug-ff52af415c56e1a8.rlib" ".../supercop-data/panther/amd64/try/c/clang_-march=native_-O2_-fwrapv_-Qunused-arguments_-fPIC_-fPIE_-gdwarf-4_-Wall/constbranchindex/crypto_hash/sha256/rust_sha2/work/target/release/deps/libdigest-137540d47480a0cd.rlib" ".../supercop-data/panther/amd64/try/c/clang_-march=native_-O2_-fwrapv_-Qunused-arguments_-fPIC_-fPIE_-gdwarf-4_-Wall/constbranchindex/crypto_hash/sha256/rust_sha2/work/target/release/deps/libblock_buffer-d8051f65e68b5aa7.rlib" ".../supercop-data/panther/amd64/try/c/clang_-march=native_-O2_-fwrapv_-Qunused-arguments_-fPIC_-fPIE_-gdwarf-4_-Wall/constbranchindex/crypto_hash/sha256/rust_sha2/work/target/release/deps/libgeneric_array-6bd8cd5d26e69f54.rlib" ".../supercop-data/panther/amd64/try/c/clang_-march=native_-O2_-fwrapv_-Qunused-arguments_-fPIC_-fPIE_-gdwarf-4_-Wall/constbranchindex/crypto_hash/sha256/rust_sha2/work/target/release/deps/libtypenum-ac0d7f64b1a84d19.rlib" "-Wl,--start-group" "/usr/lib/rustlib/x86_64-unknown-linux-gnu/lib/libstd-6bf3f16f340782ca.rlib" "/usr/lib/rustlib/x86_64-unknown-linux-gnu/lib/libpanic_unwind-13f3099d50c21bc6.rlib" "/usr/lib/rustlib/x86_64-unknown-linux-gnu/lib/libminiz_oxide-a2ba33c985785afe.rlib" "/usr/lib/rustlib/x86_64-unknown-linux-gnu/lib/libadler-3f6e9f8f4afbea6d.rlib" "/usr/lib/rustlib/x86_64-unknown-linux-gnu/lib/libobject-af517d7f13e7c960.rlib" "/usr/lib/rustlib/x86_64-unknown-linux-gnu/lib/libaddr2line-12740563628e601f.rlib" "/usr/lib/rustlib/x86_64-unknown-linux-gnu/lib/libgimli-0ac82a1e1820dd21.rlib" "/usr/lib/rustlib/x86_64-unknown-linux-gnu/lib/librustc_demangle-3ac2d0878c297d42.rlib" "/usr/lib/rustlib/x86_64-unknown-linux-gnu/lib/libhashbrown-c6632ca171f954dd.rlib" "/usr/lib/rustlib/x86_64-unknown-linux-gnu/lib/librustc_std_workspace_alloc-b5bfd0198c7b740d.rlib" "/usr/lib/rustlib/x86_64-unknown-linux-gnu/lib/libunwind-bd645b20c6c7b56d.rlib" "/usr/lib/rustlib/x86_64-unknown-linux-gnu/lib/libcfg_if-b9e1e523c0c29a77.rlib" "/usr/lib/rustlib/x86_64-unknown-linux-gnu/lib/liblibc-dfbef8c525de0186.rlib" "/usr/lib/rustlib/x86_64-unknown-linux-gnu/lib/liballoc-1ebf406bd4ea5769.rlib" "/usr/lib/rustlib/x86_64-unknown-linux-gnu/lib/librustc_std_workspace_core-5e0675f526ef5c6b.rlib" "/usr/lib/rustlib/x86_64-unknown-linux-gnu/lib/libcore-3375e4f89d420e7a.rlib" "-Wl,--end-group" "/usr/lib/rustlib/x86_64-unknown-linux-gnu/lib/libcompiler_builtins-f74b197469e67088.rlib" "-Wl,-Bdynamic" "-lgcc_s" "-lc" "-lm" "-lrt" "-lpthread" "-lutil" "-ldl" "-lutil"
try.c:   = note: /usr/bin/ld: cannot find -lcpucycles
try.c:           collect2: error: ld returned 1 exit status
try.c:
try.c:
try.c: error: aborting due to previous error
try.c:
try.c: error: could not compile `crypto_hash_sha256`.
try.c:
try.c: To learn more, run the command again with --verbose.

Number of similar (implementation,compiler) pairs: 1, namely:
ImplementationCompiler
rust_sha2clang -march=native -O2 -fwrapv -Qunused-arguments -fPIC -fPIE -gdwarf-4 -Wall (Debian_Clang_11.0.1)

Compiler output


try.c: error: linking with `cc` failed: exit code: 1
try.c:   |
try.c:   = note: "cc" "-Wl,--as-needed" "-Wl,-z,noexecstack" "-m64" "-Wl,--eh-frame-hdr" "-L" "/usr/lib/rustlib/x86_64-unknown-linux-gnu/lib" ".../supercop-data/panther/amd64/try/c/clang_-march=native_-O3_-fwrapv_-Qunused-arguments_-fPIC_-fPIE_-gdwarf-4_-Wall/constbranchindex/crypto_hash/sha256/rust_sha2/work/target/release/deps/try_small-9e5a796331e8e781.try_small.wogv34f0-cgu.0.rcgu.o" ".../supercop-data/panther/amd64/try/c/clang_-march=native_-O3_-fwrapv_-Qunused-arguments_-fPIC_-fPIE_-gdwarf-4_-Wall/constbranchindex/crypto_hash/sha256/rust_sha2/work/target/release/deps/try_small-9e5a796331e8e781.try_small.wogv34f0-cgu.1.rcgu.o" ".../supercop-data/panther/amd64/try/c/clang_-march=native_-O3_-fwrapv_-Qunused-arguments_-fPIC_-fPIE_-gdwarf-4_-Wall/constbranchindex/crypto_hash/sha256/rust_sha2/work/target/release/deps/try_small-9e5a796331e8e781.try_small.wogv34f0-cgu.2.rcgu.o" ".../supercop-data/panther/amd64/try/c/clang_-march=native_-O3_-fwrapv_-Qunused-arguments_-fPIC_-fPIE_-gdwarf-4_-Wall/constbranchindex/crypto_hash/sha256/rust_sha2/work/target/release/deps/try_small-9e5a796331e8e781.try_small.wogv34f0-cgu.3.rcgu.o" ".../supercop-data/panther/amd64/try/c/clang_-march=native_-O3_-fwrapv_-Qunused-arguments_-fPIC_-fPIE_-gdwarf-4_-Wall/constbranchindex/crypto_hash/sha256/rust_sha2/work/target/release/deps/try_small-9e5a796331e8e781.try_small.wogv34f0-cgu.4.rcgu.o" "-o" ".../supercop-data/panther/amd64/try/c/clang_-march=native_-O3_-fwrapv_-Qunused-arguments_-fPIC_-fPIE_-gdwarf-4_-Wall/constbranchindex/crypto_hash/sha256/rust_sha2/work/target/release/deps/try_small-9e5a796331e8e781" ".../supercop-data/panther/amd64/try/c/clang_-march=native_-O3_-fwrapv_-Qunused-arguments_-fPIC_-fPIE_-gdwarf-4_-Wall/constbranchindex/crypto_hash/sha256/rust_sha2/work/target/release/deps/try_small-9e5a796331e8e781.1bv51pu6l67stnpc.rcgu.o" "-Wl,--gc-sections" "-pie" "-Wl,-zrelro" "-Wl,-znow" "-Wl,-O1" "-nodefaultlibs" "-L" ".../supercop-data/panther/amd64/try/c/clang_-march=native_-O3_-fwrapv_-Qunused-arguments_-fPIC_-fPIE_-gdwarf-4_-Wall/constbranchindex/crypto_hash/sha256/rust_sha2/work/target/release/deps" "-L" ".../supercop-data/panther/amd64/lib" "-L" ".../supercop-data/panther/amd64/try/c/clang_-march=native_-O3_-fwrapv_-Qunused-arguments_-fPIC_-fPIE_-gdwarf-4_-Wall/constbranchindex/crypto_hash/sha256/rust_sha2/work/target/release/build/crypto_hash_sha256-5cd230be06f90398/out" "-L" "/usr/lib/rustlib/x86_64-unknown-linux-gnu/lib" "-ltry-anything" "-ltry-small" "-lsupercop" "-lkernelrandombytes" "-lcpucycles" "-lcrypto" "-lntl" "-lnsl" "-lm" "-Wl,-Bstatic" ".../supercop-data/panther/amd64/try/c/clang_-march=native_-O3_-fwrapv_-Qunused-arguments_-fPIC_-fPIE_-gdwarf-4_-Wall/constbranchindex/crypto_hash/sha256/rust_sha2/work/target/release/deps/libcrypto_hash_sha256-59a535abfecfde21.rlib" ".../supercop-data/panther/amd64/try/c/clang_-march=native_-O3_-fwrapv_-Qunused-arguments_-fPIC_-fPIE_-gdwarf-4_-Wall/constbranchindex/crypto_hash/sha256/rust_sha2/work/target/release/deps/libsha2-fee2faec0cc98b9d.rlib" ".../supercop-data/panther/amd64/try/c/clang_-march=native_-O3_-fwrapv_-Qunused-arguments_-fPIC_-fPIE_-gdwarf-4_-Wall/constbranchindex/crypto_hash/sha256/rust_sha2/work/target/release/deps/libcpuid_bool-a511188b3e8fb9e7.rlib" ".../supercop-data/panther/amd64/try/c/clang_-march=native_-O3_-fwrapv_-Qunused-arguments_-fPIC_-fPIE_-gdwarf-4_-Wall/constbranchindex/crypto_hash/sha256/rust_sha2/work/target/release/deps/libcfg_if-11669ae4b1851f60.rlib" ".../supercop-data/panther/amd64/try/c/clang_-march=native_-O3_-fwrapv_-Qunused-arguments_-fPIC_-fPIE_-gdwarf-4_-Wall/constbranchindex/crypto_hash/sha256/rust_sha2/work/target/release/deps/libopaque_debug-ff52af415c56e1a8.rlib" ".../supercop-data/panther/amd64/try/c/clang_-march=native_-O3_-fwrapv_-Qunused-arguments_-fPIC_-fPIE_-gdwarf-4_-Wall/constbranchindex/crypto_hash/sha256/rust_sha2/work/target/release/deps/libdigest-137540d47480a0cd.rlib" ".../supercop-data/panther/amd64/try/c/clang_-march=native_-O3_-fwrapv_-Qunused-arguments_-fPIC_-fPIE_-gdwarf-4_-Wall/constbranchindex/crypto_hash/sha256/rust_sha2/work/target/release/deps/libblock_buffer-d8051f65e68b5aa7.rlib" ".../supercop-data/panther/amd64/try/c/clang_-march=native_-O3_-fwrapv_-Qunused-arguments_-fPIC_-fPIE_-gdwarf-4_-Wall/constbranchindex/crypto_hash/sha256/rust_sha2/work/target/release/deps/libgeneric_array-6bd8cd5d26e69f54.rlib" ".../supercop-data/panther/amd64/try/c/clang_-march=native_-O3_-fwrapv_-Qunused-arguments_-fPIC_-fPIE_-gdwarf-4_-Wall/constbranchindex/crypto_hash/sha256/rust_sha2/work/target/release/deps/libtypenum-ac0d7f64b1a84d19.rlib" "-Wl,--start-group" "/usr/lib/rustlib/x86_64-unknown-linux-gnu/lib/libstd-6bf3f16f340782ca.rlib" "/usr/lib/rustlib/x86_64-unknown-linux-gnu/lib/libpanic_unwind-13f3099d50c21bc6.rlib" "/usr/lib/rustlib/x86_64-unknown-linux-gnu/lib/libminiz_oxide-a2ba33c985785afe.rlib" "/usr/lib/rustlib/x86_64-unknown-linux-gnu/lib/libadler-3f6e9f8f4afbea6d.rlib" "/usr/lib/rustlib/x86_64-unknown-linux-gnu/lib/libobject-af517d7f13e7c960.rlib" "/usr/lib/rustlib/x86_64-unknown-linux-gnu/lib/libaddr2line-12740563628e601f.rlib" "/usr/lib/rustlib/x86_64-unknown-linux-gnu/lib/libgimli-0ac82a1e1820dd21.rlib" "/usr/lib/rustlib/x86_64-unknown-linux-gnu/lib/librustc_demangle-3ac2d0878c297d42.rlib" "/usr/lib/rustlib/x86_64-unknown-linux-gnu/lib/libhashbrown-c6632ca171f954dd.rlib" "/usr/lib/rustlib/x86_64-unknown-linux-gnu/lib/librustc_std_workspace_alloc-b5bfd0198c7b740d.rlib" "/usr/lib/rustlib/x86_64-unknown-linux-gnu/lib/libunwind-bd645b20c6c7b56d.rlib" "/usr/lib/rustlib/x86_64-unknown-linux-gnu/lib/libcfg_if-b9e1e523c0c29a77.rlib" "/usr/lib/rustlib/x86_64-unknown-linux-gnu/lib/liblibc-dfbef8c525de0186.rlib" "/usr/lib/rustlib/x86_64-unknown-linux-gnu/lib/liballoc-1ebf406bd4ea5769.rlib" "/usr/lib/rustlib/x86_64-unknown-linux-gnu/lib/librustc_std_workspace_core-5e0675f526ef5c6b.rlib" "/usr/lib/rustlib/x86_64-unknown-linux-gnu/lib/libcore-3375e4f89d420e7a.rlib" "-Wl,--end-group" "/usr/lib/rustlib/x86_64-unknown-linux-gnu/lib/libcompiler_builtins-f74b197469e67088.rlib" "-Wl,-Bdynamic" "-lgcc_s" "-lc" "-lm" "-lrt" "-lpthread" "-lutil" "-ldl" "-lutil"
try.c:   = note: /usr/bin/ld: cannot find -lcpucycles
try.c:           collect2: error: ld returned 1 exit status
try.c:
try.c:
try.c: error: aborting due to previous error
try.c:
try.c: error: could not compile `crypto_hash_sha256`.
try.c:
try.c: To learn more, run the command again with --verbose.

Number of similar (implementation,compiler) pairs: 1, namely:
ImplementationCompiler
rust_sha2clang -march=native -O3 -fwrapv -Qunused-arguments -fPIC -fPIE -gdwarf-4 -Wall (Debian_Clang_11.0.1)

Compiler output


try.c: error: linking with `cc` failed: exit code: 1
try.c:   |
try.c:   = note: "cc" "-Wl,--as-needed" "-Wl,-z,noexecstack" "-m64" "-Wl,--eh-frame-hdr" "-L" "/usr/lib/rustlib/x86_64-unknown-linux-gnu/lib" ".../supercop-data/panther/amd64/try/c/clang_-march=native_-O_-fwrapv_-Qunused-arguments_-fPIC_-fPIE_-gdwarf-4_-Wall/constbranchindex/crypto_hash/sha256/rust_sha2/work/target/release/deps/try-444f87ff176ff1a2.try.eh7uyr3c-cgu.0.rcgu.o" ".../supercop-data/panther/amd64/try/c/clang_-march=native_-O_-fwrapv_-Qunused-arguments_-fPIC_-fPIE_-gdwarf-4_-Wall/constbranchindex/crypto_hash/sha256/rust_sha2/work/target/release/deps/try-444f87ff176ff1a2.try.eh7uyr3c-cgu.1.rcgu.o" ".../supercop-data/panther/amd64/try/c/clang_-march=native_-O_-fwrapv_-Qunused-arguments_-fPIC_-fPIE_-gdwarf-4_-Wall/constbranchindex/crypto_hash/sha256/rust_sha2/work/target/release/deps/try-444f87ff176ff1a2.try.eh7uyr3c-cgu.2.rcgu.o" ".../supercop-data/panther/amd64/try/c/clang_-march=native_-O_-fwrapv_-Qunused-arguments_-fPIC_-fPIE_-gdwarf-4_-Wall/constbranchindex/crypto_hash/sha256/rust_sha2/work/target/release/deps/try-444f87ff176ff1a2.try.eh7uyr3c-cgu.3.rcgu.o" ".../supercop-data/panther/amd64/try/c/clang_-march=native_-O_-fwrapv_-Qunused-arguments_-fPIC_-fPIE_-gdwarf-4_-Wall/constbranchindex/crypto_hash/sha256/rust_sha2/work/target/release/deps/try-444f87ff176ff1a2.try.eh7uyr3c-cgu.4.rcgu.o" "-o" ".../supercop-data/panther/amd64/try/c/clang_-march=native_-O_-fwrapv_-Qunused-arguments_-fPIC_-fPIE_-gdwarf-4_-Wall/constbranchindex/crypto_hash/sha256/rust_sha2/work/target/release/deps/try-444f87ff176ff1a2" ".../supercop-data/panther/amd64/try/c/clang_-march=native_-O_-fwrapv_-Qunused-arguments_-fPIC_-fPIE_-gdwarf-4_-Wall/constbranchindex/crypto_hash/sha256/rust_sha2/work/target/release/deps/try-444f87ff176ff1a2.4qvuycn7jdjdfii3.rcgu.o" "-Wl,--gc-sections" "-pie" "-Wl,-zrelro" "-Wl,-znow" "-Wl,-O1" "-nodefaultlibs" "-L" ".../supercop-data/panther/amd64/try/c/clang_-march=native_-O_-fwrapv_-Qunused-arguments_-fPIC_-fPIE_-gdwarf-4_-Wall/constbranchindex/crypto_hash/sha256/rust_sha2/work/target/release/deps" "-L" ".../supercop-data/panther/amd64/lib" "-L" ".../supercop-data/panther/amd64/try/c/clang_-march=native_-O_-fwrapv_-Qunused-arguments_-fPIC_-fPIE_-gdwarf-4_-Wall/constbranchindex/crypto_hash/sha256/rust_sha2/work/target/release/build/crypto_hash_sha256-5cd230be06f90398/out" "-L" "/usr/lib/rustlib/x86_64-unknown-linux-gnu/lib" "-ltry-anything" "-ltry" "-lsupercop" "-lkernelrandombytes" "-lcpucycles" "-lcrypto" "-lntl" "-lnsl" "-lm" "-Wl,-Bstatic" ".../supercop-data/panther/amd64/try/c/clang_-march=native_-O_-fwrapv_-Qunused-arguments_-fPIC_-fPIE_-gdwarf-4_-Wall/constbranchindex/crypto_hash/sha256/rust_sha2/work/target/release/deps/libcrypto_hash_sha256-59a535abfecfde21.rlib" ".../supercop-data/panther/amd64/try/c/clang_-march=native_-O_-fwrapv_-Qunused-arguments_-fPIC_-fPIE_-gdwarf-4_-Wall/constbranchindex/crypto_hash/sha256/rust_sha2/work/target/release/deps/libsha2-fee2faec0cc98b9d.rlib" ".../supercop-data/panther/amd64/try/c/clang_-march=native_-O_-fwrapv_-Qunused-arguments_-fPIC_-fPIE_-gdwarf-4_-Wall/constbranchindex/crypto_hash/sha256/rust_sha2/work/target/release/deps/libcpuid_bool-a511188b3e8fb9e7.rlib" ".../supercop-data/panther/amd64/try/c/clang_-march=native_-O_-fwrapv_-Qunused-arguments_-fPIC_-fPIE_-gdwarf-4_-Wall/constbranchindex/crypto_hash/sha256/rust_sha2/work/target/release/deps/libcfg_if-11669ae4b1851f60.rlib" ".../supercop-data/panther/amd64/try/c/clang_-march=native_-O_-fwrapv_-Qunused-arguments_-fPIC_-fPIE_-gdwarf-4_-Wall/constbranchindex/crypto_hash/sha256/rust_sha2/work/target/release/deps/libopaque_debug-ff52af415c56e1a8.rlib" ".../supercop-data/panther/amd64/try/c/clang_-march=native_-O_-fwrapv_-Qunused-arguments_-fPIC_-fPIE_-gdwarf-4_-Wall/constbranchindex/crypto_hash/sha256/rust_sha2/work/target/release/deps/libdigest-137540d47480a0cd.rlib" ".../supercop-data/panther/amd64/try/c/clang_-march=native_-O_-fwrapv_-Qunused-arguments_-fPIC_-fPIE_-gdwarf-4_-Wall/constbranchindex/crypto_hash/sha256/rust_sha2/work/target/release/deps/libblock_buffer-d8051f65e68b5aa7.rlib" ".../supercop-data/panther/amd64/try/c/clang_-march=native_-O_-fwrapv_-Qunused-arguments_-fPIC_-fPIE_-gdwarf-4_-Wall/constbranchindex/crypto_hash/sha256/rust_sha2/work/target/release/deps/libgeneric_array-6bd8cd5d26e69f54.rlib" ".../supercop-data/panther/amd64/try/c/clang_-march=native_-O_-fwrapv_-Qunused-arguments_-fPIC_-fPIE_-gdwarf-4_-Wall/constbranchindex/crypto_hash/sha256/rust_sha2/work/target/release/deps/libtypenum-ac0d7f64b1a84d19.rlib" "-Wl,--start-group" "/usr/lib/rustlib/x86_64-unknown-linux-gnu/lib/libstd-6bf3f16f340782ca.rlib" "/usr/lib/rustlib/x86_64-unknown-linux-gnu/lib/libpanic_unwind-13f3099d50c21bc6.rlib" "/usr/lib/rustlib/x86_64-unknown-linux-gnu/lib/libminiz_oxide-a2ba33c985785afe.rlib" "/usr/lib/rustlib/x86_64-unknown-linux-gnu/lib/libadler-3f6e9f8f4afbea6d.rlib" "/usr/lib/rustlib/x86_64-unknown-linux-gnu/lib/libobject-af517d7f13e7c960.rlib" "/usr/lib/rustlib/x86_64-unknown-linux-gnu/lib/libaddr2line-12740563628e601f.rlib" "/usr/lib/rustlib/x86_64-unknown-linux-gnu/lib/libgimli-0ac82a1e1820dd21.rlib" "/usr/lib/rustlib/x86_64-unknown-linux-gnu/lib/librustc_demangle-3ac2d0878c297d42.rlib" "/usr/lib/rustlib/x86_64-unknown-linux-gnu/lib/libhashbrown-c6632ca171f954dd.rlib" "/usr/lib/rustlib/x86_64-unknown-linux-gnu/lib/librustc_std_workspace_alloc-b5bfd0198c7b740d.rlib" "/usr/lib/rustlib/x86_64-unknown-linux-gnu/lib/libunwind-bd645b20c6c7b56d.rlib" "/usr/lib/rustlib/x86_64-unknown-linux-gnu/lib/libcfg_if-b9e1e523c0c29a77.rlib" "/usr/lib/rustlib/x86_64-unknown-linux-gnu/lib/liblibc-dfbef8c525de0186.rlib" "/usr/lib/rustlib/x86_64-unknown-linux-gnu/lib/liballoc-1ebf406bd4ea5769.rlib" "/usr/lib/rustlib/x86_64-unknown-linux-gnu/lib/librustc_std_workspace_core-5e0675f526ef5c6b.rlib" "/usr/lib/rustlib/x86_64-unknown-linux-gnu/lib/libcore-3375e4f89d420e7a.rlib" "-Wl,--end-group" "/usr/lib/rustlib/x86_64-unknown-linux-gnu/lib/libcompiler_builtins-f74b197469e67088.rlib" "-Wl,-Bdynamic" "-lgcc_s" "-lc" "-lm" "-lrt" "-lpthread" "-lutil" "-ldl" "-lutil"
try.c:   = note: /usr/bin/ld: cannot find -lcpucycles
try.c:           collect2: error: ld returned 1 exit status
try.c:
try.c:
try.c: error: aborting due to previous error
try.c:
try.c: error: could not compile `crypto_hash_sha256`.
try.c:
try.c: To learn more, run the command again with --verbose.

Number of similar (implementation,compiler) pairs: 1, namely:
ImplementationCompiler
rust_sha2clang -march=native -O -fwrapv -Qunused-arguments -fPIC -fPIE -gdwarf-4 -Wall (Debian_Clang_11.0.1)

Compiler output


try.c: error: linking with `cc` failed: exit code: 1
try.c:   |
try.c:   = note: "cc" "-Wl,--as-needed" "-Wl,-z,noexecstack" "-m64" "-Wl,--eh-frame-hdr" "-L" "/usr/lib/rustlib/x86_64-unknown-linux-gnu/lib" ".../supercop-data/panther/amd64/try/c/clang_-march=native_-Os_-fwrapv_-Qunused-arguments_-fPIC_-fPIE_-gdwarf-4_-Wall/constbranchindex/crypto_hash/sha256/rust_sha2/work/target/release/deps/try_small-9e5a796331e8e781.try_small.wogv34f0-cgu.0.rcgu.o" ".../supercop-data/panther/amd64/try/c/clang_-march=native_-Os_-fwrapv_-Qunused-arguments_-fPIC_-fPIE_-gdwarf-4_-Wall/constbranchindex/crypto_hash/sha256/rust_sha2/work/target/release/deps/try_small-9e5a796331e8e781.try_small.wogv34f0-cgu.1.rcgu.o" ".../supercop-data/panther/amd64/try/c/clang_-march=native_-Os_-fwrapv_-Qunused-arguments_-fPIC_-fPIE_-gdwarf-4_-Wall/constbranchindex/crypto_hash/sha256/rust_sha2/work/target/release/deps/try_small-9e5a796331e8e781.try_small.wogv34f0-cgu.2.rcgu.o" ".../supercop-data/panther/amd64/try/c/clang_-march=native_-Os_-fwrapv_-Qunused-arguments_-fPIC_-fPIE_-gdwarf-4_-Wall/constbranchindex/crypto_hash/sha256/rust_sha2/work/target/release/deps/try_small-9e5a796331e8e781.try_small.wogv34f0-cgu.3.rcgu.o" ".../supercop-data/panther/amd64/try/c/clang_-march=native_-Os_-fwrapv_-Qunused-arguments_-fPIC_-fPIE_-gdwarf-4_-Wall/constbranchindex/crypto_hash/sha256/rust_sha2/work/target/release/deps/try_small-9e5a796331e8e781.try_small.wogv34f0-cgu.4.rcgu.o" "-o" ".../supercop-data/panther/amd64/try/c/clang_-march=native_-Os_-fwrapv_-Qunused-arguments_-fPIC_-fPIE_-gdwarf-4_-Wall/constbranchindex/crypto_hash/sha256/rust_sha2/work/target/release/deps/try_small-9e5a796331e8e781" ".../supercop-data/panther/amd64/try/c/clang_-march=native_-Os_-fwrapv_-Qunused-arguments_-fPIC_-fPIE_-gdwarf-4_-Wall/constbranchindex/crypto_hash/sha256/rust_sha2/work/target/release/deps/try_small-9e5a796331e8e781.1bv51pu6l67stnpc.rcgu.o" "-Wl,--gc-sections" "-pie" "-Wl,-zrelro" "-Wl,-znow" "-Wl,-O1" "-nodefaultlibs" "-L" ".../supercop-data/panther/amd64/try/c/clang_-march=native_-Os_-fwrapv_-Qunused-arguments_-fPIC_-fPIE_-gdwarf-4_-Wall/constbranchindex/crypto_hash/sha256/rust_sha2/work/target/release/deps" "-L" ".../supercop-data/panther/amd64/lib" "-L" ".../supercop-data/panther/amd64/try/c/clang_-march=native_-Os_-fwrapv_-Qunused-arguments_-fPIC_-fPIE_-gdwarf-4_-Wall/constbranchindex/crypto_hash/sha256/rust_sha2/work/target/release/build/crypto_hash_sha256-5cd230be06f90398/out" "-L" "/usr/lib/rustlib/x86_64-unknown-linux-gnu/lib" "-ltry-anything" "-ltry-small" "-lsupercop" "-lkernelrandombytes" "-lcpucycles" "-lcrypto" "-lntl" "-lnsl" "-lm" "-Wl,-Bstatic" ".../supercop-data/panther/amd64/try/c/clang_-march=native_-Os_-fwrapv_-Qunused-arguments_-fPIC_-fPIE_-gdwarf-4_-Wall/constbranchindex/crypto_hash/sha256/rust_sha2/work/target/release/deps/libcrypto_hash_sha256-59a535abfecfde21.rlib" ".../supercop-data/panther/amd64/try/c/clang_-march=native_-Os_-fwrapv_-Qunused-arguments_-fPIC_-fPIE_-gdwarf-4_-Wall/constbranchindex/crypto_hash/sha256/rust_sha2/work/target/release/deps/libsha2-fee2faec0cc98b9d.rlib" ".../supercop-data/panther/amd64/try/c/clang_-march=native_-Os_-fwrapv_-Qunused-arguments_-fPIC_-fPIE_-gdwarf-4_-Wall/constbranchindex/crypto_hash/sha256/rust_sha2/work/target/release/deps/libcpuid_bool-a511188b3e8fb9e7.rlib" ".../supercop-data/panther/amd64/try/c/clang_-march=native_-Os_-fwrapv_-Qunused-arguments_-fPIC_-fPIE_-gdwarf-4_-Wall/constbranchindex/crypto_hash/sha256/rust_sha2/work/target/release/deps/libcfg_if-11669ae4b1851f60.rlib" ".../supercop-data/panther/amd64/try/c/clang_-march=native_-Os_-fwrapv_-Qunused-arguments_-fPIC_-fPIE_-gdwarf-4_-Wall/constbranchindex/crypto_hash/sha256/rust_sha2/work/target/release/deps/libopaque_debug-ff52af415c56e1a8.rlib" ".../supercop-data/panther/amd64/try/c/clang_-march=native_-Os_-fwrapv_-Qunused-arguments_-fPIC_-fPIE_-gdwarf-4_-Wall/constbranchindex/crypto_hash/sha256/rust_sha2/work/target/release/deps/libdigest-137540d47480a0cd.rlib" ".../supercop-data/panther/amd64/try/c/clang_-march=native_-Os_-fwrapv_-Qunused-arguments_-fPIC_-fPIE_-gdwarf-4_-Wall/constbranchindex/crypto_hash/sha256/rust_sha2/work/target/release/deps/libblock_buffer-d8051f65e68b5aa7.rlib" ".../supercop-data/panther/amd64/try/c/clang_-march=native_-Os_-fwrapv_-Qunused-arguments_-fPIC_-fPIE_-gdwarf-4_-Wall/constbranchindex/crypto_hash/sha256/rust_sha2/work/target/release/deps/libgeneric_array-6bd8cd5d26e69f54.rlib" ".../supercop-data/panther/amd64/try/c/clang_-march=native_-Os_-fwrapv_-Qunused-arguments_-fPIC_-fPIE_-gdwarf-4_-Wall/constbranchindex/crypto_hash/sha256/rust_sha2/work/target/release/deps/libtypenum-ac0d7f64b1a84d19.rlib" "-Wl,--start-group" "/usr/lib/rustlib/x86_64-unknown-linux-gnu/lib/libstd-6bf3f16f340782ca.rlib" "/usr/lib/rustlib/x86_64-unknown-linux-gnu/lib/libpanic_unwind-13f3099d50c21bc6.rlib" "/usr/lib/rustlib/x86_64-unknown-linux-gnu/lib/libminiz_oxide-a2ba33c985785afe.rlib" "/usr/lib/rustlib/x86_64-unknown-linux-gnu/lib/libadler-3f6e9f8f4afbea6d.rlib" "/usr/lib/rustlib/x86_64-unknown-linux-gnu/lib/libobject-af517d7f13e7c960.rlib" "/usr/lib/rustlib/x86_64-unknown-linux-gnu/lib/libaddr2line-12740563628e601f.rlib" "/usr/lib/rustlib/x86_64-unknown-linux-gnu/lib/libgimli-0ac82a1e1820dd21.rlib" "/usr/lib/rustlib/x86_64-unknown-linux-gnu/lib/librustc_demangle-3ac2d0878c297d42.rlib" "/usr/lib/rustlib/x86_64-unknown-linux-gnu/lib/libhashbrown-c6632ca171f954dd.rlib" "/usr/lib/rustlib/x86_64-unknown-linux-gnu/lib/librustc_std_workspace_alloc-b5bfd0198c7b740d.rlib" "/usr/lib/rustlib/x86_64-unknown-linux-gnu/lib/libunwind-bd645b20c6c7b56d.rlib" "/usr/lib/rustlib/x86_64-unknown-linux-gnu/lib/libcfg_if-b9e1e523c0c29a77.rlib" "/usr/lib/rustlib/x86_64-unknown-linux-gnu/lib/liblibc-dfbef8c525de0186.rlib" "/usr/lib/rustlib/x86_64-unknown-linux-gnu/lib/liballoc-1ebf406bd4ea5769.rlib" "/usr/lib/rustlib/x86_64-unknown-linux-gnu/lib/librustc_std_workspace_core-5e0675f526ef5c6b.rlib" "/usr/lib/rustlib/x86_64-unknown-linux-gnu/lib/libcore-3375e4f89d420e7a.rlib" "-Wl,--end-group" "/usr/lib/rustlib/x86_64-unknown-linux-gnu/lib/libcompiler_builtins-f74b197469e67088.rlib" "-Wl,-Bdynamic" "-lgcc_s" "-lc" "-lm" "-lrt" "-lpthread" "-lutil" "-ldl" "-lutil"
try.c:   = note: /usr/bin/ld: cannot find -lcpucycles
try.c:           collect2: error: ld returned 1 exit status
try.c:
try.c:
try.c: error: aborting due to previous error
try.c:
try.c: error: could not compile `crypto_hash_sha256`.
try.c:
try.c: To learn more, run the command again with --verbose.

Number of similar (implementation,compiler) pairs: 1, namely:
ImplementationCompiler
rust_sha2clang -march=native -Os -fwrapv -Qunused-arguments -fPIC -fPIE -gdwarf-4 -Wall (Debian_Clang_11.0.1)

Compiler output


try.c: error: linking with `cc` failed: exit code: 1
try.c:   |
try.c:   = note: "cc" "-Wl,--as-needed" "-Wl,-z,noexecstack" "-m64" "-Wl,--eh-frame-hdr" "-L" "/usr/lib/rustlib/x86_64-unknown-linux-gnu/lib" ".../supercop-data/panther/amd64/try/c/clang_-mcpu=native_-O3_-fwrapv_-Qunused-arguments_-fPIC_-fPIE_-gdwarf-4_-Wall/constbranchindex/crypto_hash/sha256/rust_sha2/work/target/release/deps/measure-f0421c4c732fed84.measure.5fw24wl4-cgu.0.rcgu.o" ".../supercop-data/panther/amd64/try/c/clang_-mcpu=native_-O3_-fwrapv_-Qunused-arguments_-fPIC_-fPIE_-gdwarf-4_-Wall/constbranchindex/crypto_hash/sha256/rust_sha2/work/target/release/deps/measure-f0421c4c732fed84.measure.5fw24wl4-cgu.1.rcgu.o" ".../supercop-data/panther/amd64/try/c/clang_-mcpu=native_-O3_-fwrapv_-Qunused-arguments_-fPIC_-fPIE_-gdwarf-4_-Wall/constbranchindex/crypto_hash/sha256/rust_sha2/work/target/release/deps/measure-f0421c4c732fed84.measure.5fw24wl4-cgu.2.rcgu.o" ".../supercop-data/panther/amd64/try/c/clang_-mcpu=native_-O3_-fwrapv_-Qunused-arguments_-fPIC_-fPIE_-gdwarf-4_-Wall/constbranchindex/crypto_hash/sha256/rust_sha2/work/target/release/deps/measure-f0421c4c732fed84.measure.5fw24wl4-cgu.3.rcgu.o" ".../supercop-data/panther/amd64/try/c/clang_-mcpu=native_-O3_-fwrapv_-Qunused-arguments_-fPIC_-fPIE_-gdwarf-4_-Wall/constbranchindex/crypto_hash/sha256/rust_sha2/work/target/release/deps/measure-f0421c4c732fed84.measure.5fw24wl4-cgu.4.rcgu.o" "-o" ".../supercop-data/panther/amd64/try/c/clang_-mcpu=native_-O3_-fwrapv_-Qunused-arguments_-fPIC_-fPIE_-gdwarf-4_-Wall/constbranchindex/crypto_hash/sha256/rust_sha2/work/target/release/deps/measure-f0421c4c732fed84" ".../supercop-data/panther/amd64/try/c/clang_-mcpu=native_-O3_-fwrapv_-Qunused-arguments_-fPIC_-fPIE_-gdwarf-4_-Wall/constbranchindex/crypto_hash/sha256/rust_sha2/work/target/release/deps/measure-f0421c4c732fed84.v9rqvgvkjlrpomk.rcgu.o" "-Wl,--gc-sections" "-pie" "-Wl,-zrelro" "-Wl,-znow" "-Wl,-O1" "-nodefaultlibs" "-L" ".../supercop-data/panther/amd64/try/c/clang_-mcpu=native_-O3_-fwrapv_-Qunused-arguments_-fPIC_-fPIE_-gdwarf-4_-Wall/constbranchindex/crypto_hash/sha256/rust_sha2/work/target/release/deps" "-L" ".../supercop-data/panther/amd64/lib" "-L" ".../supercop-data/panther/amd64/try/c/clang_-mcpu=native_-O3_-fwrapv_-Qunused-arguments_-fPIC_-fPIE_-gdwarf-4_-Wall/constbranchindex/crypto_hash/sha256/rust_sha2/work/target/release/build/crypto_hash_sha256-5cd230be06f90398/out" "-L" "/usr/lib/rustlib/x86_64-unknown-linux-gnu/lib" "-lmeasure-anything" "-lmeasure" "-lsupercop" "-lkernelrandombytes" "-lcpucycles" "-lcrypto" "-lntl" "-lnsl" "-lm" "-Wl,-Bstatic" ".../supercop-data/panther/amd64/try/c/clang_-mcpu=native_-O3_-fwrapv_-Qunused-arguments_-fPIC_-fPIE_-gdwarf-4_-Wall/constbranchindex/crypto_hash/sha256/rust_sha2/work/target/release/deps/libcrypto_hash_sha256-59a535abfecfde21.rlib" ".../supercop-data/panther/amd64/try/c/clang_-mcpu=native_-O3_-fwrapv_-Qunused-arguments_-fPIC_-fPIE_-gdwarf-4_-Wall/constbranchindex/crypto_hash/sha256/rust_sha2/work/target/release/deps/libsha2-fee2faec0cc98b9d.rlib" ".../supercop-data/panther/amd64/try/c/clang_-mcpu=native_-O3_-fwrapv_-Qunused-arguments_-fPIC_-fPIE_-gdwarf-4_-Wall/constbranchindex/crypto_hash/sha256/rust_sha2/work/target/release/deps/libcpuid_bool-a511188b3e8fb9e7.rlib" ".../supercop-data/panther/amd64/try/c/clang_-mcpu=native_-O3_-fwrapv_-Qunused-arguments_-fPIC_-fPIE_-gdwarf-4_-Wall/constbranchindex/crypto_hash/sha256/rust_sha2/work/target/release/deps/libcfg_if-11669ae4b1851f60.rlib" ".../supercop-data/panther/amd64/try/c/clang_-mcpu=native_-O3_-fwrapv_-Qunused-arguments_-fPIC_-fPIE_-gdwarf-4_-Wall/constbranchindex/crypto_hash/sha256/rust_sha2/work/target/release/deps/libopaque_debug-ff52af415c56e1a8.rlib" ".../supercop-data/panther/amd64/try/c/clang_-mcpu=native_-O3_-fwrapv_-Qunused-arguments_-fPIC_-fPIE_-gdwarf-4_-Wall/constbranchindex/crypto_hash/sha256/rust_sha2/work/target/release/deps/libdigest-137540d47480a0cd.rlib" ".../supercop-data/panther/amd64/try/c/clang_-mcpu=native_-O3_-fwrapv_-Qunused-arguments_-fPIC_-fPIE_-gdwarf-4_-Wall/constbranchindex/crypto_hash/sha256/rust_sha2/work/target/release/deps/libblock_buffer-d8051f65e68b5aa7.rlib" ".../supercop-data/panther/amd64/try/c/clang_-mcpu=native_-O3_-fwrapv_-Qunused-arguments_-fPIC_-fPIE_-gdwarf-4_-Wall/constbranchindex/crypto_hash/sha256/rust_sha2/work/target/release/deps/libgeneric_array-6bd8cd5d26e69f54.rlib" ".../supercop-data/panther/amd64/try/c/clang_-mcpu=native_-O3_-fwrapv_-Qunused-arguments_-fPIC_-fPIE_-gdwarf-4_-Wall/constbranchindex/crypto_hash/sha256/rust_sha2/work/target/release/deps/libtypenum-ac0d7f64b1a84d19.rlib" "-Wl,--start-group" "/usr/lib/rustlib/x86_64-unknown-linux-gnu/lib/libstd-6bf3f16f340782ca.rlib" "/usr/lib/rustlib/x86_64-unknown-linux-gnu/lib/libpanic_unwind-13f3099d50c21bc6.rlib" "/usr/lib/rustlib/x86_64-unknown-linux-gnu/lib/libminiz_oxide-a2ba33c985785afe.rlib" "/usr/lib/rustlib/x86_64-unknown-linux-gnu/lib/libadler-3f6e9f8f4afbea6d.rlib" "/usr/lib/rustlib/x86_64-unknown-linux-gnu/lib/libobject-af517d7f13e7c960.rlib" "/usr/lib/rustlib/x86_64-unknown-linux-gnu/lib/libaddr2line-12740563628e601f.rlib" "/usr/lib/rustlib/x86_64-unknown-linux-gnu/lib/libgimli-0ac82a1e1820dd21.rlib" "/usr/lib/rustlib/x86_64-unknown-linux-gnu/lib/librustc_demangle-3ac2d0878c297d42.rlib" "/usr/lib/rustlib/x86_64-unknown-linux-gnu/lib/libhashbrown-c6632ca171f954dd.rlib" "/usr/lib/rustlib/x86_64-unknown-linux-gnu/lib/librustc_std_workspace_alloc-b5bfd0198c7b740d.rlib" "/usr/lib/rustlib/x86_64-unknown-linux-gnu/lib/libunwind-bd645b20c6c7b56d.rlib" "/usr/lib/rustlib/x86_64-unknown-linux-gnu/lib/libcfg_if-b9e1e523c0c29a77.rlib" "/usr/lib/rustlib/x86_64-unknown-linux-gnu/lib/liblibc-dfbef8c525de0186.rlib" "/usr/lib/rustlib/x86_64-unknown-linux-gnu/lib/liballoc-1ebf406bd4ea5769.rlib" "/usr/lib/rustlib/x86_64-unknown-linux-gnu/lib/librustc_std_workspace_core-5e0675f526ef5c6b.rlib" "/usr/lib/rustlib/x86_64-unknown-linux-gnu/lib/libcore-3375e4f89d420e7a.rlib" "-Wl,--end-group" "/usr/lib/rustlib/x86_64-unknown-linux-gnu/lib/libcompiler_builtins-f74b197469e67088.rlib" "-Wl,-Bdynamic" "-lgcc_s" "-lc" "-lm" "-lrt" "-lpthread" "-lutil" "-ldl" "-lutil"
try.c:   = note: /usr/bin/ld: cannot find -lcpucycles
try.c:           collect2: error: ld returned 1 exit status
try.c:
try.c:
try.c: error: aborting due to previous error
try.c:
try.c: error: could not compile `crypto_hash_sha256`.
try.c:
try.c: To learn more, run the command again with --verbose.

Number of similar (implementation,compiler) pairs: 1, namely:
ImplementationCompiler
rust_sha2clang -mcpu=native -O3 -fwrapv -Qunused-arguments -fPIC -fPIE -gdwarf-4 -Wall (Debian_Clang_11.0.1)

Compiler output


try.c: error: linking with `cc` failed: exit code: 1
try.c:   |
try.c:   = note: "cc" "-Wl,--as-needed" "-Wl,-z,noexecstack" "-m64" "-Wl,--eh-frame-hdr" "-L" "/usr/lib/rustlib/x86_64-unknown-linux-gnu/lib" ".../supercop-data/panther/amd64/try/c/gcc_-march=native_-mtune=native_-O2_-fwrapv_-fPIC_-fPIE_-gdwarf-4_-Wall/constbranchindex/crypto_hash/sha256/rust_sha2/work/target/release/deps/measure-f0421c4c732fed84.measure.5fw24wl4-cgu.0.rcgu.o" ".../supercop-data/panther/amd64/try/c/gcc_-march=native_-mtune=native_-O2_-fwrapv_-fPIC_-fPIE_-gdwarf-4_-Wall/constbranchindex/crypto_hash/sha256/rust_sha2/work/target/release/deps/measure-f0421c4c732fed84.measure.5fw24wl4-cgu.1.rcgu.o" ".../supercop-data/panther/amd64/try/c/gcc_-march=native_-mtune=native_-O2_-fwrapv_-fPIC_-fPIE_-gdwarf-4_-Wall/constbranchindex/crypto_hash/sha256/rust_sha2/work/target/release/deps/measure-f0421c4c732fed84.measure.5fw24wl4-cgu.2.rcgu.o" ".../supercop-data/panther/amd64/try/c/gcc_-march=native_-mtune=native_-O2_-fwrapv_-fPIC_-fPIE_-gdwarf-4_-Wall/constbranchindex/crypto_hash/sha256/rust_sha2/work/target/release/deps/measure-f0421c4c732fed84.measure.5fw24wl4-cgu.3.rcgu.o" ".../supercop-data/panther/amd64/try/c/gcc_-march=native_-mtune=native_-O2_-fwrapv_-fPIC_-fPIE_-gdwarf-4_-Wall/constbranchindex/crypto_hash/sha256/rust_sha2/work/target/release/deps/measure-f0421c4c732fed84.measure.5fw24wl4-cgu.4.rcgu.o" "-o" ".../supercop-data/panther/amd64/try/c/gcc_-march=native_-mtune=native_-O2_-fwrapv_-fPIC_-fPIE_-gdwarf-4_-Wall/constbranchindex/crypto_hash/sha256/rust_sha2/work/target/release/deps/measure-f0421c4c732fed84" ".../supercop-data/panther/amd64/try/c/gcc_-march=native_-mtune=native_-O2_-fwrapv_-fPIC_-fPIE_-gdwarf-4_-Wall/constbranchindex/crypto_hash/sha256/rust_sha2/work/target/release/deps/measure-f0421c4c732fed84.v9rqvgvkjlrpomk.rcgu.o" "-Wl,--gc-sections" "-pie" "-Wl,-zrelro" "-Wl,-znow" "-Wl,-O1" "-nodefaultlibs" "-L" ".../supercop-data/panther/amd64/try/c/gcc_-march=native_-mtune=native_-O2_-fwrapv_-fPIC_-fPIE_-gdwarf-4_-Wall/constbranchindex/crypto_hash/sha256/rust_sha2/work/target/release/deps" "-L" ".../supercop-data/panther/amd64/lib" "-L" ".../supercop-data/panther/amd64/try/c/gcc_-march=native_-mtune=native_-O2_-fwrapv_-fPIC_-fPIE_-gdwarf-4_-Wall/constbranchindex/crypto_hash/sha256/rust_sha2/work/target/release/build/crypto_hash_sha256-5cd230be06f90398/out" "-L" "/usr/lib/rustlib/x86_64-unknown-linux-gnu/lib" "-lmeasure-anything" "-lmeasure" "-lsupercop" "-lkernelrandombytes" "-lcpucycles" "-lcrypto" "-lntl" "-lnsl" "-lm" "-Wl,-Bstatic" ".../supercop-data/panther/amd64/try/c/gcc_-march=native_-mtune=native_-O2_-fwrapv_-fPIC_-fPIE_-gdwarf-4_-Wall/constbranchindex/crypto_hash/sha256/rust_sha2/work/target/release/deps/libcrypto_hash_sha256-59a535abfecfde21.rlib" ".../supercop-data/panther/amd64/try/c/gcc_-march=native_-mtune=native_-O2_-fwrapv_-fPIC_-fPIE_-gdwarf-4_-Wall/constbranchindex/crypto_hash/sha256/rust_sha2/work/target/release/deps/libsha2-fee2faec0cc98b9d.rlib" ".../supercop-data/panther/amd64/try/c/gcc_-march=native_-mtune=native_-O2_-fwrapv_-fPIC_-fPIE_-gdwarf-4_-Wall/constbranchindex/crypto_hash/sha256/rust_sha2/work/target/release/deps/libcpuid_bool-a511188b3e8fb9e7.rlib" ".../supercop-data/panther/amd64/try/c/gcc_-march=native_-mtune=native_-O2_-fwrapv_-fPIC_-fPIE_-gdwarf-4_-Wall/constbranchindex/crypto_hash/sha256/rust_sha2/work/target/release/deps/libcfg_if-11669ae4b1851f60.rlib" ".../supercop-data/panther/amd64/try/c/gcc_-march=native_-mtune=native_-O2_-fwrapv_-fPIC_-fPIE_-gdwarf-4_-Wall/constbranchindex/crypto_hash/sha256/rust_sha2/work/target/release/deps/libopaque_debug-ff52af415c56e1a8.rlib" ".../supercop-data/panther/amd64/try/c/gcc_-march=native_-mtune=native_-O2_-fwrapv_-fPIC_-fPIE_-gdwarf-4_-Wall/constbranchindex/crypto_hash/sha256/rust_sha2/work/target/release/deps/libdigest-137540d47480a0cd.rlib" ".../supercop-data/panther/amd64/try/c/gcc_-march=native_-mtune=native_-O2_-fwrapv_-fPIC_-fPIE_-gdwarf-4_-Wall/constbranchindex/crypto_hash/sha256/rust_sha2/work/target/release/deps/libblock_buffer-d8051f65e68b5aa7.rlib" ".../supercop-data/panther/amd64/try/c/gcc_-march=native_-mtune=native_-O2_-fwrapv_-fPIC_-fPIE_-gdwarf-4_-Wall/constbranchindex/crypto_hash/sha256/rust_sha2/work/target/release/deps/libgeneric_array-6bd8cd5d26e69f54.rlib" ".../supercop-data/panther/amd64/try/c/gcc_-march=native_-mtune=native_-O2_-fwrapv_-fPIC_-fPIE_-gdwarf-4_-Wall/constbranchindex/crypto_hash/sha256/rust_sha2/work/target/release/deps/libtypenum-ac0d7f64b1a84d19.rlib" "-Wl,--start-group" "/usr/lib/rustlib/x86_64-unknown-linux-gnu/lib/libstd-6bf3f16f340782ca.rlib" "/usr/lib/rustlib/x86_64-unknown-linux-gnu/lib/libpanic_unwind-13f3099d50c21bc6.rlib" "/usr/lib/rustlib/x86_64-unknown-linux-gnu/lib/libminiz_oxide-a2ba33c985785afe.rlib" "/usr/lib/rustlib/x86_64-unknown-linux-gnu/lib/libadler-3f6e9f8f4afbea6d.rlib" "/usr/lib/rustlib/x86_64-unknown-linux-gnu/lib/libobject-af517d7f13e7c960.rlib" "/usr/lib/rustlib/x86_64-unknown-linux-gnu/lib/libaddr2line-12740563628e601f.rlib" "/usr/lib/rustlib/x86_64-unknown-linux-gnu/lib/libgimli-0ac82a1e1820dd21.rlib" "/usr/lib/rustlib/x86_64-unknown-linux-gnu/lib/librustc_demangle-3ac2d0878c297d42.rlib" "/usr/lib/rustlib/x86_64-unknown-linux-gnu/lib/libhashbrown-c6632ca171f954dd.rlib" "/usr/lib/rustlib/x86_64-unknown-linux-gnu/lib/librustc_std_workspace_alloc-b5bfd0198c7b740d.rlib" "/usr/lib/rustlib/x86_64-unknown-linux-gnu/lib/libunwind-bd645b20c6c7b56d.rlib" "/usr/lib/rustlib/x86_64-unknown-linux-gnu/lib/libcfg_if-b9e1e523c0c29a77.rlib" "/usr/lib/rustlib/x86_64-unknown-linux-gnu/lib/liblibc-dfbef8c525de0186.rlib" "/usr/lib/rustlib/x86_64-unknown-linux-gnu/lib/liballoc-1ebf406bd4ea5769.rlib" "/usr/lib/rustlib/x86_64-unknown-linux-gnu/lib/librustc_std_workspace_core-5e0675f526ef5c6b.rlib" "/usr/lib/rustlib/x86_64-unknown-linux-gnu/lib/libcore-3375e4f89d420e7a.rlib" "-Wl,--end-group" "/usr/lib/rustlib/x86_64-unknown-linux-gnu/lib/libcompiler_builtins-f74b197469e67088.rlib" "-Wl,-Bdynamic" "-lgcc_s" "-lc" "-lm" "-lrt" "-lpthread" "-lutil" "-ldl" "-lutil"
try.c:   = note: /usr/bin/ld: cannot find -lcpucycles
try.c:           collect2: error: ld returned 1 exit status
try.c:
try.c:
try.c: error: aborting due to previous error
try.c:
try.c: error: could not compile `crypto_hash_sha256`.
try.c:
try.c: To learn more, run the command again with --verbose.

Number of similar (implementation,compiler) pairs: 1, namely:
ImplementationCompiler
rust_sha2gcc -march=native -mtune=native -O2 -fwrapv -fPIC -fPIE -gdwarf-4 -Wall (10.2.1_20210110)

Compiler output


try.c: error: linking with `cc` failed: exit code: 1
try.c:   |
try.c:   = note: "cc" "-Wl,--as-needed" "-Wl,-z,noexecstack" "-m64" "-Wl,--eh-frame-hdr" "-L" "/usr/lib/rustlib/x86_64-unknown-linux-gnu/lib" ".../supercop-data/panther/amd64/try/c/gcc_-march=native_-mtune=native_-O3_-fwrapv_-fPIC_-fPIE_-gdwarf-4_-Wall/constbranchindex/crypto_hash/sha256/rust_sha2/work/target/release/deps/try-444f87ff176ff1a2.try.eh7uyr3c-cgu.0.rcgu.o" ".../supercop-data/panther/amd64/try/c/gcc_-march=native_-mtune=native_-O3_-fwrapv_-fPIC_-fPIE_-gdwarf-4_-Wall/constbranchindex/crypto_hash/sha256/rust_sha2/work/target/release/deps/try-444f87ff176ff1a2.try.eh7uyr3c-cgu.1.rcgu.o" ".../supercop-data/panther/amd64/try/c/gcc_-march=native_-mtune=native_-O3_-fwrapv_-fPIC_-fPIE_-gdwarf-4_-Wall/constbranchindex/crypto_hash/sha256/rust_sha2/work/target/release/deps/try-444f87ff176ff1a2.try.eh7uyr3c-cgu.2.rcgu.o" ".../supercop-data/panther/amd64/try/c/gcc_-march=native_-mtune=native_-O3_-fwrapv_-fPIC_-fPIE_-gdwarf-4_-Wall/constbranchindex/crypto_hash/sha256/rust_sha2/work/target/release/deps/try-444f87ff176ff1a2.try.eh7uyr3c-cgu.3.rcgu.o" ".../supercop-data/panther/amd64/try/c/gcc_-march=native_-mtune=native_-O3_-fwrapv_-fPIC_-fPIE_-gdwarf-4_-Wall/constbranchindex/crypto_hash/sha256/rust_sha2/work/target/release/deps/try-444f87ff176ff1a2.try.eh7uyr3c-cgu.4.rcgu.o" "-o" ".../supercop-data/panther/amd64/try/c/gcc_-march=native_-mtune=native_-O3_-fwrapv_-fPIC_-fPIE_-gdwarf-4_-Wall/constbranchindex/crypto_hash/sha256/rust_sha2/work/target/release/deps/try-444f87ff176ff1a2" ".../supercop-data/panther/amd64/try/c/gcc_-march=native_-mtune=native_-O3_-fwrapv_-fPIC_-fPIE_-gdwarf-4_-Wall/constbranchindex/crypto_hash/sha256/rust_sha2/work/target/release/deps/try-444f87ff176ff1a2.4qvuycn7jdjdfii3.rcgu.o" "-Wl,--gc-sections" "-pie" "-Wl,-zrelro" "-Wl,-znow" "-Wl,-O1" "-nodefaultlibs" "-L" ".../supercop-data/panther/amd64/try/c/gcc_-march=native_-mtune=native_-O3_-fwrapv_-fPIC_-fPIE_-gdwarf-4_-Wall/constbranchindex/crypto_hash/sha256/rust_sha2/work/target/release/deps" "-L" ".../supercop-data/panther/amd64/lib" "-L" ".../supercop-data/panther/amd64/try/c/gcc_-march=native_-mtune=native_-O3_-fwrapv_-fPIC_-fPIE_-gdwarf-4_-Wall/constbranchindex/crypto_hash/sha256/rust_sha2/work/target/release/build/crypto_hash_sha256-5cd230be06f90398/out" "-L" "/usr/lib/rustlib/x86_64-unknown-linux-gnu/lib" "-ltry-anything" "-ltry" "-lsupercop" "-lkernelrandombytes" "-lcpucycles" "-lcrypto" "-lntl" "-lnsl" "-lm" "-Wl,-Bstatic" ".../supercop-data/panther/amd64/try/c/gcc_-march=native_-mtune=native_-O3_-fwrapv_-fPIC_-fPIE_-gdwarf-4_-Wall/constbranchindex/crypto_hash/sha256/rust_sha2/work/target/release/deps/libcrypto_hash_sha256-59a535abfecfde21.rlib" ".../supercop-data/panther/amd64/try/c/gcc_-march=native_-mtune=native_-O3_-fwrapv_-fPIC_-fPIE_-gdwarf-4_-Wall/constbranchindex/crypto_hash/sha256/rust_sha2/work/target/release/deps/libsha2-fee2faec0cc98b9d.rlib" ".../supercop-data/panther/amd64/try/c/gcc_-march=native_-mtune=native_-O3_-fwrapv_-fPIC_-fPIE_-gdwarf-4_-Wall/constbranchindex/crypto_hash/sha256/rust_sha2/work/target/release/deps/libcpuid_bool-a511188b3e8fb9e7.rlib" ".../supercop-data/panther/amd64/try/c/gcc_-march=native_-mtune=native_-O3_-fwrapv_-fPIC_-fPIE_-gdwarf-4_-Wall/constbranchindex/crypto_hash/sha256/rust_sha2/work/target/release/deps/libcfg_if-11669ae4b1851f60.rlib" ".../supercop-data/panther/amd64/try/c/gcc_-march=native_-mtune=native_-O3_-fwrapv_-fPIC_-fPIE_-gdwarf-4_-Wall/constbranchindex/crypto_hash/sha256/rust_sha2/work/target/release/deps/libopaque_debug-ff52af415c56e1a8.rlib" ".../supercop-data/panther/amd64/try/c/gcc_-march=native_-mtune=native_-O3_-fwrapv_-fPIC_-fPIE_-gdwarf-4_-Wall/constbranchindex/crypto_hash/sha256/rust_sha2/work/target/release/deps/libdigest-137540d47480a0cd.rlib" ".../supercop-data/panther/amd64/try/c/gcc_-march=native_-mtune=native_-O3_-fwrapv_-fPIC_-fPIE_-gdwarf-4_-Wall/constbranchindex/crypto_hash/sha256/rust_sha2/work/target/release/deps/libblock_buffer-d8051f65e68b5aa7.rlib" ".../supercop-data/panther/amd64/try/c/gcc_-march=native_-mtune=native_-O3_-fwrapv_-fPIC_-fPIE_-gdwarf-4_-Wall/constbranchindex/crypto_hash/sha256/rust_sha2/work/target/release/deps/libgeneric_array-6bd8cd5d26e69f54.rlib" ".../supercop-data/panther/amd64/try/c/gcc_-march=native_-mtune=native_-O3_-fwrapv_-fPIC_-fPIE_-gdwarf-4_-Wall/constbranchindex/crypto_hash/sha256/rust_sha2/work/target/release/deps/libtypenum-ac0d7f64b1a84d19.rlib" "-Wl,--start-group" "/usr/lib/rustlib/x86_64-unknown-linux-gnu/lib/libstd-6bf3f16f340782ca.rlib" "/usr/lib/rustlib/x86_64-unknown-linux-gnu/lib/libpanic_unwind-13f3099d50c21bc6.rlib" "/usr/lib/rustlib/x86_64-unknown-linux-gnu/lib/libminiz_oxide-a2ba33c985785afe.rlib" "/usr/lib/rustlib/x86_64-unknown-linux-gnu/lib/libadler-3f6e9f8f4afbea6d.rlib" "/usr/lib/rustlib/x86_64-unknown-linux-gnu/lib/libobject-af517d7f13e7c960.rlib" "/usr/lib/rustlib/x86_64-unknown-linux-gnu/lib/libaddr2line-12740563628e601f.rlib" "/usr/lib/rustlib/x86_64-unknown-linux-gnu/lib/libgimli-0ac82a1e1820dd21.rlib" "/usr/lib/rustlib/x86_64-unknown-linux-gnu/lib/librustc_demangle-3ac2d0878c297d42.rlib" "/usr/lib/rustlib/x86_64-unknown-linux-gnu/lib/libhashbrown-c6632ca171f954dd.rlib" "/usr/lib/rustlib/x86_64-unknown-linux-gnu/lib/librustc_std_workspace_alloc-b5bfd0198c7b740d.rlib" "/usr/lib/rustlib/x86_64-unknown-linux-gnu/lib/libunwind-bd645b20c6c7b56d.rlib" "/usr/lib/rustlib/x86_64-unknown-linux-gnu/lib/libcfg_if-b9e1e523c0c29a77.rlib" "/usr/lib/rustlib/x86_64-unknown-linux-gnu/lib/liblibc-dfbef8c525de0186.rlib" "/usr/lib/rustlib/x86_64-unknown-linux-gnu/lib/liballoc-1ebf406bd4ea5769.rlib" "/usr/lib/rustlib/x86_64-unknown-linux-gnu/lib/librustc_std_workspace_core-5e0675f526ef5c6b.rlib" "/usr/lib/rustlib/x86_64-unknown-linux-gnu/lib/libcore-3375e4f89d420e7a.rlib" "-Wl,--end-group" "/usr/lib/rustlib/x86_64-unknown-linux-gnu/lib/libcompiler_builtins-f74b197469e67088.rlib" "-Wl,-Bdynamic" "-lgcc_s" "-lc" "-lm" "-lrt" "-lpthread" "-lutil" "-ldl" "-lutil"
try.c:   = note: /usr/bin/ld: cannot find -lcpucycles
try.c:           collect2: error: ld returned 1 exit status
try.c:
try.c:
try.c: error: aborting due to previous error
try.c:
try.c: error: could not compile `crypto_hash_sha256`.
try.c:
try.c: To learn more, run the command again with --verbose.

Number of similar (implementation,compiler) pairs: 1, namely:
ImplementationCompiler
rust_sha2gcc -march=native -mtune=native -O3 -fwrapv -fPIC -fPIE -gdwarf-4 -Wall (10.2.1_20210110)

Compiler output


try.c: error: linking with `cc` failed: exit code: 1
try.c:   |
try.c:   = note: "cc" "-Wl,--as-needed" "-Wl,-z,noexecstack" "-m64" "-Wl,--eh-frame-hdr" "-L" "/usr/lib/rustlib/x86_64-unknown-linux-gnu/lib" ".../supercop-data/panther/amd64/try/c/gcc_-march=native_-mtune=native_-O_-fwrapv_-fPIC_-fPIE_-gdwarf-4_-Wall/constbranchindex/crypto_hash/sha256/rust_sha2/work/target/release/deps/try_small-9e5a796331e8e781.try_small.wogv34f0-cgu.0.rcgu.o" ".../supercop-data/panther/amd64/try/c/gcc_-march=native_-mtune=native_-O_-fwrapv_-fPIC_-fPIE_-gdwarf-4_-Wall/constbranchindex/crypto_hash/sha256/rust_sha2/work/target/release/deps/try_small-9e5a796331e8e781.try_small.wogv34f0-cgu.1.rcgu.o" ".../supercop-data/panther/amd64/try/c/gcc_-march=native_-mtune=native_-O_-fwrapv_-fPIC_-fPIE_-gdwarf-4_-Wall/constbranchindex/crypto_hash/sha256/rust_sha2/work/target/release/deps/try_small-9e5a796331e8e781.try_small.wogv34f0-cgu.2.rcgu.o" ".../supercop-data/panther/amd64/try/c/gcc_-march=native_-mtune=native_-O_-fwrapv_-fPIC_-fPIE_-gdwarf-4_-Wall/constbranchindex/crypto_hash/sha256/rust_sha2/work/target/release/deps/try_small-9e5a796331e8e781.try_small.wogv34f0-cgu.3.rcgu.o" ".../supercop-data/panther/amd64/try/c/gcc_-march=native_-mtune=native_-O_-fwrapv_-fPIC_-fPIE_-gdwarf-4_-Wall/constbranchindex/crypto_hash/sha256/rust_sha2/work/target/release/deps/try_small-9e5a796331e8e781.try_small.wogv34f0-cgu.4.rcgu.o" "-o" ".../supercop-data/panther/amd64/try/c/gcc_-march=native_-mtune=native_-O_-fwrapv_-fPIC_-fPIE_-gdwarf-4_-Wall/constbranchindex/crypto_hash/sha256/rust_sha2/work/target/release/deps/try_small-9e5a796331e8e781" ".../supercop-data/panther/amd64/try/c/gcc_-march=native_-mtune=native_-O_-fwrapv_-fPIC_-fPIE_-gdwarf-4_-Wall/constbranchindex/crypto_hash/sha256/rust_sha2/work/target/release/deps/try_small-9e5a796331e8e781.1bv51pu6l67stnpc.rcgu.o" "-Wl,--gc-sections" "-pie" "-Wl,-zrelro" "-Wl,-znow" "-Wl,-O1" "-nodefaultlibs" "-L" ".../supercop-data/panther/amd64/try/c/gcc_-march=native_-mtune=native_-O_-fwrapv_-fPIC_-fPIE_-gdwarf-4_-Wall/constbranchindex/crypto_hash/sha256/rust_sha2/work/target/release/deps" "-L" ".../supercop-data/panther/amd64/lib" "-L" ".../supercop-data/panther/amd64/try/c/gcc_-march=native_-mtune=native_-O_-fwrapv_-fPIC_-fPIE_-gdwarf-4_-Wall/constbranchindex/crypto_hash/sha256/rust_sha2/work/target/release/build/crypto_hash_sha256-5cd230be06f90398/out" "-L" "/usr/lib/rustlib/x86_64-unknown-linux-gnu/lib" "-ltry-anything" "-ltry-small" "-lsupercop" "-lkernelrandombytes" "-lcpucycles" "-lcrypto" "-lntl" "-lnsl" "-lm" "-Wl,-Bstatic" ".../supercop-data/panther/amd64/try/c/gcc_-march=native_-mtune=native_-O_-fwrapv_-fPIC_-fPIE_-gdwarf-4_-Wall/constbranchindex/crypto_hash/sha256/rust_sha2/work/target/release/deps/libcrypto_hash_sha256-59a535abfecfde21.rlib" ".../supercop-data/panther/amd64/try/c/gcc_-march=native_-mtune=native_-O_-fwrapv_-fPIC_-fPIE_-gdwarf-4_-Wall/constbranchindex/crypto_hash/sha256/rust_sha2/work/target/release/deps/libsha2-fee2faec0cc98b9d.rlib" ".../supercop-data/panther/amd64/try/c/gcc_-march=native_-mtune=native_-O_-fwrapv_-fPIC_-fPIE_-gdwarf-4_-Wall/constbranchindex/crypto_hash/sha256/rust_sha2/work/target/release/deps/libcpuid_bool-a511188b3e8fb9e7.rlib" ".../supercop-data/panther/amd64/try/c/gcc_-march=native_-mtune=native_-O_-fwrapv_-fPIC_-fPIE_-gdwarf-4_-Wall/constbranchindex/crypto_hash/sha256/rust_sha2/work/target/release/deps/libcfg_if-11669ae4b1851f60.rlib" ".../supercop-data/panther/amd64/try/c/gcc_-march=native_-mtune=native_-O_-fwrapv_-fPIC_-fPIE_-gdwarf-4_-Wall/constbranchindex/crypto_hash/sha256/rust_sha2/work/target/release/deps/libopaque_debug-ff52af415c56e1a8.rlib" ".../supercop-data/panther/amd64/try/c/gcc_-march=native_-mtune=native_-O_-fwrapv_-fPIC_-fPIE_-gdwarf-4_-Wall/constbranchindex/crypto_hash/sha256/rust_sha2/work/target/release/deps/libdigest-137540d47480a0cd.rlib" ".../supercop-data/panther/amd64/try/c/gcc_-march=native_-mtune=native_-O_-fwrapv_-fPIC_-fPIE_-gdwarf-4_-Wall/constbranchindex/crypto_hash/sha256/rust_sha2/work/target/release/deps/libblock_buffer-d8051f65e68b5aa7.rlib" ".../supercop-data/panther/amd64/try/c/gcc_-march=native_-mtune=native_-O_-fwrapv_-fPIC_-fPIE_-gdwarf-4_-Wall/constbranchindex/crypto_hash/sha256/rust_sha2/work/target/release/deps/libgeneric_array-6bd8cd5d26e69f54.rlib" ".../supercop-data/panther/amd64/try/c/gcc_-march=native_-mtune=native_-O_-fwrapv_-fPIC_-fPIE_-gdwarf-4_-Wall/constbranchindex/crypto_hash/sha256/rust_sha2/work/target/release/deps/libtypenum-ac0d7f64b1a84d19.rlib" "-Wl,--start-group" "/usr/lib/rustlib/x86_64-unknown-linux-gnu/lib/libstd-6bf3f16f340782ca.rlib" "/usr/lib/rustlib/x86_64-unknown-linux-gnu/lib/libpanic_unwind-13f3099d50c21bc6.rlib" "/usr/lib/rustlib/x86_64-unknown-linux-gnu/lib/libminiz_oxide-a2ba33c985785afe.rlib" "/usr/lib/rustlib/x86_64-unknown-linux-gnu/lib/libadler-3f6e9f8f4afbea6d.rlib" "/usr/lib/rustlib/x86_64-unknown-linux-gnu/lib/libobject-af517d7f13e7c960.rlib" "/usr/lib/rustlib/x86_64-unknown-linux-gnu/lib/libaddr2line-12740563628e601f.rlib" "/usr/lib/rustlib/x86_64-unknown-linux-gnu/lib/libgimli-0ac82a1e1820dd21.rlib" "/usr/lib/rustlib/x86_64-unknown-linux-gnu/lib/librustc_demangle-3ac2d0878c297d42.rlib" "/usr/lib/rustlib/x86_64-unknown-linux-gnu/lib/libhashbrown-c6632ca171f954dd.rlib" "/usr/lib/rustlib/x86_64-unknown-linux-gnu/lib/librustc_std_workspace_alloc-b5bfd0198c7b740d.rlib" "/usr/lib/rustlib/x86_64-unknown-linux-gnu/lib/libunwind-bd645b20c6c7b56d.rlib" "/usr/lib/rustlib/x86_64-unknown-linux-gnu/lib/libcfg_if-b9e1e523c0c29a77.rlib" "/usr/lib/rustlib/x86_64-unknown-linux-gnu/lib/liblibc-dfbef8c525de0186.rlib" "/usr/lib/rustlib/x86_64-unknown-linux-gnu/lib/liballoc-1ebf406bd4ea5769.rlib" "/usr/lib/rustlib/x86_64-unknown-linux-gnu/lib/librustc_std_workspace_core-5e0675f526ef5c6b.rlib" "/usr/lib/rustlib/x86_64-unknown-linux-gnu/lib/libcore-3375e4f89d420e7a.rlib" "-Wl,--end-group" "/usr/lib/rustlib/x86_64-unknown-linux-gnu/lib/libcompiler_builtins-f74b197469e67088.rlib" "-Wl,-Bdynamic" "-lgcc_s" "-lc" "-lm" "-lrt" "-lpthread" "-lutil" "-ldl" "-lutil"
try.c:   = note: /usr/bin/ld: cannot find -lcpucycles
try.c:           collect2: error: ld returned 1 exit status
try.c:
try.c:
try.c: error: aborting due to previous error
try.c:
try.c: error: could not compile `crypto_hash_sha256`.
try.c:
try.c: To learn more, run the command again with --verbose.

Number of similar (implementation,compiler) pairs: 1, namely:
ImplementationCompiler
rust_sha2gcc -march=native -mtune=native -O -fwrapv -fPIC -fPIE -gdwarf-4 -Wall (10.2.1_20210110)

Compiler output


try.c: error: linking with `cc` failed: exit code: 1
try.c:   |
try.c:   = note: "cc" "-Wl,--as-needed" "-Wl,-z,noexecstack" "-m64" "-Wl,--eh-frame-hdr" "-L" "/usr/lib/rustlib/x86_64-unknown-linux-gnu/lib" ".../supercop-data/panther/amd64/try/c/gcc_-march=native_-mtune=native_-Os_-fwrapv_-fPIC_-fPIE_-gdwarf-4_-Wall/constbranchindex/crypto_hash/sha256/rust_sha2/work/target/release/deps/try-444f87ff176ff1a2.try.eh7uyr3c-cgu.0.rcgu.o" ".../supercop-data/panther/amd64/try/c/gcc_-march=native_-mtune=native_-Os_-fwrapv_-fPIC_-fPIE_-gdwarf-4_-Wall/constbranchindex/crypto_hash/sha256/rust_sha2/work/target/release/deps/try-444f87ff176ff1a2.try.eh7uyr3c-cgu.1.rcgu.o" ".../supercop-data/panther/amd64/try/c/gcc_-march=native_-mtune=native_-Os_-fwrapv_-fPIC_-fPIE_-gdwarf-4_-Wall/constbranchindex/crypto_hash/sha256/rust_sha2/work/target/release/deps/try-444f87ff176ff1a2.try.eh7uyr3c-cgu.2.rcgu.o" ".../supercop-data/panther/amd64/try/c/gcc_-march=native_-mtune=native_-Os_-fwrapv_-fPIC_-fPIE_-gdwarf-4_-Wall/constbranchindex/crypto_hash/sha256/rust_sha2/work/target/release/deps/try-444f87ff176ff1a2.try.eh7uyr3c-cgu.3.rcgu.o" ".../supercop-data/panther/amd64/try/c/gcc_-march=native_-mtune=native_-Os_-fwrapv_-fPIC_-fPIE_-gdwarf-4_-Wall/constbranchindex/crypto_hash/sha256/rust_sha2/work/target/release/deps/try-444f87ff176ff1a2.try.eh7uyr3c-cgu.4.rcgu.o" "-o" ".../supercop-data/panther/amd64/try/c/gcc_-march=native_-mtune=native_-Os_-fwrapv_-fPIC_-fPIE_-gdwarf-4_-Wall/constbranchindex/crypto_hash/sha256/rust_sha2/work/target/release/deps/try-444f87ff176ff1a2" ".../supercop-data/panther/amd64/try/c/gcc_-march=native_-mtune=native_-Os_-fwrapv_-fPIC_-fPIE_-gdwarf-4_-Wall/constbranchindex/crypto_hash/sha256/rust_sha2/work/target/release/deps/try-444f87ff176ff1a2.4qvuycn7jdjdfii3.rcgu.o" "-Wl,--gc-sections" "-pie" "-Wl,-zrelro" "-Wl,-znow" "-Wl,-O1" "-nodefaultlibs" "-L" ".../supercop-data/panther/amd64/try/c/gcc_-march=native_-mtune=native_-Os_-fwrapv_-fPIC_-fPIE_-gdwarf-4_-Wall/constbranchindex/crypto_hash/sha256/rust_sha2/work/target/release/deps" "-L" ".../supercop-data/panther/amd64/lib" "-L" ".../supercop-data/panther/amd64/try/c/gcc_-march=native_-mtune=native_-Os_-fwrapv_-fPIC_-fPIE_-gdwarf-4_-Wall/constbranchindex/crypto_hash/sha256/rust_sha2/work/target/release/build/crypto_hash_sha256-5cd230be06f90398/out" "-L" "/usr/lib/rustlib/x86_64-unknown-linux-gnu/lib" "-ltry-anything" "-ltry" "-lsupercop" "-lkernelrandombytes" "-lcpucycles" "-lcrypto" "-lntl" "-lnsl" "-lm" "-Wl,-Bstatic" ".../supercop-data/panther/amd64/try/c/gcc_-march=native_-mtune=native_-Os_-fwrapv_-fPIC_-fPIE_-gdwarf-4_-Wall/constbranchindex/crypto_hash/sha256/rust_sha2/work/target/release/deps/libcrypto_hash_sha256-59a535abfecfde21.rlib" ".../supercop-data/panther/amd64/try/c/gcc_-march=native_-mtune=native_-Os_-fwrapv_-fPIC_-fPIE_-gdwarf-4_-Wall/constbranchindex/crypto_hash/sha256/rust_sha2/work/target/release/deps/libsha2-fee2faec0cc98b9d.rlib" ".../supercop-data/panther/amd64/try/c/gcc_-march=native_-mtune=native_-Os_-fwrapv_-fPIC_-fPIE_-gdwarf-4_-Wall/constbranchindex/crypto_hash/sha256/rust_sha2/work/target/release/deps/libcpuid_bool-a511188b3e8fb9e7.rlib" ".../supercop-data/panther/amd64/try/c/gcc_-march=native_-mtune=native_-Os_-fwrapv_-fPIC_-fPIE_-gdwarf-4_-Wall/constbranchindex/crypto_hash/sha256/rust_sha2/work/target/release/deps/libcfg_if-11669ae4b1851f60.rlib" ".../supercop-data/panther/amd64/try/c/gcc_-march=native_-mtune=native_-Os_-fwrapv_-fPIC_-fPIE_-gdwarf-4_-Wall/constbranchindex/crypto_hash/sha256/rust_sha2/work/target/release/deps/libopaque_debug-ff52af415c56e1a8.rlib" ".../supercop-data/panther/amd64/try/c/gcc_-march=native_-mtune=native_-Os_-fwrapv_-fPIC_-fPIE_-gdwarf-4_-Wall/constbranchindex/crypto_hash/sha256/rust_sha2/work/target/release/deps/libdigest-137540d47480a0cd.rlib" ".../supercop-data/panther/amd64/try/c/gcc_-march=native_-mtune=native_-Os_-fwrapv_-fPIC_-fPIE_-gdwarf-4_-Wall/constbranchindex/crypto_hash/sha256/rust_sha2/work/target/release/deps/libblock_buffer-d8051f65e68b5aa7.rlib" ".../supercop-data/panther/amd64/try/c/gcc_-march=native_-mtune=native_-Os_-fwrapv_-fPIC_-fPIE_-gdwarf-4_-Wall/constbranchindex/crypto_hash/sha256/rust_sha2/work/target/release/deps/libgeneric_array-6bd8cd5d26e69f54.rlib" ".../supercop-data/panther/amd64/try/c/gcc_-march=native_-mtune=native_-Os_-fwrapv_-fPIC_-fPIE_-gdwarf-4_-Wall/constbranchindex/crypto_hash/sha256/rust_sha2/work/target/release/deps/libtypenum-ac0d7f64b1a84d19.rlib" "-Wl,--start-group" "/usr/lib/rustlib/x86_64-unknown-linux-gnu/lib/libstd-6bf3f16f340782ca.rlib" "/usr/lib/rustlib/x86_64-unknown-linux-gnu/lib/libpanic_unwind-13f3099d50c21bc6.rlib" "/usr/lib/rustlib/x86_64-unknown-linux-gnu/lib/libminiz_oxide-a2ba33c985785afe.rlib" "/usr/lib/rustlib/x86_64-unknown-linux-gnu/lib/libadler-3f6e9f8f4afbea6d.rlib" "/usr/lib/rustlib/x86_64-unknown-linux-gnu/lib/libobject-af517d7f13e7c960.rlib" "/usr/lib/rustlib/x86_64-unknown-linux-gnu/lib/libaddr2line-12740563628e601f.rlib" "/usr/lib/rustlib/x86_64-unknown-linux-gnu/lib/libgimli-0ac82a1e1820dd21.rlib" "/usr/lib/rustlib/x86_64-unknown-linux-gnu/lib/librustc_demangle-3ac2d0878c297d42.rlib" "/usr/lib/rustlib/x86_64-unknown-linux-gnu/lib/libhashbrown-c6632ca171f954dd.rlib" "/usr/lib/rustlib/x86_64-unknown-linux-gnu/lib/librustc_std_workspace_alloc-b5bfd0198c7b740d.rlib" "/usr/lib/rustlib/x86_64-unknown-linux-gnu/lib/libunwind-bd645b20c6c7b56d.rlib" "/usr/lib/rustlib/x86_64-unknown-linux-gnu/lib/libcfg_if-b9e1e523c0c29a77.rlib" "/usr/lib/rustlib/x86_64-unknown-linux-gnu/lib/liblibc-dfbef8c525de0186.rlib" "/usr/lib/rustlib/x86_64-unknown-linux-gnu/lib/liballoc-1ebf406bd4ea5769.rlib" "/usr/lib/rustlib/x86_64-unknown-linux-gnu/lib/librustc_std_workspace_core-5e0675f526ef5c6b.rlib" "/usr/lib/rustlib/x86_64-unknown-linux-gnu/lib/libcore-3375e4f89d420e7a.rlib" "-Wl,--end-group" "/usr/lib/rustlib/x86_64-unknown-linux-gnu/lib/libcompiler_builtins-f74b197469e67088.rlib" "-Wl,-Bdynamic" "-lgcc_s" "-lc" "-lm" "-lrt" "-lpthread" "-lutil" "-ldl" "-lutil"
try.c:   = note: /usr/bin/ld: cannot find -lcpucycles
try.c:           collect2: error: ld returned 1 exit status
try.c:
try.c:
try.c: error: aborting due to previous error
try.c:
try.c: error: could not compile `crypto_hash_sha256`.
try.c:
try.c: To learn more, run the command again with --verbose.

Number of similar (implementation,compiler) pairs: 1, namely:
ImplementationCompiler
rust_sha2gcc -march=native -mtune=native -Os -fwrapv -fPIC -fPIE -gdwarf-4 -Wall (10.2.1_20210110)

TIMECOP error (can be valgrind bug)


error 132

Process terminating with default action of signal 4 (SIGILL)
 Illegal opcode at address 0x421FF0
   at 0x...: st32 (try-anything.cpp:47)
   by 0x...: core(unsigned char*, unsigned char const*, unsigned char const*) (try-anything.cpp:78)
   by 0x...: salsa20 (try-anything.cpp:101)
   by 0x...: testvector (try-anything.cpp:124)
   by 0x...: myrandom() (try-anything.cpp:132)
   by 0x...: test() (try.cpp:85)
   by 0x...: main (try-anything.cpp:345)
Illegal instruction

Number of similar (implementation,compiler) pairs: 1, namely:
ImplementationCompiler
cryptoppclang++ -march=native -O2 -fwrapv -Qunused-arguments -fPIC -fPIE -gdwarf-4 -Wall (Debian_Clang_11.0.1)

TIMECOP error (can be valgrind bug)


error 132

Process terminating with default action of signal 4 (SIGILL)
 Illegal opcode at address 0x503B81
   at 0x...: SecureWipeBuffer<unsigned char> (misc.h:1606)
   by 0x...: SecureWipeArray<unsigned char> (misc.h:1709)
   by 0x...: deallocate (secblock.h:434)
   by 0x...: ~SecBlock (secblock.h:799)
   by 0x...: ~FixedSizeSecBlock (secblock.h:1245)
   by 0x...: ~FixedSizeAlignedSecBlock (secblock.h:1258)
   by 0x...: CryptoPP::(anonymous namespace)::SHA256_HashMultipleBlocks_SSE2(unsigned int*, unsigned int const*, unsigned long) (sha.cpp:637)
   by 0x...: CryptoPP::SHA256::HashMultipleBlocks(unsigned int const*, unsigned long) (sha.cpp:937)
   by 0x...: HashBlock (iterhash.h:109)
   by 0x...: CryptoPP::IteratedHashBase<unsigned int, CryptoPP::HashTransformation>::Update(unsigned char const*, unsigned long) (iterhash.cpp:74)
   by 0x...: CalculateDigest (include/cryptopp/cryptlib.h:1194)
   by 0x...: crypto_hash_sha256_cryptopp_constbranchindex (hash.cpp:7)
   by 0x...: test() (try.cpp:90)
   by 0x...: main (try-anything.cpp:345)
Illegal instruction

Number of similar (implementation,compiler) pairs: 1, namely:
ImplementationCompiler
cryptoppclang++ -march=native -O3 -fwrapv -Qunused-arguments -fPIC -fPIE -gdwarf-4 -Wall (Debian_Clang_11.0.1)

TIMECOP error (can be valgrind bug)


error 132

Process terminating with default action of signal 4 (SIGILL)
 Illegal opcode at address 0x503991
   at 0x...: SecureWipeBuffer<unsigned char> (misc.h:1606)
   by 0x...: SecureWipeArray<unsigned char> (misc.h:1709)
   by 0x...: deallocate (secblock.h:434)
   by 0x...: ~SecBlock (secblock.h:799)
   by 0x...: ~FixedSizeSecBlock (secblock.h:1245)
   by 0x...: ~FixedSizeAlignedSecBlock (secblock.h:1258)
   by 0x...: CryptoPP::(anonymous namespace)::SHA256_HashMultipleBlocks_SSE2(unsigned int*, unsigned int const*, unsigned long) (sha.cpp:637)
   by 0x...: CryptoPP::SHA256::HashMultipleBlocks(unsigned int const*, unsigned long) (sha.cpp:937)
   by 0x...: HashBlock (iterhash.h:109)
   by 0x...: CryptoPP::IteratedHashBase<unsigned int, CryptoPP::HashTransformation>::Update(unsigned char const*, unsigned long) (iterhash.cpp:74)
   by 0x...: CryptoPP::HashTransformation::CalculateDigest(unsigned char*, unsigned char const*, unsigned long) (include/cryptopp/cryptlib.h:1194)
   by 0x...: crypto_hash_sha256_cryptopp_constbranchindex (hash.cpp:7)
   by 0x...: test() (try.cpp:90)
   by 0x...: main (try-anything.cpp:345)
Illegal instruction

Number of similar (implementation,compiler) pairs: 1, namely:
ImplementationCompiler
cryptoppclang++ -march=native -O -fwrapv -Qunused-arguments -fPIC -fPIE -gdwarf-4 -Wall (Debian_Clang_11.0.1)

TIMECOP error (can be valgrind bug)


error 132

Process terminating with default action of signal 4 (SIGILL)
 Illegal opcode at address 0x421A3E
   at 0x...: core(unsigned char*, unsigned char const*, unsigned char const*) (try-anything.cpp:73)
   by 0x...: salsa20 (try-anything.cpp:101)
   by 0x...: testvector (try-anything.cpp:124)
   by 0x...: myrandom() (try-anything.cpp:132)
   by 0x...: test() (try.cpp:85)
   by 0x...: main (try-anything.cpp:345)
Illegal instruction

Number of similar (implementation,compiler) pairs: 1, namely:
ImplementationCompiler
cryptoppclang++ -march=native -Os -fwrapv -Qunused-arguments -fPIC -fPIE -gdwarf-4 -Wall (Debian_Clang_11.0.1)

TIMECOP error (can be valgrind bug)


error 132

Process terminating with default action of signal 4 (SIGILL)
 Illegal opcode at address 0x171D19
   at 0x...: salsa20(unsigned char*, unsigned long, unsigned char const*, unsigned char const*) [clone .part.0] (try-anything.cpp:102)
   by 0x...: salsa20 (try-anything.cpp:85)
   by 0x...: canary (try-anything.cpp:148)
   by 0x...: input_prepare(unsigned char*, unsigned char*, unsigned long long) (try-anything.cpp:163)
   by 0x...: test() (try.cpp:88)
   by 0x...: main (try-anything.cpp:345)
Illegal instruction

Number of similar (implementation,compiler) pairs: 1, namely:
ImplementationCompiler
cryptoppg++ -march=native -mtune=native -O2 -fwrapv -fPIC -fPIE -gdwarf-4 -Wall (10.2.1_20210110)

TIMECOP error (can be valgrind bug)


error 132

Process terminating with default action of signal 4 (SIGILL)
 Illegal opcode at address 0x170C1A
   at 0x...: st32 (try-anything.cpp:47)
   by 0x...: core(unsigned char*, unsigned char const*, unsigned char const*) (try-anything.cpp:78)
   by 0x...: salsa20 (try-anything.cpp:101)
   by 0x...: salsa20 (try-anything.cpp:81)
   by 0x...: testvector (try-anything.cpp:124)
   by 0x...: myrandom() (try-anything.cpp:132)
   by 0x...: test() (try.cpp:85)
   by 0x...: main (try-anything.cpp:345)
Illegal instruction

Number of similar (implementation,compiler) pairs: 1, namely:
ImplementationCompiler
cryptoppg++ -march=native -mtune=native -O3 -fwrapv -fPIC -fPIE -gdwarf-4 -Wall (10.2.1_20210110)

TIMECOP error (can be valgrind bug)


error 132

Process terminating with default action of signal 4 (SIGILL)
 Illegal opcode at address 0x252FA1
   at 0x...: SecureWipeBuffer<unsigned char> (misc.h:1606)
   by 0x...: SecureWipeArray<unsigned char> (misc.h:1709)
   by 0x...: deallocate (secblock.h:434)
   by 0x...: ~SecBlock (secblock.h:799)
   by 0x...: ~FixedSizeSecBlock (secblock.h:1245)
   by 0x...: ~FixedSizeAlignedSecBlock (secblock.h:1258)
   by 0x...: CryptoPP::(anonymous namespace)::SHA256_HashMultipleBlocks_SSE2(unsigned int*, unsigned int const*, unsigned long) (sha.cpp:637)
   by 0x...: CryptoPP::SHA256::HashMultipleBlocks(unsigned int const*, unsigned long) (sha.cpp:937)
   by 0x...: HashBlock (iterhash.h:109)
   by 0x...: CryptoPP::IteratedHashBase<unsigned int, CryptoPP::HashTransformation>::Update(unsigned char const*, unsigned long) (iterhash.cpp:74)
   by 0x...: CalculateDigest (cryptlib.h:1194)
   by 0x...: crypto_hash_sha256_cryptopp_constbranchindex (hash.cpp:7)
   by 0x...: test() (try.cpp:90)
   by 0x...: main (try-anything.cpp:345)
Illegal instruction

Number of similar (implementation,compiler) pairs: 1, namely:
ImplementationCompiler
cryptoppg++ -march=native -mtune=native -O -fwrapv -fPIC -fPIE -gdwarf-4 -Wall (10.2.1_20210110)

TIMECOP error (can be valgrind bug)


error 132

Process terminating with default action of signal 4 (SIGILL)
 Illegal opcode at address 0x2528C1
   at 0x...: SecureWipeBuffer<unsigned char> (misc.h:1606)
   by 0x...: SecureWipeArray<unsigned char> (misc.h:1709)
   by 0x...: deallocate (secblock.h:434)
   by 0x...: ~SecBlock (secblock.h:799)
   by 0x...: ~FixedSizeSecBlock (secblock.h:1245)
   by 0x...: ~FixedSizeAlignedSecBlock (secblock.h:1258)
   by 0x...: CryptoPP::(anonymous namespace)::SHA256_HashMultipleBlocks_SSE2(unsigned int*, unsigned int const*, unsigned long) (sha.cpp:637)
   by 0x...: CryptoPP::SHA256::HashMultipleBlocks(unsigned int const*, unsigned long) (sha.cpp:937)
   by 0x...: HashBlock (iterhash.h:109)
   by 0x...: CryptoPP::IteratedHashBase<unsigned int, CryptoPP::HashTransformation>::Update(unsigned char const*, unsigned long) (iterhash.cpp:74)
   by 0x...: CryptoPP::HashTransformation::CalculateDigest(unsigned char*, unsigned char const*, unsigned long) (cryptlib.h:1194)
   by 0x...: crypto_hash_sha256_cryptopp_constbranchindex (hash.cpp:7)
   by 0x...: test() (try.cpp:90)
   by 0x...: main (try-anything.cpp:345)
Illegal instruction

Number of similar (implementation,compiler) pairs: 1, namely:
ImplementationCompiler
cryptoppg++ -march=native -mtune=native -Os -fwrapv -fPIC -fPIE -gdwarf-4 -Wall (10.2.1_20210110)

TIMECOP error (can be valgrind bug)


error 132

Process terminating with default action of signal 4 (SIGILL)
 Illegal opcode at address 0x402020
   at 0x...: st32 (try-anything.c:47)
   by 0x...: core (try-anything.c:78)
   by 0x...: salsa20 (try-anything.c:101)
   by 0x...: testvector (try-anything.c:124)
   by 0x...: myrandom (try-anything.c:132)
   by 0x...: test (try.c:85)
   by 0x...: main (try-anything.c:345)
Illegal instruction

Number of similar (implementation,compiler) pairs: 1, namely:
ImplementationCompiler
opensslclang -march=native -O2 -fwrapv -Qunused-arguments -fPIC -fPIE -gdwarf-4 -Wall (Debian_Clang_11.0.1)

TIMECOP error (can be valgrind bug)


error 132

Process terminating with default action of signal 4 (SIGILL)
 Illegal opcode at address 0x401A6E
   at 0x...: core (try-anything.c:73)
   by 0x...: salsa20 (try-anything.c:101)
   by 0x...: testvector (try-anything.c:124)
   by 0x...: myrandom (try-anything.c:132)
   by 0x...: test (try.c:85)
   by 0x...: main (try-anything.c:345)
Illegal instruction

Number of similar (implementation,compiler) pairs: 1, namely:
ImplementationCompiler
opensslclang -march=native -Os -fwrapv -Qunused-arguments -fPIC -fPIE -gdwarf-4 -Wall (Debian_Clang_11.0.1)

TIMECOP error (can be valgrind bug)


error 132

Process terminating with default action of signal 4 (SIGILL)
 Illegal opcode at address 0x109C59
   at 0x...: salsa20.part.0 (try-anything.c:102)
   by 0x...: salsa20 (try-anything.c:85)
   by 0x...: canary (try-anything.c:148)
   by 0x...: input_prepare (try-anything.c:163)
   by 0x...: test (try.c:88)
   by 0x...: main (try-anything.c:345)
Illegal instruction

Number of similar (implementation,compiler) pairs: 1, namely:
ImplementationCompiler
opensslgcc -march=native -mtune=native -O2 -fwrapv -fPIC -fPIE -gdwarf-4 -Wall (10.2.1_20210110)

TIMECOP error (can be valgrind bug)


error 132

Process terminating with default action of signal 4 (SIGILL)
 Illegal opcode at address 0x109B1A
   at 0x...: st32 (try-anything.c:47)
   by 0x...: core (try-anything.c:78)
   by 0x...: salsa20 (try-anything.c:101)
   by 0x...: salsa20 (try-anything.c:81)
   by 0x...: testvector (try-anything.c:124)
   by 0x...: myrandom (try-anything.c:132)
   by 0x...: test (try.c:85)
   by 0x...: main (try-anything.c:345)
Illegal instruction

Number of similar (implementation,compiler) pairs: 1, namely:
ImplementationCompiler
opensslgcc -march=native -mtune=native -O3 -fwrapv -fPIC -fPIE -gdwarf-4 -Wall (10.2.1_20210110)

TIMECOP error (can be valgrind bug)


error 132

Process terminating with default action of signal 4 (SIGILL)
 Illegal opcode at address 0x402010
   at 0x...: st32 (try-anything.c:47)
   by 0x...: core (try-anything.c:78)
   by 0x...: salsa20 (try-anything.c:101)
   by 0x...: testvector (try-anything.c:124)
   by 0x...: myrandom (try-anything.c:132)
   by 0x...: test (try.c:85)
   by 0x...: main (try-anything.c:345)
Illegal instruction

Number of similar (implementation,compiler) pairs: 3, namely:
ImplementationCompiler
refclang -march=native -O2 -fwrapv -Qunused-arguments -fPIC -fPIE -gdwarf-4 -Wall (Debian_Clang_11.0.1)
sphlibclang -march=native -O2 -fwrapv -Qunused-arguments -fPIC -fPIE -gdwarf-4 -Wall (Debian_Clang_11.0.1)
sphlib-smallclang -march=native -O2 -fwrapv -Qunused-arguments -fPIC -fPIE -gdwarf-4 -Wall (Debian_Clang_11.0.1)

TIMECOP error (can be valgrind bug)


error 132

Process terminating with default action of signal 4 (SIGILL)
 Illegal opcode at address 0x402BB0
   at 0x...: crypto_hashblocks_sha256_dolbeau_amd64_sha_constbranchindex (blocks.c:0)
   by 0x...: crypto_hash_sha256_ref_constbranchindex (hash.c:34)
   by 0x...: test (try.c:90)
   by 0x...: main (try-anything.c:345)
Illegal instruction

Number of similar (implementation,compiler) pairs: 1, namely:
ImplementationCompiler
refclang -march=native -O3 -fwrapv -Qunused-arguments -fPIC -fPIE -gdwarf-4 -Wall (Debian_Clang_11.0.1)

TIMECOP error (can be valgrind bug)


error 132

Process terminating with default action of signal 4 (SIGILL)
 Illegal opcode at address 0x402270
   at 0x...: crypto_hashblocks_sha256_dolbeau_amd64_sha_constbranchindex (blocks.c:0)
   by 0x...: crypto_hash_sha256_ref_constbranchindex (hash.c:34)
   by 0x...: test (try.c:90)
   by 0x...: main (try-anything.c:345)
Illegal instruction

Number of similar (implementation,compiler) pairs: 1, namely:
ImplementationCompiler
refclang -march=native -O -fwrapv -Qunused-arguments -fPIC -fPIE -gdwarf-4 -Wall (Debian_Clang_11.0.1)

TIMECOP error (can be valgrind bug)


error 132

Process terminating with default action of signal 4 (SIGILL)
 Illegal opcode at address 0x401A5E
   at 0x...: core (try-anything.c:73)
   by 0x...: salsa20 (try-anything.c:101)
   by 0x...: testvector (try-anything.c:124)
   by 0x...: myrandom (try-anything.c:132)
   by 0x...: test (try.c:85)
   by 0x...: main (try-anything.c:345)
Illegal instruction

Number of similar (implementation,compiler) pairs: 3, namely:
ImplementationCompiler
refclang -march=native -Os -fwrapv -Qunused-arguments -fPIC -fPIE -gdwarf-4 -Wall (Debian_Clang_11.0.1)
sphlibclang -march=native -Os -fwrapv -Qunused-arguments -fPIC -fPIE -gdwarf-4 -Wall (Debian_Clang_11.0.1)
sphlib-smallclang -march=native -Os -fwrapv -Qunused-arguments -fPIC -fPIE -gdwarf-4 -Wall (Debian_Clang_11.0.1)

TIMECOP error (can be valgrind bug)


error 132

Process terminating with default action of signal 4 (SIGILL)
 Illegal opcode at address 0x402A30
   at 0x...: crypto_hashblocks_sha256_dolbeau_amd64_sha_constbranchindex (blocks.c:0)
   by 0x...: crypto_hash_sha256_ref_constbranchindex (hash.c:34)
   by 0x...: test (try.c:90)
   by 0x...: main (try-anything.c:345)
Illegal instruction

Number of similar (implementation,compiler) pairs: 1, namely:
ImplementationCompiler
refclang -mcpu=native -O3 -fwrapv -Qunused-arguments -fPIC -fPIE -gdwarf-4 -Wall (Debian_Clang_11.0.1)

TIMECOP error (can be valgrind bug)


error 132

Process terminating with default action of signal 4 (SIGILL)
 Illegal opcode at address 0x109C49
   at 0x...: salsa20.part.0 (try-anything.c:102)
   by 0x...: salsa20 (try-anything.c:85)
   by 0x...: canary (try-anything.c:148)
   by 0x...: input_prepare (try-anything.c:163)
   by 0x...: test (try.c:88)
   by 0x...: main (try-anything.c:345)
Illegal instruction

Number of similar (implementation,compiler) pairs: 3, namely:
ImplementationCompiler
refgcc -march=native -mtune=native -O2 -fwrapv -fPIC -fPIE -gdwarf-4 -Wall (10.2.1_20210110)
sphlibgcc -march=native -mtune=native -O2 -fwrapv -fPIC -fPIE -gdwarf-4 -Wall (10.2.1_20210110)
sphlib-smallgcc -march=native -mtune=native -O2 -fwrapv -fPIC -fPIE -gdwarf-4 -Wall (10.2.1_20210110)

TIMECOP error (can be valgrind bug)


error 132

Process terminating with default action of signal 4 (SIGILL)
 Illegal opcode at address 0x109B0A
   at 0x...: st32 (try-anything.c:47)
   by 0x...: core (try-anything.c:78)
   by 0x...: salsa20 (try-anything.c:101)
   by 0x...: salsa20 (try-anything.c:81)
   by 0x...: testvector (try-anything.c:124)
   by 0x...: myrandom (try-anything.c:132)
   by 0x...: test (try.c:85)
   by 0x...: main (try-anything.c:345)
Illegal instruction

Number of similar (implementation,compiler) pairs: 3, namely:
ImplementationCompiler
refgcc -march=native -mtune=native -O3 -fwrapv -fPIC -fPIE -gdwarf-4 -Wall (10.2.1_20210110)
sphlibgcc -march=native -mtune=native -O3 -fwrapv -fPIC -fPIE -gdwarf-4 -Wall (10.2.1_20210110)
sphlib-smallgcc -march=native -mtune=native -O3 -fwrapv -fPIC -fPIE -gdwarf-4 -Wall (10.2.1_20210110)

TIMECOP error (can be valgrind bug)


error 132

Process terminating with default action of signal 4 (SIGILL)
 Illegal opcode at address 0x10A2B0
   at 0x...: crypto_hashblocks_sha256_dolbeau_amd64_sha_constbranchindex (blocks.c:0)
   by 0x...: crypto_hash_sha256_ref_constbranchindex (hash.c:34)
   by 0x...: test (try.c:90)
   by 0x...: main (try-anything.c:345)
Illegal instruction

Number of similar (implementation,compiler) pairs: 1, namely:
ImplementationCompiler
refgcc -march=native -mtune=native -O -fwrapv -fPIC -fPIE -gdwarf-4 -Wall (10.2.1_20210110)

TIMECOP error (can be valgrind bug)


error 132

Process terminating with default action of signal 4 (SIGILL)
 Illegal opcode at address 0x109F40
   at 0x...: crypto_hashblocks_sha256_dolbeau_amd64_sha_constbranchindex (blocks.c:0)
   by 0x...: crypto_hash_sha256_ref_constbranchindex (hash.c:34)
   by 0x...: test (try.c:90)
   by 0x...: main (try-anything.c:345)
Illegal instruction

Number of similar (implementation,compiler) pairs: 1, namely:
ImplementationCompiler
refgcc -march=native -mtune=native -Os -fwrapv -fPIC -fPIE -gdwarf-4 -Wall (10.2.1_20210110)

TIMECOP error (can be valgrind bug)


error 132

Process terminating with default action of signal 4 (SIGILL)
 Illegal opcode at address 0x4037BA
   at 0x...: sha2_round (sha2.c:612)
   by 0x...: crypto_hash_sha256_sphlib_small_constbranchindex_sha224 (md_helper.i:206)
   by 0x...: crypto_hash_sha256_sphlib_small_constbranchindex (hash.c:8)
   by 0x...: test (try.c:90)
   by 0x...: main (try-anything.c:345)
Illegal instruction

Number of similar (implementation,compiler) pairs: 1, namely:
ImplementationCompiler
sphlib-smallclang -march=native -O3 -fwrapv -Qunused-arguments -fPIC -fPIE -gdwarf-4 -Wall (Debian_Clang_11.0.1)

Passed TIMECOP


TIMECOP iterations: 10

Number of similar (implementation,compiler) pairs: 14, namely:
ImplementationCompiler
opensslclang -march=native -O3 -fwrapv -Qunused-arguments -fPIC -fPIE -gdwarf-4 -Wall (Debian_Clang_11.0.1)
opensslclang -march=native -O -fwrapv -Qunused-arguments -fPIC -fPIE -gdwarf-4 -Wall (Debian_Clang_11.0.1)
opensslclang -mcpu=native -O3 -fwrapv -Qunused-arguments -fPIC -fPIE -gdwarf-4 -Wall (Debian_Clang_11.0.1)
opensslgcc -march=native -mtune=native -O -fwrapv -fPIC -fPIE -gdwarf-4 -Wall (10.2.1_20210110)
opensslgcc -march=native -mtune=native -Os -fwrapv -fPIC -fPIE -gdwarf-4 -Wall (10.2.1_20210110)
sphlibclang -march=native -O3 -fwrapv -Qunused-arguments -fPIC -fPIE -gdwarf-4 -Wall (Debian_Clang_11.0.1)
sphlibclang -march=native -O -fwrapv -Qunused-arguments -fPIC -fPIE -gdwarf-4 -Wall (Debian_Clang_11.0.1)
sphlibclang -mcpu=native -O3 -fwrapv -Qunused-arguments -fPIC -fPIE -gdwarf-4 -Wall (Debian_Clang_11.0.1)
sphlibgcc -march=native -mtune=native -O -fwrapv -fPIC -fPIE -gdwarf-4 -Wall (10.2.1_20210110)
sphlibgcc -march=native -mtune=native -Os -fwrapv -fPIC -fPIE -gdwarf-4 -Wall (10.2.1_20210110)
sphlib-smallclang -march=native -O -fwrapv -Qunused-arguments -fPIC -fPIE -gdwarf-4 -Wall (Debian_Clang_11.0.1)
sphlib-smallclang -mcpu=native -O3 -fwrapv -Qunused-arguments -fPIC -fPIE -gdwarf-4 -Wall (Debian_Clang_11.0.1)
sphlib-smallgcc -march=native -mtune=native -O -fwrapv -fPIC -fPIE -gdwarf-4 -Wall (10.2.1_20210110)
sphlib-smallgcc -march=native -mtune=native -Os -fwrapv -fPIC -fPIE -gdwarf-4 -Wall (10.2.1_20210110)