Test results for amd64, meteor,tiny, crypto_kem/titaniumccasuper
[Page version: 20261015 12:45:42]
Measurements for amd64, meteor,tiny, crypto_kem
Test results for amd64, meteor,tiny, crypto_kem
Test results for crypto_kem/titaniumccasuper
Computer: meteor,tiny
Microarchitecture: amd64; Crestmont (a06a4-20)
Architecture: amd64
CPU ID: GenuineIntel-000a06a4-20-bfebfbff
SUPERCOP version: 20261004
Operation: crypto_kem
Primitive: titaniumccasuper
| Time | Object size | Test size | Implementation | Compiler | Benchmark date | SUPERCOP version |
| 6551974 | 156253 0 64 | 362463 1224 2456 | T:avx2 | gcc -march=native -mtune=native -O3 -fwrapv -fPIC -fPIE -gdwarf-4 -Wall | 20260807 | 20260627 |
| 6614952 | 146162 0 64 | 349527 1224 2456 | T:avx2 | gcc -march=native -mtune=native -O -fwrapv -fPIC -fPIE -gdwarf-4 -Wall | 20260807 | 20260627 |
| 6628199 | 151129 0 64 | 354983 1224 2456 | T:avx2 | gcc -march=native -mtune=native -O2 -fwrapv -fPIC -fPIE -gdwarf-4 -Wall | 20260807 | 20260627 |
| 6668649 | 156630 0 36 | 362971 1264 2456 | T:avx2 | clang -march=native -O3 -fwrapv -Qunused-arguments -fPIC -fPIE -gdwarf-4 -Wall | 20260807 | 20260627 |
| 6669759 | 155868 0 36 | 362267 1264 2456 | T:avx2 | clang -march=native -O2 -fwrapv -Qunused-arguments -fPIC -fPIE -gdwarf-4 -Wall | 20260807 | 20260627 |
| 6816727 | 149185 0 36 | 351435 1264 2360 | T:avx2 | clang -march=native -O -fwrapv -Qunused-arguments -fPIC -fPIE -gdwarf-4 -Wall | 20260807 | 20260627 |
| 6850318 | 145297 0 36 | 348461 1256 2456 | T:avx2 | clang -march=native -Os -fwrapv -Qunused-arguments -fPIC -fPIE -gdwarf-4 -Wall | 20260807 | 20260627 |
| 8350800 | 116323 0 36 | 322155 1264 2456 | T:opt | clang -march=native -O2 -fwrapv -Qunused-arguments -fPIC -fPIE -gdwarf-4 -Wall | 20260807 | 20260627 |
| 8428835 | 144656 0 36 | 350115 1264 2456 | T:opt | clang -march=native -O3 -fwrapv -Qunused-arguments -fPIC -fPIE -gdwarf-4 -Wall | 20260807 | 20260627 |
| 8673895 | 107711 0 36 | 312739 1264 2360 | T:opt | clang -mcpu=native -O3 -fwrapv -Qunused-arguments -fPIC -fPIE -gdwarf-4 -Wall | 20260807 | 20260627 |
| 8981509 | 84006 0 36 | 287437 1256 2456 | T:opt | clang -march=native -Os -fwrapv -Qunused-arguments -fPIC -fPIE -gdwarf-4 -Wall | 20260807 | 20260627 |
| 9027846 | 111245 0 64 | 317375 1224 2456 | T:opt | gcc -march=native -mtune=native -O3 -fwrapv -fPIC -fPIE -gdwarf-4 -Wall | 20260807 | 20260627 |
| 9132192 | 88919 0 64 | 292879 1224 2456 | T:opt | gcc -march=native -mtune=native -O2 -fwrapv -fPIC -fPIE -gdwarf-4 -Wall | 20260807 | 20260627 |
| 9258783 | 82930 0 36 | 285843 1264 2360 | T:opt | clang -march=native -O -fwrapv -Qunused-arguments -fPIC -fPIE -gdwarf-4 -Wall | 20260807 | 20260627 |
| 10001080 | 82070 0 64 | 285591 1224 2456 | T:opt | gcc -march=native -mtune=native -O -fwrapv -fPIC -fPIE -gdwarf-4 -Wall | 20260807 | 20260627 |
| 1345997776 | 72815 0 36 | 279403 1264 2456 | T:ref | clang -march=native -O2 -fwrapv -Qunused-arguments -fPIC -fPIE -gdwarf-4 -Wall | 20260807 | 20260627 |
| 1346616392 | 105868 0 36 | 312363 1264 2456 | T:ref | clang -march=native -O3 -fwrapv -Qunused-arguments -fPIC -fPIE -gdwarf-4 -Wall | 20260807 | 20260627 |
| 1407360157 | 75168 0 36 | 280603 1264 2360 | T:ref | clang -mcpu=native -O3 -fwrapv -Qunused-arguments -fPIC -fPIE -gdwarf-4 -Wall | 20260807 | 20260627 |
| 1424611981 | 59113 0 36 | 262229 1256 2456 | T:ref | clang -march=native -Os -fwrapv -Qunused-arguments -fPIC -fPIE -gdwarf-4 -Wall | 20260807 | 20260627 |
| 1467789772 | 55585 0 36 | 258451 1264 2360 | T:ref | clang -march=native -O -fwrapv -Qunused-arguments -fPIC -fPIE -gdwarf-4 -Wall | 20260807 | 20260627 |
| 1541263344 | 55594 0 64 | 258967 1224 2456 | T:ref | gcc -march=native -mtune=native -O -fwrapv -fPIC -fPIE -gdwarf-4 -Wall | 20260807 | 20260627 |
| 1541316963 | 56126 0 64 | 259919 1224 2456 | T:ref | gcc -march=native -mtune=native -O2 -fwrapv -fPIC -fPIE -gdwarf-4 -Wall | 20260807 | 20260627 |
| 1548900687 | 72038 0 64 | 278279 1224 2456 | T:ref | gcc -march=native -mtune=native -O3 -fwrapv -fPIC -fPIE -gdwarf-4 -Wall | 20260807 | 20260627 |
| 2091619474 | 53812 0 64 | 255602 1216 2424 | T:ref | gcc -march=native -mtune=native -Os -fwrapv -fPIC -fPIE -gdwarf-4 -Wall | 20260807 | 20260627 |
Compiler output
encrypt.c: encrypt.c:63:8: error: always_inline function '_mm256_loadu_si256' requires target feature 'avx', but would be inlined into function 'crypto_encrypt_keypair' that is compiled without support for 'avx'
encrypt.c: 63 | u = _mm256_loadu_si256((__m256i *)(a[i] + j));
encrypt.c: | ^
encrypt.c: encrypt.c:63:8: error: AVX vector return of type '__m256i' (vector of 4 'long long' values) without 'avx' enabled changes the ABI
encrypt.c: encrypt.c:64:8: error: always_inline function '_mm256_loadu_si256' requires target feature 'avx', but would be inlined into function 'crypto_encrypt_keypair' that is compiled without support for 'avx'
encrypt.c: 64 | v = _mm256_loadu_si256((__m256i *)(s + j));
encrypt.c: | ^
encrypt.c: encrypt.c:64:8: error: AVX vector return of type '__m256i' (vector of 4 'long long' values) without 'avx' enabled changes the ABI
encrypt.c: encrypt.c:65:8: error: always_inline function '_mm256_mul_epu32' requires target feature 'avx2', but would be inlined into function 'crypto_encrypt_keypair' that is compiled without support for 'avx2'
encrypt.c: 65 | t = _mm256_mul_epu32(u, v);
encrypt.c: | ^
encrypt.c: encrypt.c:65:8: error: AVX vector argument of type '__m256i' (vector of 4 'long long' values) without 'avx' enabled changes the ABI
encrypt.c: encrypt.c:66:4: error: always_inline function '_mm256_storeu_si256' requires target feature 'avx', but would be inlined into function 'crypto_encrypt_keypair' that is compiled without support for 'avx'
encrypt.c: 66 | _mm256_storeu_si256((__m256i *)(a[i] + j), t);
encrypt.c: | ^
encrypt.c: encrypt.c:66:4: error: AVX vector argument of type '__m256i' (vector of 4 'long long' values) without 'avx' enabled changes the ABI
encrypt.c: encrypt.c:78:8: error: always_inline function '_mm256_loadu_si256' requires target feature 'avx', but would be inlined into function 'crypto_encrypt_keypair' that is compiled without support for 'avx'
encrypt.c: 78 | u = _mm256_loadu_si256((__m256i *)(a[i] + j));
encrypt.c: | ^
encrypt.c: encrypt.c:78:8: error: AVX vector return of type '__m256i' (vector of 4 'long long' values) without 'avx' enabled changes the ABI
encrypt.c: encrypt.c:79:8: error: always_inline function '_mm256_loadu_si256' requires target feature 'avx', but would be inlined into function 'crypto_encrypt_keypair' that is compiled without support for 'avx'
encrypt.c: 79 | v = _mm256_loadu_si256((__m256i *)(e[i] + j));
encrypt.c: | ^
encrypt.c: encrypt.c:79:8: error: AVX vector return of type '__m256i' (vector of 4 'long long' values) without 'avx' enabled changes the ABI
encrypt.c: encrypt.c:80:8: error: always_inline function '_mm256_add_epi64' requires target feature 'avx2', but would be inlined into function 'crypto_encrypt_keypair' that is compiled without support for 'avx2'
encrypt.c: ...
Number of similar (implementation,compiler) pairs: 1, namely:
| Implementation | Compiler |
| T:avx2 | clang -mcpu=native -O3 -fwrapv -Qunused-arguments -fPIC -fPIE -gdwarf-4 -Wall (Debian_Clang_19.1.7_(3+b1)) |
Compiler output
try.c: /usr/bin/ld: libcrypto_kem_titaniumccasuper.a(sampler.o): in function `sampler_zq':
try.c: .../supercop-data/meteor,tiny/amd64/try/c/gcc_-march=native_-mtune=native_-Os_-fwrapv_-fPIC_-fPIE_-gdwarf-4_-Wall/timingleaks/crypto_kem/titaniumccasuper/avx2/work/sampler.c:160:(.text+0x...): undefined reference to `barrett_zq'
try.c: collect2: error: ld returned 1 exit status
Number of similar (implementation,compiler) pairs: 1, namely:
| Implementation | Compiler |
| T:avx2 | gcc -march=native -mtune=native -Os -fwrapv -fPIC -fPIE -gdwarf-4 -Wall (14.2.0) |
Compiler output
try.c: /usr/bin/ld: libcrypto_kem_titaniumccasuper.a(encrypt.o): in function `crypto_encrypt_keypair':
try.c: .../supercop-data/meteor,tiny/amd64/try/c/gcc_-march=native_-mtune=native_-Os_-fwrapv_-fPIC_-fPIE_-gdwarf-4_-Wall/timingleaks/crypto_kem/titaniumccasuper/opt/work/encrypt.c:63:(.text+0x...): undefined reference to `barrett_4q'
try.c: /usr/bin/ld: libcrypto_kem_titaniumccasuper.a(ntt.o): in function `ntt_2':
try.c: .../supercop-data/meteor,tiny/amd64/try/c/gcc_-march=native_-mtune=native_-Os_-fwrapv_-fPIC_-fPIE_-gdwarf-4_-Wall/timingleaks/crypto_kem/titaniumccasuper/opt/work/ntt.c:725:(.text+0x...): undefined reference to `barrett_4q'
try.c: /usr/bin/ld: .../supercop-data/meteor,tiny/amd64/try/c/gcc_-march=native_-mtune=native_-Os_-fwrapv_-fPIC_-fPIE_-gdwarf-4_-Wall/timingleaks/crypto_kem/titaniumccasuper/opt/work/ntt.c:726:(.text+0x...): undefined reference to `barrett_4q'
try.c: /usr/bin/ld: .../supercop-data/meteor,tiny/amd64/try/c/gcc_-march=native_-mtune=native_-Os_-fwrapv_-fPIC_-fPIE_-gdwarf-4_-Wall/timingleaks/crypto_kem/titaniumccasuper/opt/work/ntt.c:737:(.text+0x...): undefined reference to `barrett_4q'
try.c: /usr/bin/ld: .../supercop-data/meteor,tiny/amd64/try/c/gcc_-march=native_-mtune=native_-Os_-fwrapv_-fPIC_-fPIE_-gdwarf-4_-Wall/timingleaks/crypto_kem/titaniumccasuper/opt/work/ntt.c:738:(.text+0x...): undefined reference to `montgomery'
try.c: /usr/bin/ld: .../supercop-data/meteor,tiny/amd64/try/c/gcc_-march=native_-mtune=native_-Os_-fwrapv_-fPIC_-fPIE_-gdwarf-4_-Wall/timingleaks/crypto_kem/titaniumccasuper/opt/work/ntt.c:756:(.text+0x...): undefined reference to `barrett_4q'
try.c: /usr/bin/ld: .../supercop-data/meteor,tiny/amd64/try/c/gcc_-march=native_-mtune=native_-Os_-fwrapv_-fPIC_-fPIE_-gdwarf-4_-Wall/timingleaks/crypto_kem/titaniumccasuper/opt/work/ntt.c:757:(.text+0x...): undefined reference to `barrett_4q'
try.c: /usr/bin/ld: .../supercop-data/meteor,tiny/amd64/try/c/gcc_-march=native_-mtune=native_-Os_-fwrapv_-fPIC_-fPIE_-gdwarf-4_-Wall/timingleaks/crypto_kem/titaniumccasuper/opt/work/ntt.c:762:(.text+0x...): undefined reference to `barrett_4q'
try.c: /usr/bin/ld: .../supercop-data/meteor,tiny/amd64/try/c/gcc_-march=native_-mtune=native_-Os_-fwrapv_-fPIC_-fPIE_-gdwarf-4_-Wall/timingleaks/crypto_kem/titaniumccasuper/opt/work/ntt.c:763:(.text+0x...): undefined reference to `montgomery'
try.c: /usr/bin/ld: .../supercop-data/meteor,tiny/amd64/try/c/gcc_-march=native_-mtune=native_-Os_-fwrapv_-fPIC_-fPIE_-gdwarf-4_-Wall/timingleaks/crypto_kem/titaniumccasuper/opt/work/ntt.c:773:(.text+0x...): undefined reference to `barrett_4q'
try.c: /usr/bin/ld: .../supercop-data/meteor,tiny/amd64/try/c/gcc_-march=native_-mtune=native_-Os_-fwrapv_-fPIC_-fPIE_-gdwarf-4_-Wall/timingleaks/crypto_kem/titaniumccasuper/opt/work/ntt.c:774:(.text+0x...): undefined reference to `barrett_4q'
try.c: /usr/bin/ld: libcrypto_kem_titaniumccasuper.a(ntt.o): in function `ntt_core':
try.c: .../supercop-data/meteor,tiny/amd64/try/c/gcc_-march=native_-mtune=native_-Os_-fwrapv_-fPIC_-fPIE_-gdwarf-4_-Wall/timingleaks/crypto_kem/titaniumccasuper/opt/work/ntt.c:802:(.text+0x...): undefined reference to `montgomery'
try.c: /usr/bin/ld: libcrypto_kem_titaniumccasuper.a(ntt.o): in function `intt_core':
try.c: .../supercop-data/meteor,tiny/amd64/try/c/gcc_-march=native_-mtune=native_-Os_-fwrapv_-fPIC_-fPIE_-gdwarf-4_-Wall/timingleaks/crypto_kem/titaniumccasuper/opt/work/ntt.c:830:(.text+0x...): undefined reference to `montgomery'
try.c: /usr/bin/ld: .../supercop-data/meteor,tiny/amd64/try/c/gcc_-march=native_-mtune=native_-Os_-fwrapv_-fPIC_-fPIE_-gdwarf-4_-Wall/timingleaks/crypto_kem/titaniumccasuper/opt/work/ntt.c:842:(.text+0x...): undefined reference to `montgomery'
try.c: /usr/bin/ld: libcrypto_kem_titaniumccasuper.a(ntt.o): in function `ntt_butterfly_2048_3328':
try.c: .../supercop-data/meteor,tiny/amd64/try/c/gcc_-march=native_-mtune=native_-Os_-fwrapv_-fPIC_-fPIE_-gdwarf-4_-Wall/timingleaks/crypto_kem/titaniumccasuper/opt/work/ntt.c:860:(.text+0x...): undefined reference to `barrett_16q'
try.c: /usr/bin/ld: libcrypto_kem_titaniumccasuper.a(ntt.o): in function `ntt_butterfly_3328_1280':
try.c: .../supercop-data/meteor,tiny/amd64/try/c/gcc_-march=native_-mtune=native_-Os_-fwrapv_-fPIC_-fPIE_-gdwarf-4_-Wall/timingleaks/crypto_kem/titaniumccasuper/opt/work/ntt.c:894:(.text+0x...): undefined reference to `barrett_32q'
try.c: /usr/bin/ld: libcrypto_kem_titaniumccasuper.a(ntt.o): in function `ntt_butterfly_2048_3072':
try.c: .../supercop-data/meteor,tiny/amd64/try/c/gcc_-march=native_-mtune=native_-Os_-fwrapv_-fPIC_-fPIE_-gdwarf-4_-Wall/timingleaks/crypto_kem/titaniumccasuper/opt/work/ntt.c:916:(.text+0x...): undefined reference to `barrett_4q'
try.c: /usr/bin/ld: libcrypto_kem_titaniumccasuper.a(ntt.o): in function `ntt_butterfly_3072_3072_inv':
try.c: ...
Number of similar (implementation,compiler) pairs: 1, namely:
| Implementation | Compiler |
| T:opt | gcc -march=native -mtune=native -Os -fwrapv -fPIC -fPIE -gdwarf-4 -Wall (14.2.0) |
Namespace violations
encrypt.o crypto_encrypt T
encrypt.o crypto_encrypt_keypair T
encrypt.o crypto_encrypt_open T
fastrandombytes.o fastrandombytes T
fastrandombytes.o fastrandombytes_setseed T
fastrandombytes.o iv B
fastrandombytes.o key B
ntt.o intt_1280_256 T
ntt.o intt_3072_3072_inv T
ntt.o intt_3328_1280 T
ntt.o intt_3328_256 T
ntt.o ntt_1024_1280 T
ntt.o ntt_1024_3072 T
ntt.o ntt_1280_1280_inv T
ntt.o ntt_2048_3072 T
ntt.o ntt_2048_3328 T
ntt.o ntt_3072_3328 T
pack.o poly_decode T
pack.o poly_decode_c2 T
pack.o poly_encode T
pack.o poly_encode_c2 T
sampler.o sampler_binomial T
sampler.o sampler_zb T
sampler.o sampler_zq T
Number of similar (implementation,compiler) pairs: 15, namely:
| Implementation | Compiler |
| T:avx2 | clang -march=native -O2 -fwrapv -Qunused-arguments -fPIC -fPIE -gdwarf-4 -Wall (Debian_Clang_19.1.7_(3+b1)) |
| T:avx2 | clang -march=native -O3 -fwrapv -Qunused-arguments -fPIC -fPIE -gdwarf-4 -Wall (Debian_Clang_19.1.7_(3+b1)) |
| T:avx2 | clang -march=native -O -fwrapv -Qunused-arguments -fPIC -fPIE -gdwarf-4 -Wall (Debian_Clang_19.1.7_(3+b1)) |
| T:avx2 | clang -march=native -Os -fwrapv -Qunused-arguments -fPIC -fPIE -gdwarf-4 -Wall (Debian_Clang_19.1.7_(3+b1)) |
| T:avx2 | gcc -march=native -mtune=native -O2 -fwrapv -fPIC -fPIE -gdwarf-4 -Wall (14.2.0) |
| T:avx2 | gcc -march=native -mtune=native -O3 -fwrapv -fPIC -fPIE -gdwarf-4 -Wall (14.2.0) |
| T:avx2 | gcc -march=native -mtune=native -O -fwrapv -fPIC -fPIE -gdwarf-4 -Wall (14.2.0) |
| T:opt | clang -march=native -O2 -fwrapv -Qunused-arguments -fPIC -fPIE -gdwarf-4 -Wall (Debian_Clang_19.1.7_(3+b1)) |
| T:opt | clang -march=native -O3 -fwrapv -Qunused-arguments -fPIC -fPIE -gdwarf-4 -Wall (Debian_Clang_19.1.7_(3+b1)) |
| T:opt | clang -march=native -O -fwrapv -Qunused-arguments -fPIC -fPIE -gdwarf-4 -Wall (Debian_Clang_19.1.7_(3+b1)) |
| T:opt | clang -march=native -Os -fwrapv -Qunused-arguments -fPIC -fPIE -gdwarf-4 -Wall (Debian_Clang_19.1.7_(3+b1)) |
| T:opt | clang -mcpu=native -O3 -fwrapv -Qunused-arguments -fPIC -fPIE -gdwarf-4 -Wall (Debian_Clang_19.1.7_(3+b1)) |
| T:opt | gcc -march=native -mtune=native -O2 -fwrapv -fPIC -fPIE -gdwarf-4 -Wall (14.2.0) |
| T:opt | gcc -march=native -mtune=native -O3 -fwrapv -fPIC -fPIE -gdwarf-4 -Wall (14.2.0) |
| T:opt | gcc -march=native -mtune=native -O -fwrapv -fPIC -fPIE -gdwarf-4 -Wall (14.2.0) |
Namespace violations
encrypt.o crypto_encrypt T
encrypt.o crypto_encrypt_keypair T
encrypt.o crypto_encrypt_open T
fastrandombytes.o fastrandombytes T
fastrandombytes.o fastrandombytes_setseed T
fastrandombytes.o iv B
fastrandombytes.o key B
ntt.o intt_1280_1280 T
ntt.o intt_3072_3072_inv T
ntt.o intt_3328_3328 T
ntt.o ntt_1280_1280_inv T
ntt.o ntt_3072_3072 T
pack.o poly_decode T
pack.o poly_decode_c2 T
pack.o poly_encode T
pack.o poly_encode_c2 T
product.o mp T
product.o product T
sampler.o sampler_binomial T
sampler.o sampler_zb T
sampler.o sampler_zq T
Number of similar (implementation,compiler) pairs: 9, namely:
| Implementation | Compiler |
| T:ref | clang -march=native -O2 -fwrapv -Qunused-arguments -fPIC -fPIE -gdwarf-4 -Wall (Debian_Clang_19.1.7_(3+b1)) |
| T:ref | clang -march=native -O3 -fwrapv -Qunused-arguments -fPIC -fPIE -gdwarf-4 -Wall (Debian_Clang_19.1.7_(3+b1)) |
| T:ref | clang -march=native -O -fwrapv -Qunused-arguments -fPIC -fPIE -gdwarf-4 -Wall (Debian_Clang_19.1.7_(3+b1)) |
| T:ref | clang -march=native -Os -fwrapv -Qunused-arguments -fPIC -fPIE -gdwarf-4 -Wall (Debian_Clang_19.1.7_(3+b1)) |
| T:ref | clang -mcpu=native -O3 -fwrapv -Qunused-arguments -fPIC -fPIE -gdwarf-4 -Wall (Debian_Clang_19.1.7_(3+b1)) |
| T:ref | gcc -march=native -mtune=native -O2 -fwrapv -fPIC -fPIE -gdwarf-4 -Wall (14.2.0) |
| T:ref | gcc -march=native -mtune=native -O3 -fwrapv -fPIC -fPIE -gdwarf-4 -Wall (14.2.0) |
| T:ref | gcc -march=native -mtune=native -O -fwrapv -fPIC -fPIE -gdwarf-4 -Wall (14.2.0) |
| T:ref | gcc -march=native -mtune=native -Os -fwrapv -fPIC -fPIE -gdwarf-4 -Wall (14.2.0) |