Test results for amd64, meteor,tiny, crypto_hash/sha256

[Page version: 20261015 12:45:42]

Measurements for amd64, meteor,tiny, crypto_hash Test results for amd64, meteor,tiny, crypto_hash Test results for crypto_hash/sha256
Computer: meteor,tiny
Microarchitecture: amd64; Crestmont (a06a4-20)
Architecture: amd64
CPU ID: GenuineIntel-000a06a4-20-bfebfbff
SUPERCOP version: 20261004
Operation: crypto_hash
Primitive: sha256
TimeObject sizeTest sizeImplementationCompilerBenchmark dateSUPERCOP version
2456673 0 025471 1216 1592refgcc -march=native -mtune=native -O3 -fwrapv -fPIC -fPIE -gdwarf-4 -Wall2026071520260627
2459594 0 022392 1256 1496refclang -march=native -O -fwrapv -Qunused-arguments -fPIC -fPIE -gdwarf-4 -Wall2026071520260627
2462797 0 025384 1256 1496refclang -mcpu=native -O3 -fwrapv -Qunused-arguments -fPIC -fPIE -gdwarf-4 -Wall2026071520260627
2467610 0 023029 1248 1560refclang -march=native -Os -fwrapv -Qunused-arguments -fPIC -fPIE -gdwarf-4 -Wall2026071520260627
2468697 0 026651 1256 1560refclang -march=native -O2 -fwrapv -Qunused-arguments -fPIC -fPIE -gdwarf-4 -Wall2026071520260627
2468697 0 026571 1256 1560refclang -march=native -O3 -fwrapv -Qunused-arguments -fPIC -fPIE -gdwarf-4 -Wall2026071520260627
2468673 0 023031 1216 1592refgcc -march=native -mtune=native -O2 -fwrapv -fPIC -fPIE -gdwarf-4 -Wall2026071520260627
2563346 0 021066 1192 1560refgcc -march=native -mtune=native -Os -fwrapv -fPIC -fPIE -gdwarf-4 -Wall2026071520260627
2573620 0 022710 1208 1592refgcc -march=native -mtune=native -O -fwrapv -fPIC -fPIE -gdwarf-4 -Wall2026071520260627
26504703 704 01780295 147704 10968cryptoppg++ -march=native -mtune=native -O3 -fwrapv -fPIC -fPIE -gdwarf-4 -Wall2026071520260627
26514642 704 01778263 147704 10968cryptoppg++ -march=native -mtune=native -O2 -fwrapv -fPIC -fPIE -gdwarf-4 -Wall2026071520260627
26523659 704 01781343 147768 10904cryptoppclang++ -march=native -O2 -fwrapv -Qunused-arguments -fPIC -fPIE -gdwarf-4 -Wall2026071520260627
26535140 992 01778959 147768 10840cryptoppclang++ -march=native -O -fwrapv -Qunused-arguments -fPIC -fPIE -gdwarf-4 -Wall2026071520260627
26553606 704 01781827 147768 10904cryptoppclang++ -march=native -O3 -fwrapv -Qunused-arguments -fPIC -fPIE -gdwarf-4 -Wall2026071520260627
26554341 704 01777477 147704 10968cryptoppg++ -march=native -mtune=native -O -fwrapv -fPIC -fPIE -gdwarf-4 -Wall2026071520260627
26593765 704 01778800 147760 10904cryptoppclang++ -march=native -Os -fwrapv -Qunused-arguments -fPIC -fPIE -gdwarf-4 -Wall2026071520260627
26623882 768 01775435 147712 10936cryptoppg++ -march=native -mtune=native -Os -fwrapv -fPIC -fPIE -gdwarf-4 -Wall2026071520260627
341070 0 021311 1280 1496opensslclang -march=native -O -fwrapv -Qunused-arguments -fPIC -fPIE -gdwarf-4 -Wall2026100620261004
341076 0 021885 1256 1592opensslgcc -march=native -mtune=native -O2 -fwrapv -fPIC -fPIE -gdwarf-4 -Wall2026100620261004
341570 0 025339 1280 1560opensslclang -march=native -O3 -fwrapv -Qunused-arguments -fPIC -fPIE -gdwarf-4 -Wall2026100620261004
343079 0 021596 1248 1592opensslgcc -march=native -mtune=native -O -fwrapv -fPIC -fPIE -gdwarf-4 -Wall2026100620261004
343370 0 025419 1280 1560opensslclang -march=native -O2 -fwrapv -Qunused-arguments -fPIC -fPIE -gdwarf-4 -Wall2026100620261004
343770 0 024047 1280 1496opensslclang -mcpu=native -O3 -fwrapv -Qunused-arguments -fPIC -fPIE -gdwarf-4 -Wall2026100620261004
343776 0 024325 1256 1592opensslgcc -march=native -mtune=native -O3 -fwrapv -fPIC -fPIE -gdwarf-4 -Wall2026100620261004
344070 0 020192 1232 1560opensslgcc -march=native -mtune=native -Os -fwrapv -fPIC -fPIE -gdwarf-4 -Wall2026100620261004
345870 0 021893 1272 1560opensslclang -march=native -Os -fwrapv -Qunused-arguments -fPIC -fPIE -gdwarf-4 -Wall2026100620261004
1512111524 0 032430 1208 1592sphlib-smallgcc -march=native -mtune=native -O -fwrapv -fPIC -fPIE -gdwarf-4 -Wall2026071520260627
1531822378 0 043310 1208 1592sphlibgcc -march=native -mtune=native -O -fwrapv -fPIC -fPIE -gdwarf-4 -Wall2026071520260627
1551721956 0 042624 1256 1496sphlibclang -march=native -O -fwrapv -Qunused-arguments -fPIC -fPIE -gdwarf-4 -Wall2026071520260627
1570222116 0 046883 1256 1560sphlibclang -march=native -O2 -fwrapv -Qunused-arguments -fPIC -fPIE -gdwarf-4 -Wall2026071520260627
1570522116 0 046835 1256 1560sphlibclang -march=native -O3 -fwrapv -Qunused-arguments -fPIC -fPIE -gdwarf-4 -Wall2026071520260627
1571721501 0 042781 1248 1560sphlibclang -march=native -Os -fwrapv -Qunused-arguments -fPIC -fPIE -gdwarf-4 -Wall2026071520260627
1590912026 0 033255 1216 1592sphlib-smallgcc -march=native -mtune=native -O2 -fwrapv -fPIC -fPIE -gdwarf-4 -Wall2026071520260627
1591513090 0 036759 1216 1592sphlib-smallgcc -march=native -mtune=native -O3 -fwrapv -fPIC -fPIE -gdwarf-4 -Wall2026071520260627
1604724298 0 047959 1216 1592sphlibgcc -march=native -mtune=native -O3 -fwrapv -fPIC -fPIE -gdwarf-4 -Wall2026071520260627
1608123234 0 044455 1216 1592sphlibgcc -march=native -mtune=native -O2 -fwrapv -fPIC -fPIE -gdwarf-4 -Wall2026071520260627
1613712319 0 032992 1256 1496sphlib-smallclang -march=native -O -fwrapv -Qunused-arguments -fPIC -fPIE -gdwarf-4 -Wall2026071520260627
1635212316 0 037091 1256 1560sphlib-smallclang -march=native -O2 -fwrapv -Qunused-arguments -fPIC -fPIE -gdwarf-4 -Wall2026071520260627
1636711679 0 032957 1248 1560sphlib-smallclang -march=native -Os -fwrapv -Qunused-arguments -fPIC -fPIE -gdwarf-4 -Wall2026071520260627
1638812316 0 037043 1256 1560sphlib-smallclang -march=native -O3 -fwrapv -Qunused-arguments -fPIC -fPIE -gdwarf-4 -Wall2026071520260627
1960021738 0 045168 1256 1496sphlibclang -mcpu=native -O3 -fwrapv -Qunused-arguments -fPIC -fPIE -gdwarf-4 -Wall2026071520260627
1961210775 0 030341 1192 1560sphlib-smallgcc -march=native -mtune=native -Os -fwrapv -fPIC -fPIE -gdwarf-4 -Wall2026071520260627
1984822233 0 041797 1192 1560sphlibgcc -march=native -mtune=native -Os -fwrapv -fPIC -fPIE -gdwarf-4 -Wall2026071520260627
2040712590 0 036016 1256 1496sphlib-smallclang -mcpu=native -O3 -fwrapv -Qunused-arguments -fPIC -fPIE -gdwarf-4 -Wall2026071520260627

Compiler output


try.c: error[E0310]: the parameter type `T` may not live long enough
try.c:     --> /home/supercop/.cargo/registry/src/index.crates.io-1949cf8c6b5b557f/rustc-serialize-0.3.24/src/serialize.rs:1155:5
try.c:      |
try.c: 1155 |     fn decode<D: Decoder>(d: &mut D) -> Result<Cow<'static, T>, D::Error> {
try.c:      |     ^^^^^^^^^^^^^^^^^^^^^^^^^^^^^^^^^^^^^^^^^^^^^^^^^^^^^^^^^^^^^^^^^^^^^
try.c:      |     |
try.c:      |     the parameter type `T` must be valid for the static lifetime...
try.c:      |     ...so that the type `T` will meet its required lifetime bounds...
try.c:      |
try.c: note: ...that is required by this bound
try.c:     --> /usr/src/rustc-1.85.0/library/alloc/src/borrow.rs:179:30
try.c: help: consider adding an explicit lifetime bound
try.c:      |
try.c: 1151 | impl<'a, T: ?Sized + 'static> Decodable for Cow<'a, T>
try.c:      |                    +++++++++
try.c:
try.c: For more information about this error, try `rustc --explain E0310`.
try.c: error: could not compile `rustc-serialize` (lib) due to 1 previous error

Number of similar (implementation,compiler) pairs: 9, namely:
ImplementationCompiler
rust_cryptoclang -march=native -O2 -fwrapv -Qunused-arguments -fPIC -fPIE -gdwarf-4 -Wall (Debian_Clang_19.1.7_(3+b1))
rust_cryptoclang -march=native -O3 -fwrapv -Qunused-arguments -fPIC -fPIE -gdwarf-4 -Wall (Debian_Clang_19.1.7_(3+b1))
rust_cryptoclang -march=native -O -fwrapv -Qunused-arguments -fPIC -fPIE -gdwarf-4 -Wall (Debian_Clang_19.1.7_(3+b1))
rust_cryptoclang -march=native -Os -fwrapv -Qunused-arguments -fPIC -fPIE -gdwarf-4 -Wall (Debian_Clang_19.1.7_(3+b1))
rust_cryptoclang -mcpu=native -O3 -fwrapv -Qunused-arguments -fPIC -fPIE -gdwarf-4 -Wall (Debian_Clang_19.1.7_(3+b1))
rust_cryptogcc -march=native -mtune=native -O2 -fwrapv -fPIC -fPIE -gdwarf-4 -Wall (14.2.0)
rust_cryptogcc -march=native -mtune=native -O3 -fwrapv -fPIC -fPIE -gdwarf-4 -Wall (14.2.0)
rust_cryptogcc -march=native -mtune=native -O -fwrapv -fPIC -fPIE -gdwarf-4 -Wall (14.2.0)
rust_cryptogcc -march=native -mtune=native -Os -fwrapv -fPIC -fPIE -gdwarf-4 -Wall (14.2.0)

Compiler output


try.c: error: linking with `cc` failed: exit status: 1
try.c:   |
try.c:   = note: LC_ALL="C" PATH="/usr/lib/rustlib/x86_64-unknown-linux-gnu/bin:/usr/lib/lib/rustlib/x86_64-unknown-linux-gnu/bin:.../supercop-data/meteor,tiny/checksum/bin:.../supercop-data/meteor,tiny/sinceepoch/bin:.../supercop-data/meteor,tiny/compiledinfo/bin:.../supercop-data/meteor,tiny/killafter/bin:.../supercop-data/meteor,tiny/okcompilers/bin:.../supercop-data/meteor,tiny/scripts:/usr/sfw/bin:/usr/local/bin:/usr/local/bin:/usr/bin:/bin:/usr/games" VSLANG="1033" "cc" "-m64" "/tmp/rustcU99GrG/symbols.o" "<2 object files omitted>" "-Wl,--as-needed" "-Wl,-Bdynamic" "-ltry-anything" "-ltry-small" "-lsupercop" "-lkernelrandombytes" "-lcpucycles" "-lcrypto" "-lm" "-Wl,-Bstatic" ".../supercop-data/meteor,tiny/amd64/try/c/clang_-march=native_-O2_-fwrapv_-Qunused-arguments_-fPIC_-fPIE_-gdwarf-4_-Wall/constbranchindex/crypto_hash/sha256/rust_sha2/work/target/release/deps/{libcrypto_hash_sha256-e93f0d72cb4e1b27.rlib,libsha2-d9fe3e64ab7a35b5.rlib,libcpuid_bool-a4038e1fb04f065f.rlib,libcfg_if-52860a7ddc158427.rlib,libopaque_debug-851f5dc4fc7cb701.rlib,libdigest-1689fddb67a4db6c.rlib,libblock_buffer-15129c7af7775380.rlib,libgeneric_array-abd9aca6363faef4.rlib,libtypenum-9bd82fdfda23287d.rlib}" "/usr/lib/rustlib/x86_64-unknown-linux-gnu/lib/{libstd-735cce14533b4b14.rlib,libpanic_unwind-b6737e136067c5af.rlib,libobject-1303c4fadc744db1.rlib,libmemchr-4307c8d3168c78e3.rlib,libaddr2line-78c32e4a87333dbd.rlib,libgimli-0fc0e49acceead35.rlib,librustc_demangle-a0b9c22792c85e39.rlib,libstd_detect-83f7e4a793b39811.rlib,libhashbrown-0d7f81c4b968ca96.rlib,librustc_std_workspace_alloc-6a65191895fd580e.rlib,libminiz_oxide-357876da66360401.rlib,libadler-0c1d85aa00dff5fa.rlib,libunwind-d8e6262062f0cd85.rlib,libcfg_if-2424c0e00d5dc157.rlib,liblibc-d9b6e8d963ea0be1.rlib,liballoc-ecc6700de60a5b56.rlib,librustc_std_workspace_core-6129c8f9aed81c8b.rlib,libcore-2d4b9a0883bc3ecf.rlib,libcompiler_builtins-bdfb7378ad19badb.rlib}" "-Wl,-Bdynamic" "-lgcc_s" "-lutil" "-lrt" "-lpthread" "-lm" "-ldl" "-lc" "-Wl,--eh-frame-hdr" "-Wl,-z,noexecstack" "-L" ".../supercop-data/meteor,tiny/amd64/lib" "-L" ".../supercop-data/meteor,tiny/amd64/try/c/clang_-march=native_-O2_-fwrapv_-Qunused-arguments_-fPIC_-fPIE_-gdwarf-4_-Wall/constbranchindex/crypto_hash/sha256/rust_sha2/work/target/release/build/crypto_hash_sha256-2696b4c59c0131cc/out" "-L" "/usr/lib/rustlib/x86_64-unknown-linux-gnu/lib" "-o" ".../supercop-data/meteor,tiny/amd64/try/c/clang_-march=native_-O2_-fwrapv_-Qunused-arguments_-fPIC_-fPIE_-gdwarf-4_-Wall/constbranchindex/crypto_hash/sha256/rust_sha2/work/target/release/deps/try_small-95c091be2eca5fb7" "-Wl,--gc-sections" "-pie" "-Wl,-z,relro,-z,now" "-Wl,-O1" "-Wl,--strip-debug" "-nodefaultlibs"
try.c:   = note: some arguments are omitted. use `--verbose` to show all linker arguments
try.c:   = note: /usr/bin/ld: cannot find -lcpucycles: No such file or directory
try.c:           collect2: error: ld returned 1 exit status
try.c:
try.c:
try.c: error: could not compile `crypto_hash_sha256` (bin "try-small") due to 1 previous error

Number of similar (implementation,compiler) pairs: 1, namely:
ImplementationCompiler
rust_sha2clang -march=native -O2 -fwrapv -Qunused-arguments -fPIC -fPIE -gdwarf-4 -Wall (Debian_Clang_19.1.7_(3+b1))

Compiler output


try.c: error: linking with `cc` failed: exit status: 1
try.c:   |
try.c:   = note: LC_ALL="C" PATH="/usr/lib/rustlib/x86_64-unknown-linux-gnu/bin:/usr/lib/lib/rustlib/x86_64-unknown-linux-gnu/bin:.../supercop-data/meteor,tiny/checksum/bin:.../supercop-data/meteor,tiny/sinceepoch/bin:.../supercop-data/meteor,tiny/compiledinfo/bin:.../supercop-data/meteor,tiny/killafter/bin:.../supercop-data/meteor,tiny/okcompilers/bin:.../supercop-data/meteor,tiny/scripts:/usr/sfw/bin:/usr/local/bin:/usr/local/bin:/usr/bin:/bin:/usr/games" VSLANG="1033" "cc" "-m64" "/tmp/rustcHEeAXd/symbols.o" "<2 object files omitted>" "-Wl,--as-needed" "-Wl,-Bdynamic" "-ltry-anything" "-ltry" "-lsupercop" "-lkernelrandombytes" "-lcpucycles" "-lcrypto" "-lm" "-Wl,-Bstatic" ".../supercop-data/meteor,tiny/amd64/try/c/clang_-march=native_-O3_-fwrapv_-Qunused-arguments_-fPIC_-fPIE_-gdwarf-4_-Wall/constbranchindex/crypto_hash/sha256/rust_sha2/work/target/release/deps/{libcrypto_hash_sha256-e93f0d72cb4e1b27.rlib,libsha2-d9fe3e64ab7a35b5.rlib,libcpuid_bool-a4038e1fb04f065f.rlib,libcfg_if-52860a7ddc158427.rlib,libopaque_debug-851f5dc4fc7cb701.rlib,libdigest-1689fddb67a4db6c.rlib,libblock_buffer-15129c7af7775380.rlib,libgeneric_array-abd9aca6363faef4.rlib,libtypenum-9bd82fdfda23287d.rlib}" "/usr/lib/rustlib/x86_64-unknown-linux-gnu/lib/{libstd-735cce14533b4b14.rlib,libpanic_unwind-b6737e136067c5af.rlib,libobject-1303c4fadc744db1.rlib,libmemchr-4307c8d3168c78e3.rlib,libaddr2line-78c32e4a87333dbd.rlib,libgimli-0fc0e49acceead35.rlib,librustc_demangle-a0b9c22792c85e39.rlib,libstd_detect-83f7e4a793b39811.rlib,libhashbrown-0d7f81c4b968ca96.rlib,librustc_std_workspace_alloc-6a65191895fd580e.rlib,libminiz_oxide-357876da66360401.rlib,libadler-0c1d85aa00dff5fa.rlib,libunwind-d8e6262062f0cd85.rlib,libcfg_if-2424c0e00d5dc157.rlib,liblibc-d9b6e8d963ea0be1.rlib,liballoc-ecc6700de60a5b56.rlib,librustc_std_workspace_core-6129c8f9aed81c8b.rlib,libcore-2d4b9a0883bc3ecf.rlib,libcompiler_builtins-bdfb7378ad19badb.rlib}" "-Wl,-Bdynamic" "-lgcc_s" "-lutil" "-lrt" "-lpthread" "-lm" "-ldl" "-lc" "-Wl,--eh-frame-hdr" "-Wl,-z,noexecstack" "-L" ".../supercop-data/meteor,tiny/amd64/lib" "-L" ".../supercop-data/meteor,tiny/amd64/try/c/clang_-march=native_-O3_-fwrapv_-Qunused-arguments_-fPIC_-fPIE_-gdwarf-4_-Wall/constbranchindex/crypto_hash/sha256/rust_sha2/work/target/release/build/crypto_hash_sha256-2696b4c59c0131cc/out" "-L" "/usr/lib/rustlib/x86_64-unknown-linux-gnu/lib" "-o" ".../supercop-data/meteor,tiny/amd64/try/c/clang_-march=native_-O3_-fwrapv_-Qunused-arguments_-fPIC_-fPIE_-gdwarf-4_-Wall/constbranchindex/crypto_hash/sha256/rust_sha2/work/target/release/deps/try-4cacd13518911c7b" "-Wl,--gc-sections" "-pie" "-Wl,-z,relro,-z,now" "-Wl,-O1" "-Wl,--strip-debug" "-nodefaultlibs"
try.c:   = note: some arguments are omitted. use `--verbose` to show all linker arguments
try.c:   = note: /usr/bin/ld: cannot find -lcpucycles: No such file or directory
try.c:           collect2: error: ld returned 1 exit status
try.c:
try.c:
try.c: error: could not compile `crypto_hash_sha256` (bin "try") due to 1 previous error

Number of similar (implementation,compiler) pairs: 1, namely:
ImplementationCompiler
rust_sha2clang -march=native -O3 -fwrapv -Qunused-arguments -fPIC -fPIE -gdwarf-4 -Wall (Debian_Clang_19.1.7_(3+b1))

Compiler output


try.c: error: linking with `cc` failed: exit status: 1
try.c:   |
try.c:   = note: LC_ALL="C" PATH="/usr/lib/rustlib/x86_64-unknown-linux-gnu/bin:/usr/lib/lib/rustlib/x86_64-unknown-linux-gnu/bin:.../supercop-data/meteor,tiny/checksum/bin:.../supercop-data/meteor,tiny/sinceepoch/bin:.../supercop-data/meteor,tiny/compiledinfo/bin:.../supercop-data/meteor,tiny/killafter/bin:.../supercop-data/meteor,tiny/okcompilers/bin:.../supercop-data/meteor,tiny/scripts:/usr/sfw/bin:/usr/local/bin:/usr/local/bin:/usr/bin:/bin:/usr/games" VSLANG="1033" "cc" "-m64" "/tmp/rustc5qLsi1/symbols.o" "<2 object files omitted>" "-Wl,--as-needed" "-Wl,-Bdynamic" "-lmeasure-anything" "-lmeasure" "-lsupercop" "-lkernelrandombytes" "-lcpucycles" "-lcrypto" "-lm" "-Wl,-Bstatic" ".../supercop-data/meteor,tiny/amd64/try/c/clang_-march=native_-O_-fwrapv_-Qunused-arguments_-fPIC_-fPIE_-gdwarf-4_-Wall/constbranchindex/crypto_hash/sha256/rust_sha2/work/target/release/deps/{libcrypto_hash_sha256-e93f0d72cb4e1b27.rlib,libsha2-d9fe3e64ab7a35b5.rlib,libcpuid_bool-a4038e1fb04f065f.rlib,libcfg_if-52860a7ddc158427.rlib,libopaque_debug-851f5dc4fc7cb701.rlib,libdigest-1689fddb67a4db6c.rlib,libblock_buffer-15129c7af7775380.rlib,libgeneric_array-abd9aca6363faef4.rlib,libtypenum-9bd82fdfda23287d.rlib}" "/usr/lib/rustlib/x86_64-unknown-linux-gnu/lib/{libstd-735cce14533b4b14.rlib,libpanic_unwind-b6737e136067c5af.rlib,libobject-1303c4fadc744db1.rlib,libmemchr-4307c8d3168c78e3.rlib,libaddr2line-78c32e4a87333dbd.rlib,libgimli-0fc0e49acceead35.rlib,librustc_demangle-a0b9c22792c85e39.rlib,libstd_detect-83f7e4a793b39811.rlib,libhashbrown-0d7f81c4b968ca96.rlib,librustc_std_workspace_alloc-6a65191895fd580e.rlib,libminiz_oxide-357876da66360401.rlib,libadler-0c1d85aa00dff5fa.rlib,libunwind-d8e6262062f0cd85.rlib,libcfg_if-2424c0e00d5dc157.rlib,liblibc-d9b6e8d963ea0be1.rlib,liballoc-ecc6700de60a5b56.rlib,librustc_std_workspace_core-6129c8f9aed81c8b.rlib,libcore-2d4b9a0883bc3ecf.rlib,libcompiler_builtins-bdfb7378ad19badb.rlib}" "-Wl,-Bdynamic" "-lgcc_s" "-lutil" "-lrt" "-lpthread" "-lm" "-ldl" "-lc" "-Wl,--eh-frame-hdr" "-Wl,-z,noexecstack" "-L" ".../supercop-data/meteor,tiny/amd64/lib" "-L" ".../supercop-data/meteor,tiny/amd64/try/c/clang_-march=native_-O_-fwrapv_-Qunused-arguments_-fPIC_-fPIE_-gdwarf-4_-Wall/constbranchindex/crypto_hash/sha256/rust_sha2/work/target/release/build/crypto_hash_sha256-2696b4c59c0131cc/out" "-L" "/usr/lib/rustlib/x86_64-unknown-linux-gnu/lib" "-o" ".../supercop-data/meteor,tiny/amd64/try/c/clang_-march=native_-O_-fwrapv_-Qunused-arguments_-fPIC_-fPIE_-gdwarf-4_-Wall/constbranchindex/crypto_hash/sha256/rust_sha2/work/target/release/deps/measure-450ae3ba5b2a718d" "-Wl,--gc-sections" "-pie" "-Wl,-z,relro,-z,now" "-Wl,-O1" "-Wl,--strip-debug" "-nodefaultlibs"
try.c:   = note: some arguments are omitted. use `--verbose` to show all linker arguments
try.c:   = note: /usr/bin/ld: cannot find -lcpucycles: No such file or directory
try.c:           collect2: error: ld returned 1 exit status
try.c:
try.c:
try.c: error: could not compile `crypto_hash_sha256` (bin "measure") due to 1 previous error

Number of similar (implementation,compiler) pairs: 1, namely:
ImplementationCompiler
rust_sha2clang -march=native -O -fwrapv -Qunused-arguments -fPIC -fPIE -gdwarf-4 -Wall (Debian_Clang_19.1.7_(3+b1))

Compiler output


try.c: error: linking with `cc` failed: exit status: 1
try.c:   |
try.c:   = note: LC_ALL="C" PATH="/usr/lib/rustlib/x86_64-unknown-linux-gnu/bin:/usr/lib/lib/rustlib/x86_64-unknown-linux-gnu/bin:.../supercop-data/meteor,tiny/checksum/bin:.../supercop-data/meteor,tiny/sinceepoch/bin:.../supercop-data/meteor,tiny/compiledinfo/bin:.../supercop-data/meteor,tiny/killafter/bin:.../supercop-data/meteor,tiny/okcompilers/bin:.../supercop-data/meteor,tiny/scripts:/usr/sfw/bin:/usr/local/bin:/usr/local/bin:/usr/bin:/bin:/usr/games" VSLANG="1033" "cc" "-m64" "/tmp/rustc96wqzF/symbols.o" "<2 object files omitted>" "-Wl,--as-needed" "-Wl,-Bdynamic" "-ltry-anything" "-ltry-small" "-lsupercop" "-lkernelrandombytes" "-lcpucycles" "-lcrypto" "-lm" "-Wl,-Bstatic" ".../supercop-data/meteor,tiny/amd64/try/c/clang_-march=native_-Os_-fwrapv_-Qunused-arguments_-fPIC_-fPIE_-gdwarf-4_-Wall/constbranchindex/crypto_hash/sha256/rust_sha2/work/target/release/deps/{libcrypto_hash_sha256-e93f0d72cb4e1b27.rlib,libsha2-d9fe3e64ab7a35b5.rlib,libcpuid_bool-a4038e1fb04f065f.rlib,libcfg_if-52860a7ddc158427.rlib,libopaque_debug-851f5dc4fc7cb701.rlib,libdigest-1689fddb67a4db6c.rlib,libblock_buffer-15129c7af7775380.rlib,libgeneric_array-abd9aca6363faef4.rlib,libtypenum-9bd82fdfda23287d.rlib}" "/usr/lib/rustlib/x86_64-unknown-linux-gnu/lib/{libstd-735cce14533b4b14.rlib,libpanic_unwind-b6737e136067c5af.rlib,libobject-1303c4fadc744db1.rlib,libmemchr-4307c8d3168c78e3.rlib,libaddr2line-78c32e4a87333dbd.rlib,libgimli-0fc0e49acceead35.rlib,librustc_demangle-a0b9c22792c85e39.rlib,libstd_detect-83f7e4a793b39811.rlib,libhashbrown-0d7f81c4b968ca96.rlib,librustc_std_workspace_alloc-6a65191895fd580e.rlib,libminiz_oxide-357876da66360401.rlib,libadler-0c1d85aa00dff5fa.rlib,libunwind-d8e6262062f0cd85.rlib,libcfg_if-2424c0e00d5dc157.rlib,liblibc-d9b6e8d963ea0be1.rlib,liballoc-ecc6700de60a5b56.rlib,librustc_std_workspace_core-6129c8f9aed81c8b.rlib,libcore-2d4b9a0883bc3ecf.rlib,libcompiler_builtins-bdfb7378ad19badb.rlib}" "-Wl,-Bdynamic" "-lgcc_s" "-lutil" "-lrt" "-lpthread" "-lm" "-ldl" "-lc" "-Wl,--eh-frame-hdr" "-Wl,-z,noexecstack" "-L" ".../supercop-data/meteor,tiny/amd64/lib" "-L" ".../supercop-data/meteor,tiny/amd64/try/c/clang_-march=native_-Os_-fwrapv_-Qunused-arguments_-fPIC_-fPIE_-gdwarf-4_-Wall/constbranchindex/crypto_hash/sha256/rust_sha2/work/target/release/build/crypto_hash_sha256-2696b4c59c0131cc/out" "-L" "/usr/lib/rustlib/x86_64-unknown-linux-gnu/lib" "-o" ".../supercop-data/meteor,tiny/amd64/try/c/clang_-march=native_-Os_-fwrapv_-Qunused-arguments_-fPIC_-fPIE_-gdwarf-4_-Wall/constbranchindex/crypto_hash/sha256/rust_sha2/work/target/release/deps/try_small-95c091be2eca5fb7" "-Wl,--gc-sections" "-pie" "-Wl,-z,relro,-z,now" "-Wl,-O1" "-Wl,--strip-debug" "-nodefaultlibs"
try.c:   = note: some arguments are omitted. use `--verbose` to show all linker arguments
try.c:   = note: /usr/bin/ld: cannot find -lcpucycles: No such file or directory
try.c:           collect2: error: ld returned 1 exit status
try.c:
try.c:
try.c: error: could not compile `crypto_hash_sha256` (bin "try-small") due to 1 previous error

Number of similar (implementation,compiler) pairs: 1, namely:
ImplementationCompiler
rust_sha2clang -march=native -Os -fwrapv -Qunused-arguments -fPIC -fPIE -gdwarf-4 -Wall (Debian_Clang_19.1.7_(3+b1))

Compiler output


try.c: error: linking with `cc` failed: exit status: 1
try.c:   |
try.c:   = note: LC_ALL="C" PATH="/usr/lib/rustlib/x86_64-unknown-linux-gnu/bin:/usr/lib/lib/rustlib/x86_64-unknown-linux-gnu/bin:.../supercop-data/meteor,tiny/checksum/bin:.../supercop-data/meteor,tiny/sinceepoch/bin:.../supercop-data/meteor,tiny/compiledinfo/bin:.../supercop-data/meteor,tiny/killafter/bin:.../supercop-data/meteor,tiny/okcompilers/bin:.../supercop-data/meteor,tiny/scripts:/usr/sfw/bin:/usr/local/bin:/usr/local/bin:/usr/bin:/bin:/usr/games" VSLANG="1033" "cc" "-m64" "/tmp/rustc0SjUth/symbols.o" "<2 object files omitted>" "-Wl,--as-needed" "-Wl,-Bdynamic" "-ltry-anything" "-ltry" "-lsupercop" "-lkernelrandombytes" "-lcpucycles" "-lcrypto" "-lm" "-Wl,-Bstatic" ".../supercop-data/meteor,tiny/amd64/try/c/clang_-mcpu=native_-O3_-fwrapv_-Qunused-arguments_-fPIC_-fPIE_-gdwarf-4_-Wall/constbranchindex/crypto_hash/sha256/rust_sha2/work/target/release/deps/{libcrypto_hash_sha256-e93f0d72cb4e1b27.rlib,libsha2-d9fe3e64ab7a35b5.rlib,libcpuid_bool-a4038e1fb04f065f.rlib,libcfg_if-52860a7ddc158427.rlib,libopaque_debug-851f5dc4fc7cb701.rlib,libdigest-1689fddb67a4db6c.rlib,libblock_buffer-15129c7af7775380.rlib,libgeneric_array-abd9aca6363faef4.rlib,libtypenum-9bd82fdfda23287d.rlib}" "/usr/lib/rustlib/x86_64-unknown-linux-gnu/lib/{libstd-735cce14533b4b14.rlib,libpanic_unwind-b6737e136067c5af.rlib,libobject-1303c4fadc744db1.rlib,libmemchr-4307c8d3168c78e3.rlib,libaddr2line-78c32e4a87333dbd.rlib,libgimli-0fc0e49acceead35.rlib,librustc_demangle-a0b9c22792c85e39.rlib,libstd_detect-83f7e4a793b39811.rlib,libhashbrown-0d7f81c4b968ca96.rlib,librustc_std_workspace_alloc-6a65191895fd580e.rlib,libminiz_oxide-357876da66360401.rlib,libadler-0c1d85aa00dff5fa.rlib,libunwind-d8e6262062f0cd85.rlib,libcfg_if-2424c0e00d5dc157.rlib,liblibc-d9b6e8d963ea0be1.rlib,liballoc-ecc6700de60a5b56.rlib,librustc_std_workspace_core-6129c8f9aed81c8b.rlib,libcore-2d4b9a0883bc3ecf.rlib,libcompiler_builtins-bdfb7378ad19badb.rlib}" "-Wl,-Bdynamic" "-lgcc_s" "-lutil" "-lrt" "-lpthread" "-lm" "-ldl" "-lc" "-Wl,--eh-frame-hdr" "-Wl,-z,noexecstack" "-L" ".../supercop-data/meteor,tiny/amd64/lib" "-L" ".../supercop-data/meteor,tiny/amd64/try/c/clang_-mcpu=native_-O3_-fwrapv_-Qunused-arguments_-fPIC_-fPIE_-gdwarf-4_-Wall/constbranchindex/crypto_hash/sha256/rust_sha2/work/target/release/build/crypto_hash_sha256-2696b4c59c0131cc/out" "-L" "/usr/lib/rustlib/x86_64-unknown-linux-gnu/lib" "-o" ".../supercop-data/meteor,tiny/amd64/try/c/clang_-mcpu=native_-O3_-fwrapv_-Qunused-arguments_-fPIC_-fPIE_-gdwarf-4_-Wall/constbranchindex/crypto_hash/sha256/rust_sha2/work/target/release/deps/try-4cacd13518911c7b" "-Wl,--gc-sections" "-pie" "-Wl,-z,relro,-z,now" "-Wl,-O1" "-Wl,--strip-debug" "-nodefaultlibs"
try.c:   = note: some arguments are omitted. use `--verbose` to show all linker arguments
try.c:   = note: /usr/bin/ld: cannot find -lcpucycles: No such file or directory
try.c:           collect2: error: ld returned 1 exit status
try.c:
try.c:
try.c: error: could not compile `crypto_hash_sha256` (bin "try") due to 1 previous error

Number of similar (implementation,compiler) pairs: 1, namely:
ImplementationCompiler
rust_sha2clang -mcpu=native -O3 -fwrapv -Qunused-arguments -fPIC -fPIE -gdwarf-4 -Wall (Debian_Clang_19.1.7_(3+b1))

Compiler output


try.c: error: linking with `cc` failed: exit status: 1
try.c:   |
try.c:   = note: LC_ALL="C" PATH="/usr/lib/rustlib/x86_64-unknown-linux-gnu/bin:/usr/lib/lib/rustlib/x86_64-unknown-linux-gnu/bin:.../supercop-data/meteor,tiny/checksum/bin:.../supercop-data/meteor,tiny/sinceepoch/bin:.../supercop-data/meteor,tiny/compiledinfo/bin:.../supercop-data/meteor,tiny/killafter/bin:.../supercop-data/meteor,tiny/okcompilers/bin:.../supercop-data/meteor,tiny/scripts:/usr/sfw/bin:/usr/local/bin:/usr/local/bin:/usr/bin:/bin:/usr/games" VSLANG="1033" "cc" "-m64" "/tmp/rustcRkD7MY/symbols.o" "<2 object files omitted>" "-Wl,--as-needed" "-Wl,-Bdynamic" "-lmeasure-anything" "-lmeasure" "-lsupercop" "-lkernelrandombytes" "-lcpucycles" "-lcrypto" "-lm" "-Wl,-Bstatic" ".../supercop-data/meteor,tiny/amd64/try/c/gcc_-march=native_-mtune=native_-O2_-fwrapv_-fPIC_-fPIE_-gdwarf-4_-Wall/constbranchindex/crypto_hash/sha256/rust_sha2/work/target/release/deps/{libcrypto_hash_sha256-e93f0d72cb4e1b27.rlib,libsha2-d9fe3e64ab7a35b5.rlib,libcpuid_bool-a4038e1fb04f065f.rlib,libcfg_if-52860a7ddc158427.rlib,libopaque_debug-851f5dc4fc7cb701.rlib,libdigest-1689fddb67a4db6c.rlib,libblock_buffer-15129c7af7775380.rlib,libgeneric_array-abd9aca6363faef4.rlib,libtypenum-9bd82fdfda23287d.rlib}" "/usr/lib/rustlib/x86_64-unknown-linux-gnu/lib/{libstd-735cce14533b4b14.rlib,libpanic_unwind-b6737e136067c5af.rlib,libobject-1303c4fadc744db1.rlib,libmemchr-4307c8d3168c78e3.rlib,libaddr2line-78c32e4a87333dbd.rlib,libgimli-0fc0e49acceead35.rlib,librustc_demangle-a0b9c22792c85e39.rlib,libstd_detect-83f7e4a793b39811.rlib,libhashbrown-0d7f81c4b968ca96.rlib,librustc_std_workspace_alloc-6a65191895fd580e.rlib,libminiz_oxide-357876da66360401.rlib,libadler-0c1d85aa00dff5fa.rlib,libunwind-d8e6262062f0cd85.rlib,libcfg_if-2424c0e00d5dc157.rlib,liblibc-d9b6e8d963ea0be1.rlib,liballoc-ecc6700de60a5b56.rlib,librustc_std_workspace_core-6129c8f9aed81c8b.rlib,libcore-2d4b9a0883bc3ecf.rlib,libcompiler_builtins-bdfb7378ad19badb.rlib}" "-Wl,-Bdynamic" "-lgcc_s" "-lutil" "-lrt" "-lpthread" "-lm" "-ldl" "-lc" "-Wl,--eh-frame-hdr" "-Wl,-z,noexecstack" "-L" ".../supercop-data/meteor,tiny/amd64/lib" "-L" ".../supercop-data/meteor,tiny/amd64/try/c/gcc_-march=native_-mtune=native_-O2_-fwrapv_-fPIC_-fPIE_-gdwarf-4_-Wall/constbranchindex/crypto_hash/sha256/rust_sha2/work/target/release/build/crypto_hash_sha256-2696b4c59c0131cc/out" "-L" "/usr/lib/rustlib/x86_64-unknown-linux-gnu/lib" "-o" ".../supercop-data/meteor,tiny/amd64/try/c/gcc_-march=native_-mtune=native_-O2_-fwrapv_-fPIC_-fPIE_-gdwarf-4_-Wall/constbranchindex/crypto_hash/sha256/rust_sha2/work/target/release/deps/measure-450ae3ba5b2a718d" "-Wl,--gc-sections" "-pie" "-Wl,-z,relro,-z,now" "-Wl,-O1" "-Wl,--strip-debug" "-nodefaultlibs"
try.c:   = note: some arguments are omitted. use `--verbose` to show all linker arguments
try.c:   = note: /usr/bin/ld: cannot find -lcpucycles: No such file or directory
try.c:           collect2: error: ld returned 1 exit status
try.c:
try.c:
try.c: error: could not compile `crypto_hash_sha256` (bin "measure") due to 1 previous error

Number of similar (implementation,compiler) pairs: 1, namely:
ImplementationCompiler
rust_sha2gcc -march=native -mtune=native -O2 -fwrapv -fPIC -fPIE -gdwarf-4 -Wall (14.2.0)

Compiler output


try.c: error: linking with `cc` failed: exit status: 1
try.c:   |
try.c:   = note: LC_ALL="C" PATH="/usr/lib/rustlib/x86_64-unknown-linux-gnu/bin:/usr/lib/lib/rustlib/x86_64-unknown-linux-gnu/bin:.../supercop-data/meteor,tiny/checksum/bin:.../supercop-data/meteor,tiny/sinceepoch/bin:.../supercop-data/meteor,tiny/compiledinfo/bin:.../supercop-data/meteor,tiny/killafter/bin:.../supercop-data/meteor,tiny/okcompilers/bin:.../supercop-data/meteor,tiny/scripts:/usr/sfw/bin:/usr/local/bin:/usr/local/bin:/usr/bin:/bin:/usr/games" VSLANG="1033" "cc" "-m64" "/tmp/rustcIs472s/symbols.o" "<2 object files omitted>" "-Wl,--as-needed" "-Wl,-Bdynamic" "-lmeasure-anything" "-lmeasure" "-lsupercop" "-lkernelrandombytes" "-lcpucycles" "-lcrypto" "-lm" "-Wl,-Bstatic" ".../supercop-data/meteor,tiny/amd64/try/c/gcc_-march=native_-mtune=native_-O3_-fwrapv_-fPIC_-fPIE_-gdwarf-4_-Wall/constbranchindex/crypto_hash/sha256/rust_sha2/work/target/release/deps/{libcrypto_hash_sha256-e93f0d72cb4e1b27.rlib,libsha2-d9fe3e64ab7a35b5.rlib,libcpuid_bool-a4038e1fb04f065f.rlib,libcfg_if-52860a7ddc158427.rlib,libopaque_debug-851f5dc4fc7cb701.rlib,libdigest-1689fddb67a4db6c.rlib,libblock_buffer-15129c7af7775380.rlib,libgeneric_array-abd9aca6363faef4.rlib,libtypenum-9bd82fdfda23287d.rlib}" "/usr/lib/rustlib/x86_64-unknown-linux-gnu/lib/{libstd-735cce14533b4b14.rlib,libpanic_unwind-b6737e136067c5af.rlib,libobject-1303c4fadc744db1.rlib,libmemchr-4307c8d3168c78e3.rlib,libaddr2line-78c32e4a87333dbd.rlib,libgimli-0fc0e49acceead35.rlib,librustc_demangle-a0b9c22792c85e39.rlib,libstd_detect-83f7e4a793b39811.rlib,libhashbrown-0d7f81c4b968ca96.rlib,librustc_std_workspace_alloc-6a65191895fd580e.rlib,libminiz_oxide-357876da66360401.rlib,libadler-0c1d85aa00dff5fa.rlib,libunwind-d8e6262062f0cd85.rlib,libcfg_if-2424c0e00d5dc157.rlib,liblibc-d9b6e8d963ea0be1.rlib,liballoc-ecc6700de60a5b56.rlib,librustc_std_workspace_core-6129c8f9aed81c8b.rlib,libcore-2d4b9a0883bc3ecf.rlib,libcompiler_builtins-bdfb7378ad19badb.rlib}" "-Wl,-Bdynamic" "-lgcc_s" "-lutil" "-lrt" "-lpthread" "-lm" "-ldl" "-lc" "-Wl,--eh-frame-hdr" "-Wl,-z,noexecstack" "-L" ".../supercop-data/meteor,tiny/amd64/lib" "-L" ".../supercop-data/meteor,tiny/amd64/try/c/gcc_-march=native_-mtune=native_-O3_-fwrapv_-fPIC_-fPIE_-gdwarf-4_-Wall/constbranchindex/crypto_hash/sha256/rust_sha2/work/target/release/build/crypto_hash_sha256-2696b4c59c0131cc/out" "-L" "/usr/lib/rustlib/x86_64-unknown-linux-gnu/lib" "-o" ".../supercop-data/meteor,tiny/amd64/try/c/gcc_-march=native_-mtune=native_-O3_-fwrapv_-fPIC_-fPIE_-gdwarf-4_-Wall/constbranchindex/crypto_hash/sha256/rust_sha2/work/target/release/deps/measure-450ae3ba5b2a718d" "-Wl,--gc-sections" "-pie" "-Wl,-z,relro,-z,now" "-Wl,-O1" "-Wl,--strip-debug" "-nodefaultlibs"
try.c:   = note: some arguments are omitted. use `--verbose` to show all linker arguments
try.c:   = note: /usr/bin/ld: cannot find -lcpucycles: No such file or directory
try.c:           collect2: error: ld returned 1 exit status
try.c:
try.c:
try.c: error: could not compile `crypto_hash_sha256` (bin "measure") due to 1 previous error

Number of similar (implementation,compiler) pairs: 1, namely:
ImplementationCompiler
rust_sha2gcc -march=native -mtune=native -O3 -fwrapv -fPIC -fPIE -gdwarf-4 -Wall (14.2.0)

Compiler output


try.c: error: linking with `cc` failed: exit status: 1
try.c:   |
try.c:   = note: LC_ALL="C" PATH="/usr/lib/rustlib/x86_64-unknown-linux-gnu/bin:/usr/lib/lib/rustlib/x86_64-unknown-linux-gnu/bin:.../supercop-data/meteor,tiny/checksum/bin:.../supercop-data/meteor,tiny/sinceepoch/bin:.../supercop-data/meteor,tiny/compiledinfo/bin:.../supercop-data/meteor,tiny/killafter/bin:.../supercop-data/meteor,tiny/okcompilers/bin:.../supercop-data/meteor,tiny/scripts:/usr/sfw/bin:/usr/local/bin:/usr/local/bin:/usr/bin:/bin:/usr/games" VSLANG="1033" "cc" "-m64" "/tmp/rustcbxCbk1/symbols.o" "<2 object files omitted>" "-Wl,--as-needed" "-Wl,-Bdynamic" "-ltry-anything" "-ltry-small" "-lsupercop" "-lkernelrandombytes" "-lcpucycles" "-lcrypto" "-lm" "-Wl,-Bstatic" ".../supercop-data/meteor,tiny/amd64/try/c/gcc_-march=native_-mtune=native_-O_-fwrapv_-fPIC_-fPIE_-gdwarf-4_-Wall/constbranchindex/crypto_hash/sha256/rust_sha2/work/target/release/deps/{libcrypto_hash_sha256-e93f0d72cb4e1b27.rlib,libsha2-d9fe3e64ab7a35b5.rlib,libcpuid_bool-a4038e1fb04f065f.rlib,libcfg_if-52860a7ddc158427.rlib,libopaque_debug-851f5dc4fc7cb701.rlib,libdigest-1689fddb67a4db6c.rlib,libblock_buffer-15129c7af7775380.rlib,libgeneric_array-abd9aca6363faef4.rlib,libtypenum-9bd82fdfda23287d.rlib}" "/usr/lib/rustlib/x86_64-unknown-linux-gnu/lib/{libstd-735cce14533b4b14.rlib,libpanic_unwind-b6737e136067c5af.rlib,libobject-1303c4fadc744db1.rlib,libmemchr-4307c8d3168c78e3.rlib,libaddr2line-78c32e4a87333dbd.rlib,libgimli-0fc0e49acceead35.rlib,librustc_demangle-a0b9c22792c85e39.rlib,libstd_detect-83f7e4a793b39811.rlib,libhashbrown-0d7f81c4b968ca96.rlib,librustc_std_workspace_alloc-6a65191895fd580e.rlib,libminiz_oxide-357876da66360401.rlib,libadler-0c1d85aa00dff5fa.rlib,libunwind-d8e6262062f0cd85.rlib,libcfg_if-2424c0e00d5dc157.rlib,liblibc-d9b6e8d963ea0be1.rlib,liballoc-ecc6700de60a5b56.rlib,librustc_std_workspace_core-6129c8f9aed81c8b.rlib,libcore-2d4b9a0883bc3ecf.rlib,libcompiler_builtins-bdfb7378ad19badb.rlib}" "-Wl,-Bdynamic" "-lgcc_s" "-lutil" "-lrt" "-lpthread" "-lm" "-ldl" "-lc" "-Wl,--eh-frame-hdr" "-Wl,-z,noexecstack" "-L" ".../supercop-data/meteor,tiny/amd64/lib" "-L" ".../supercop-data/meteor,tiny/amd64/try/c/gcc_-march=native_-mtune=native_-O_-fwrapv_-fPIC_-fPIE_-gdwarf-4_-Wall/constbranchindex/crypto_hash/sha256/rust_sha2/work/target/release/build/crypto_hash_sha256-2696b4c59c0131cc/out" "-L" "/usr/lib/rustlib/x86_64-unknown-linux-gnu/lib" "-o" ".../supercop-data/meteor,tiny/amd64/try/c/gcc_-march=native_-mtune=native_-O_-fwrapv_-fPIC_-fPIE_-gdwarf-4_-Wall/constbranchindex/crypto_hash/sha256/rust_sha2/work/target/release/deps/try_small-95c091be2eca5fb7" "-Wl,--gc-sections" "-pie" "-Wl,-z,relro,-z,now" "-Wl,-O1" "-Wl,--strip-debug" "-nodefaultlibs"
try.c:   = note: some arguments are omitted. use `--verbose` to show all linker arguments
try.c:   = note: /usr/bin/ld: cannot find -lcpucycles: No such file or directory
try.c:           collect2: error: ld returned 1 exit status
try.c:
try.c:
try.c: error: could not compile `crypto_hash_sha256` (bin "try-small") due to 1 previous error

Number of similar (implementation,compiler) pairs: 1, namely:
ImplementationCompiler
rust_sha2gcc -march=native -mtune=native -O -fwrapv -fPIC -fPIE -gdwarf-4 -Wall (14.2.0)

Compiler output


try.c: error: linking with `cc` failed: exit status: 1
try.c:   |
try.c:   = note: LC_ALL="C" PATH="/usr/lib/rustlib/x86_64-unknown-linux-gnu/bin:/usr/lib/lib/rustlib/x86_64-unknown-linux-gnu/bin:.../supercop-data/meteor,tiny/checksum/bin:.../supercop-data/meteor,tiny/sinceepoch/bin:.../supercop-data/meteor,tiny/compiledinfo/bin:.../supercop-data/meteor,tiny/killafter/bin:.../supercop-data/meteor,tiny/okcompilers/bin:.../supercop-data/meteor,tiny/scripts:/usr/sfw/bin:/usr/local/bin:/usr/local/bin:/usr/bin:/bin:/usr/games" VSLANG="1033" "cc" "-m64" "/tmp/rustcz6QMXE/symbols.o" "<2 object files omitted>" "-Wl,--as-needed" "-Wl,-Bdynamic" "-ltry-anything" "-ltry-small" "-lsupercop" "-lkernelrandombytes" "-lcpucycles" "-lcrypto" "-lm" "-Wl,-Bstatic" ".../supercop-data/meteor,tiny/amd64/try/c/gcc_-march=native_-mtune=native_-Os_-fwrapv_-fPIC_-fPIE_-gdwarf-4_-Wall/constbranchindex/crypto_hash/sha256/rust_sha2/work/target/release/deps/{libcrypto_hash_sha256-e93f0d72cb4e1b27.rlib,libsha2-d9fe3e64ab7a35b5.rlib,libcpuid_bool-a4038e1fb04f065f.rlib,libcfg_if-52860a7ddc158427.rlib,libopaque_debug-851f5dc4fc7cb701.rlib,libdigest-1689fddb67a4db6c.rlib,libblock_buffer-15129c7af7775380.rlib,libgeneric_array-abd9aca6363faef4.rlib,libtypenum-9bd82fdfda23287d.rlib}" "/usr/lib/rustlib/x86_64-unknown-linux-gnu/lib/{libstd-735cce14533b4b14.rlib,libpanic_unwind-b6737e136067c5af.rlib,libobject-1303c4fadc744db1.rlib,libmemchr-4307c8d3168c78e3.rlib,libaddr2line-78c32e4a87333dbd.rlib,libgimli-0fc0e49acceead35.rlib,librustc_demangle-a0b9c22792c85e39.rlib,libstd_detect-83f7e4a793b39811.rlib,libhashbrown-0d7f81c4b968ca96.rlib,librustc_std_workspace_alloc-6a65191895fd580e.rlib,libminiz_oxide-357876da66360401.rlib,libadler-0c1d85aa00dff5fa.rlib,libunwind-d8e6262062f0cd85.rlib,libcfg_if-2424c0e00d5dc157.rlib,liblibc-d9b6e8d963ea0be1.rlib,liballoc-ecc6700de60a5b56.rlib,librustc_std_workspace_core-6129c8f9aed81c8b.rlib,libcore-2d4b9a0883bc3ecf.rlib,libcompiler_builtins-bdfb7378ad19badb.rlib}" "-Wl,-Bdynamic" "-lgcc_s" "-lutil" "-lrt" "-lpthread" "-lm" "-ldl" "-lc" "-Wl,--eh-frame-hdr" "-Wl,-z,noexecstack" "-L" ".../supercop-data/meteor,tiny/amd64/lib" "-L" ".../supercop-data/meteor,tiny/amd64/try/c/gcc_-march=native_-mtune=native_-Os_-fwrapv_-fPIC_-fPIE_-gdwarf-4_-Wall/constbranchindex/crypto_hash/sha256/rust_sha2/work/target/release/build/crypto_hash_sha256-2696b4c59c0131cc/out" "-L" "/usr/lib/rustlib/x86_64-unknown-linux-gnu/lib" "-o" ".../supercop-data/meteor,tiny/amd64/try/c/gcc_-march=native_-mtune=native_-Os_-fwrapv_-fPIC_-fPIE_-gdwarf-4_-Wall/constbranchindex/crypto_hash/sha256/rust_sha2/work/target/release/deps/try_small-95c091be2eca5fb7" "-Wl,--gc-sections" "-pie" "-Wl,-z,relro,-z,now" "-Wl,-O1" "-Wl,--strip-debug" "-nodefaultlibs"
try.c:   = note: some arguments are omitted. use `--verbose` to show all linker arguments
try.c:   = note: /usr/bin/ld: cannot find -lcpucycles: No such file or directory
try.c:           collect2: error: ld returned 1 exit status
try.c:
try.c:
try.c: error: could not compile `crypto_hash_sha256` (bin "try-small") due to 1 previous error

Number of similar (implementation,compiler) pairs: 1, namely:
ImplementationCompiler
rust_sha2gcc -march=native -mtune=native -Os -fwrapv -fPIC -fPIE -gdwarf-4 -Wall (14.2.0)

TIMECOP error (can be valgrind bug)


error 132

Process terminating with default action of signal 4 (SIGILL)
 Illegal opcode at address 0x17B071
   at 0x...: main (try-anything.cpp:362)
Illegal instruction

Number of similar (implementation,compiler) pairs: 1, namely:
ImplementationCompiler
cryptoppclang++ -march=native -O2 -fwrapv -Qunused-arguments -fPIC -fPIE -gdwarf-4 -Wall (Debian_Clang_19.1.7_(3+b1))

TIMECOP error (can be valgrind bug)


error 132

Process terminating with default action of signal 4 (SIGILL)
 Illegal opcode at address 0x17B081
   at 0x...: main (try-anything.cpp:362)
Illegal instruction

Number of similar (implementation,compiler) pairs: 1, namely:
ImplementationCompiler
cryptoppclang++ -march=native -O3 -fwrapv -Qunused-arguments -fPIC -fPIE -gdwarf-4 -Wall (Debian_Clang_19.1.7_(3+b1))

TIMECOP error (can be valgrind bug)


error 132

Process terminating with default action of signal 4 (SIGILL)
 Illegal opcode at address 0x17A9F3
   at 0x...: main (try-anything.cpp:362)
Illegal instruction

Number of similar (implementation,compiler) pairs: 1, namely:
ImplementationCompiler
cryptoppclang++ -march=native -Os -fwrapv -Qunused-arguments -fPIC -fPIE -gdwarf-4 -Wall (Debian_Clang_19.1.7_(3+b1))

TIMECOP error (can be valgrind bug)


error 132

Process terminating with default action of signal 4 (SIGILL)
 Illegal opcode at address 0x10B527
   at 0x...: main (try-anything.c:362)
Illegal instruction

Number of similar (implementation,compiler) pairs: 3, namely:
ImplementationCompiler
opensslclang -march=native -O2 -fwrapv -Qunused-arguments -fPIC -fPIE -gdwarf-4 -Wall (Debian_Clang_19.1.7_(3+b1))
sphlibclang -march=native -O2 -fwrapv -Qunused-arguments -fPIC -fPIE -gdwarf-4 -Wall (Debian_Clang_19.1.7_(3+b1))
sphlib-smallclang -march=native -O2 -fwrapv -Qunused-arguments -fPIC -fPIE -gdwarf-4 -Wall (Debian_Clang_19.1.7_(3+b1))

TIMECOP error (can be valgrind bug)


error 132

Process terminating with default action of signal 4 (SIGILL)
 Illegal opcode at address 0x10B537
   at 0x...: main (try-anything.c:362)
Illegal instruction

Number of similar (implementation,compiler) pairs: 3, namely:
ImplementationCompiler
opensslclang -march=native -O3 -fwrapv -Qunused-arguments -fPIC -fPIE -gdwarf-4 -Wall (Debian_Clang_19.1.7_(3+b1))
sphlibclang -march=native -O3 -fwrapv -Qunused-arguments -fPIC -fPIE -gdwarf-4 -Wall (Debian_Clang_19.1.7_(3+b1))
sphlib-smallclang -march=native -O3 -fwrapv -Qunused-arguments -fPIC -fPIE -gdwarf-4 -Wall (Debian_Clang_19.1.7_(3+b1))

TIMECOP error (can be valgrind bug)


error 132

Process terminating with default action of signal 4 (SIGILL)
 Illegal opcode at address 0x10AE73
   at 0x...: main (try-anything.c:362)
Illegal instruction

Number of similar (implementation,compiler) pairs: 3, namely:
ImplementationCompiler
opensslclang -march=native -Os -fwrapv -Qunused-arguments -fPIC -fPIE -gdwarf-4 -Wall (Debian_Clang_19.1.7_(3+b1))
sphlibclang -march=native -Os -fwrapv -Qunused-arguments -fPIC -fPIE -gdwarf-4 -Wall (Debian_Clang_19.1.7_(3+b1))
sphlib-smallclang -march=native -Os -fwrapv -Qunused-arguments -fPIC -fPIE -gdwarf-4 -Wall (Debian_Clang_19.1.7_(3+b1))

TIMECOP error (can be valgrind bug)


error 132

Process terminating with default action of signal 4 (SIGILL)
 Illegal opcode at address 0x10C033
   at 0x...: crypto_hashblocks_sha256_dolbeau_amd64_sha_constbranchindex (blocks.c:176)
   by 0x...: crypto_hash_sha256_ref_constbranchindex (hash.c:34)
   by 0x...: test (try.c:90)
   by 0x...: main (try-anything.c:344)
Illegal instruction

Number of similar (implementation,compiler) pairs: 1, namely:
ImplementationCompiler
refclang -march=native -O2 -fwrapv -Qunused-arguments -fPIC -fPIE -gdwarf-4 -Wall (Debian_Clang_19.1.7_(3+b1))

TIMECOP error (can be valgrind bug)


error 132

Process terminating with default action of signal 4 (SIGILL)
 Illegal opcode at address 0x10C043
   at 0x...: crypto_hashblocks_sha256_dolbeau_amd64_sha_constbranchindex (blocks.c:176)
   by 0x...: crypto_hash_sha256_ref_constbranchindex (hash.c:34)
   by 0x...: test (try.c:90)
   by 0x...: main (try-anything.c:344)
Illegal instruction

Number of similar (implementation,compiler) pairs: 1, namely:
ImplementationCompiler
refclang -march=native -O3 -fwrapv -Qunused-arguments -fPIC -fPIE -gdwarf-4 -Wall (Debian_Clang_19.1.7_(3+b1))

TIMECOP error (can be valgrind bug)


error 132

Process terminating with default action of signal 4 (SIGILL)
 Illegal opcode at address 0x10B513
   at 0x...: crypto_hashblocks_sha256_dolbeau_amd64_sha_constbranchindex (blocks.c:176)
   by 0x...: crypto_hash_sha256_ref_constbranchindex (hash.c:34)
   by 0x...: test (try.c:90)
   by 0x...: main (try-anything.c:344)
Illegal instruction

Number of similar (implementation,compiler) pairs: 1, namely:
ImplementationCompiler
refclang -march=native -O -fwrapv -Qunused-arguments -fPIC -fPIE -gdwarf-4 -Wall (Debian_Clang_19.1.7_(3+b1))

TIMECOP error (can be valgrind bug)


error 132

Process terminating with default action of signal 4 (SIGILL)
 Illegal opcode at address 0x10B773
   at 0x...: crypto_hashblocks_sha256_dolbeau_amd64_sha_constbranchindex (blocks.c:176)
   by 0x...: crypto_hash_sha256_ref_constbranchindex (hash.c:34)
   by 0x...: test (try.c:90)
   by 0x...: main (try-anything.c:344)
Illegal instruction

Number of similar (implementation,compiler) pairs: 1, namely:
ImplementationCompiler
refclang -march=native -Os -fwrapv -Qunused-arguments -fPIC -fPIE -gdwarf-4 -Wall (Debian_Clang_19.1.7_(3+b1))

TIMECOP error (can be valgrind bug)


error 132

Process terminating with default action of signal 4 (SIGILL)
 Illegal opcode at address 0x10BC83
   at 0x...: crypto_hashblocks_sha256_dolbeau_amd64_sha_constbranchindex (blocks.c:176)
   by 0x...: crypto_hash_sha256_ref_constbranchindex (hash.c:34)
   by 0x...: test (try.c:90)
   by 0x...: main (try-anything.c:344)
Illegal instruction

Number of similar (implementation,compiler) pairs: 1, namely:
ImplementationCompiler
refclang -mcpu=native -O3 -fwrapv -Qunused-arguments -fPIC -fPIE -gdwarf-4 -Wall (Debian_Clang_19.1.7_(3+b1))

TIMECOP error (can be valgrind bug)


error 132

Process terminating with default action of signal 4 (SIGILL)
 Illegal opcode at address 0x10B743
   at 0x...: crypto_hashblocks_sha256_dolbeau_amd64_sha_constbranchindex (blocks.c:176)
   by 0x...: crypto_hash_sha256_ref_constbranchindex (hash.c:34)
   by 0x...: test (try.c:90)
   by 0x...: main (try-anything.c:344)
Illegal instruction

Number of similar (implementation,compiler) pairs: 1, namely:
ImplementationCompiler
refgcc -march=native -mtune=native -O2 -fwrapv -fPIC -fPIE -gdwarf-4 -Wall (14.2.0)

TIMECOP error (can be valgrind bug)


error 132

Process terminating with default action of signal 4 (SIGILL)
 Illegal opcode at address 0x10BC03
   at 0x...: crypto_hashblocks_sha256_dolbeau_amd64_sha_constbranchindex (blocks.c:176)
   by 0x...: crypto_hash_sha256_ref_constbranchindex (hash.c:34)
   by 0x...: test (try.c:90)
   by 0x...: main (try-anything.c:344)
Illegal instruction

Number of similar (implementation,compiler) pairs: 1, namely:
ImplementationCompiler
refgcc -march=native -mtune=native -O3 -fwrapv -fPIC -fPIE -gdwarf-4 -Wall (14.2.0)

TIMECOP error (can be valgrind bug)


error 132

Process terminating with default action of signal 4 (SIGILL)
 Illegal opcode at address 0x10B523
   at 0x...: crypto_hashblocks_sha256_dolbeau_amd64_sha_constbranchindex (blocks.c:176)
   by 0x...: crypto_hash_sha256_ref_constbranchindex (hash.c:34)
   by 0x...: test (try.c:90)
   by 0x...: main (try-anything.c:344)
Illegal instruction

Number of similar (implementation,compiler) pairs: 1, namely:
ImplementationCompiler
refgcc -march=native -mtune=native -O -fwrapv -fPIC -fPIE -gdwarf-4 -Wall (14.2.0)

TIMECOP error (can be valgrind bug)


error 132

Process terminating with default action of signal 4 (SIGILL)
 Illegal opcode at address 0x10A083
   at 0x...: crypto_hashblocks_sha256_dolbeau_amd64_sha_constbranchindex (blocks.c:176)
   by 0x...: crypto_hash_sha256_ref_constbranchindex (hash.c:34)
   by 0x...: test (try.c:90)
   by 0x...: main (try-anything.c:344)
Illegal instruction

Number of similar (implementation,compiler) pairs: 1, namely:
ImplementationCompiler
refgcc -march=native -mtune=native -Os -fwrapv -fPIC -fPIE -gdwarf-4 -Wall (14.2.0)

Passed TIMECOP


TIMECOP iterations: 10

Number of similar (implementation,compiler) pairs: 23, namely:
ImplementationCompiler
cryptoppclang++ -march=native -O -fwrapv -Qunused-arguments -fPIC -fPIE -gdwarf-4 -Wall (Debian_Clang_19.1.7_(3+b1))
cryptoppg++ -march=native -mtune=native -O2 -fwrapv -fPIC -fPIE -gdwarf-4 -Wall (14.2.0)
cryptoppg++ -march=native -mtune=native -O3 -fwrapv -fPIC -fPIE -gdwarf-4 -Wall (14.2.0)
cryptoppg++ -march=native -mtune=native -O -fwrapv -fPIC -fPIE -gdwarf-4 -Wall (14.2.0)
cryptoppg++ -march=native -mtune=native -Os -fwrapv -fPIC -fPIE -gdwarf-4 -Wall (14.2.0)
opensslclang -march=native -O -fwrapv -Qunused-arguments -fPIC -fPIE -gdwarf-4 -Wall (Debian_Clang_19.1.7_(3+b1))
opensslclang -mcpu=native -O3 -fwrapv -Qunused-arguments -fPIC -fPIE -gdwarf-4 -Wall (Debian_Clang_19.1.7_(3+b1))
opensslgcc -march=native -mtune=native -O2 -fwrapv -fPIC -fPIE -gdwarf-4 -Wall (14.2.0)
opensslgcc -march=native -mtune=native -O3 -fwrapv -fPIC -fPIE -gdwarf-4 -Wall (14.2.0)
opensslgcc -march=native -mtune=native -O -fwrapv -fPIC -fPIE -gdwarf-4 -Wall (14.2.0)
opensslgcc -march=native -mtune=native -Os -fwrapv -fPIC -fPIE -gdwarf-4 -Wall (14.2.0)
sphlibclang -march=native -O -fwrapv -Qunused-arguments -fPIC -fPIE -gdwarf-4 -Wall (Debian_Clang_19.1.7_(3+b1))
sphlibclang -mcpu=native -O3 -fwrapv -Qunused-arguments -fPIC -fPIE -gdwarf-4 -Wall (Debian_Clang_19.1.7_(3+b1))
sphlibgcc -march=native -mtune=native -O2 -fwrapv -fPIC -fPIE -gdwarf-4 -Wall (14.2.0)
sphlibgcc -march=native -mtune=native -O3 -fwrapv -fPIC -fPIE -gdwarf-4 -Wall (14.2.0)
sphlibgcc -march=native -mtune=native -O -fwrapv -fPIC -fPIE -gdwarf-4 -Wall (14.2.0)
sphlibgcc -march=native -mtune=native -Os -fwrapv -fPIC -fPIE -gdwarf-4 -Wall (14.2.0)
sphlib-smallclang -march=native -O -fwrapv -Qunused-arguments -fPIC -fPIE -gdwarf-4 -Wall (Debian_Clang_19.1.7_(3+b1))
sphlib-smallclang -mcpu=native -O3 -fwrapv -Qunused-arguments -fPIC -fPIE -gdwarf-4 -Wall (Debian_Clang_19.1.7_(3+b1))
sphlib-smallgcc -march=native -mtune=native -O2 -fwrapv -fPIC -fPIE -gdwarf-4 -Wall (14.2.0)
sphlib-smallgcc -march=native -mtune=native -O3 -fwrapv -fPIC -fPIE -gdwarf-4 -Wall (14.2.0)
sphlib-smallgcc -march=native -mtune=native -O -fwrapv -fPIC -fPIE -gdwarf-4 -Wall (14.2.0)
sphlib-smallgcc -march=native -mtune=native -Os -fwrapv -fPIC -fPIE -gdwarf-4 -Wall (14.2.0)