Test results for amd64, know, crypto_aead/omdsha256k128n96tau96v1

[Page version: 20250322 15:59:23]

Measurements for amd64, know, crypto_aead Test results for amd64, know, crypto_aead Test results for crypto_aead/omdsha256k128n96tau96v1
Computer: know
Microarchitecture: amd64; Comet Lake (806ec)
Architecture: amd64
CPU ID: GenuineIntel-000806ec-bfebfbff
SUPERCOP version: 20250307
Operation: crypto_aead
Primitive: omdsha256k128n96tau96v1
TimeObject sizeTest sizeImplementationCompilerBenchmark dateSUPERCOP version
16542517110 0 039884 780 1088T:refgcc -march=native -mtune=native -O3 -fwrapv -fPIC -fPIE -gdwarf-4 -Wall2025031320250307
17872811725 0 035361 852 1056T:refclang -march=native -O2 -fwrapv -Qunused-arguments -fPIC -fPIE -gdwarf-4 -Wall2025031320250307
18005810894 0 034753 852 1088T:refclang -march=native -O3 -fwrapv -Qunused-arguments -fPIC -fPIE -gdwarf-4 -Wall2025031320250307
1803936290 0 027124 780 1088T:refgcc -march=native -mtune=native -O2 -fwrapv -fPIC -fPIE -gdwarf-4 -Wall2025031320250307
1964854596 0 025407 844 1088T:refclang -march=native -Os -fwrapv -Qunused-arguments -fPIC -fPIE -gdwarf-4 -Wall2025031320250307
20452012170 0 034473 852 1024T:refclang -mcpu=native -O3 -fwrapv -Qunused-arguments -fPIC -fPIE -gdwarf-4 -Wall2025031320250307
2075485721 0 025875 772 1088T:refgcc -march=native -mtune=native -O -fwrapv -fPIC -fPIE -gdwarf-4 -Wall2025031320250307
2111635713 0 025641 852 1024T:refclang -march=native -O -fwrapv -Qunused-arguments -fPIC -fPIE -gdwarf-4 -Wall2025031320250307
2318354115 0 022639 756 1056T:refgcc -march=native -mtune=native -Os -fwrapv -fPIC -fPIE -gdwarf-4 -Wall2025031320250307

Compiler output


try.c: /usr/bin/ld: libcrypto_aead_omdsha256k128n96tau96v1.a(omdsha256.o):.../supercop-data/know/amd64/try/c/clang_-march=native_-O2_-fwrapv_-Qunused-arguments_-fPIC_-fPIE_-gdwarf-4_-Wall/timingleaks/crypto_aead/omdsha256k128n96tau96v1/avx1/work/./omdsha256.h:137: multiple definition of `Hash'; libcrypto_aead_omdsha256k128n96tau96v1.a(encrypt.o):.../supercop-data/know/amd64/try/c/clang_-march=native_-O2_-fwrapv_-Qunused-arguments_-fPIC_-fPIE_-gdwarf-4_-Wall/timingleaks/crypto_aead/omdsha256k128n96tau96v1/avx1/work/./omdsha256.h:137: first defined here
try.c: clang: error: linker command failed with exit code 1 (use -v to see invocation)

Number of similar (implementation,compiler) pairs: 1, namely:
ImplementationCompiler
T:avx1clang -march=native -O2 -fwrapv -Qunused-arguments -fPIC -fPIE -gdwarf-4 -Wall (Debian_Clang_14.0.6)

Compiler output


try.c: /usr/bin/ld: libcrypto_aead_omdsha256k128n96tau96v1.a(omdsha256.o):.../supercop-data/know/amd64/try/c/clang_-march=native_-O3_-fwrapv_-Qunused-arguments_-fPIC_-fPIE_-gdwarf-4_-Wall/timingleaks/crypto_aead/omdsha256k128n96tau96v1/avx1/work/./omdsha256.h:137: multiple definition of `Hash'; libcrypto_aead_omdsha256k128n96tau96v1.a(encrypt.o):.../supercop-data/know/amd64/try/c/clang_-march=native_-O3_-fwrapv_-Qunused-arguments_-fPIC_-fPIE_-gdwarf-4_-Wall/timingleaks/crypto_aead/omdsha256k128n96tau96v1/avx1/work/./omdsha256.h:137: first defined here
try.c: clang: error: linker command failed with exit code 1 (use -v to see invocation)

Number of similar (implementation,compiler) pairs: 1, namely:
ImplementationCompiler
T:avx1clang -march=native -O3 -fwrapv -Qunused-arguments -fPIC -fPIE -gdwarf-4 -Wall (Debian_Clang_14.0.6)

Compiler output


try.c: /usr/bin/ld: libcrypto_aead_omdsha256k128n96tau96v1.a(omdsha256.o):.../supercop-data/know/amd64/try/c/clang_-march=native_-O_-fwrapv_-Qunused-arguments_-fPIC_-fPIE_-gdwarf-4_-Wall/timingleaks/crypto_aead/omdsha256k128n96tau96v1/avx1/work/./omdsha256.h:137: multiple definition of `Hash'; libcrypto_aead_omdsha256k128n96tau96v1.a(encrypt.o):.../supercop-data/know/amd64/try/c/clang_-march=native_-O_-fwrapv_-Qunused-arguments_-fPIC_-fPIE_-gdwarf-4_-Wall/timingleaks/crypto_aead/omdsha256k128n96tau96v1/avx1/work/./omdsha256.h:137: first defined here
try.c: clang: error: linker command failed with exit code 1 (use -v to see invocation)

Number of similar (implementation,compiler) pairs: 1, namely:
ImplementationCompiler
T:avx1clang -march=native -O -fwrapv -Qunused-arguments -fPIC -fPIE -gdwarf-4 -Wall (Debian_Clang_14.0.6)

Compiler output


try.c: /usr/bin/ld: libcrypto_aead_omdsha256k128n96tau96v1.a(omdsha256.o):.../supercop-data/know/amd64/try/c/clang_-march=native_-Os_-fwrapv_-Qunused-arguments_-fPIC_-fPIE_-gdwarf-4_-Wall/timingleaks/crypto_aead/omdsha256k128n96tau96v1/avx1/work/./omdsha256.h:137: multiple definition of `Hash'; libcrypto_aead_omdsha256k128n96tau96v1.a(encrypt.o):.../supercop-data/know/amd64/try/c/clang_-march=native_-Os_-fwrapv_-Qunused-arguments_-fPIC_-fPIE_-gdwarf-4_-Wall/timingleaks/crypto_aead/omdsha256k128n96tau96v1/avx1/work/./omdsha256.h:137: first defined here
try.c: clang: error: linker command failed with exit code 1 (use -v to see invocation)

Number of similar (implementation,compiler) pairs: 1, namely:
ImplementationCompiler
T:avx1clang -march=native -Os -fwrapv -Qunused-arguments -fPIC -fPIE -gdwarf-4 -Wall (Debian_Clang_14.0.6)

Compiler output


try.c: /usr/bin/ld: libcrypto_aead_omdsha256k128n96tau96v1.a(omdsha256.o):.../supercop-data/know/amd64/try/c/clang_-mcpu=native_-O3_-fwrapv_-Qunused-arguments_-fPIC_-fPIE_-gdwarf-4_-Wall/timingleaks/crypto_aead/omdsha256k128n96tau96v1/avx1/work/./omdsha256.h:137: multiple definition of `Hash'; libcrypto_aead_omdsha256k128n96tau96v1.a(encrypt.o):.../supercop-data/know/amd64/try/c/clang_-mcpu=native_-O3_-fwrapv_-Qunused-arguments_-fPIC_-fPIE_-gdwarf-4_-Wall/timingleaks/crypto_aead/omdsha256k128n96tau96v1/avx1/work/./omdsha256.h:137: first defined here
try.c: clang: error: linker command failed with exit code 1 (use -v to see invocation)

Number of similar (implementation,compiler) pairs: 1, namely:
ImplementationCompiler
T:avx1clang -mcpu=native -O3 -fwrapv -Qunused-arguments -fPIC -fPIE -gdwarf-4 -Wall (Debian_Clang_14.0.6)

Compiler output


encrypt.c: /tmp/cc9OwvZM.s: Assembler messages:
encrypt.c: /tmp/cc9OwvZM.s:922: Warning: dwarf line number information for .data ignored
encrypt.c: /tmp/cc9OwvZM.s:924: Warning: dwarf line number information for .data ignored
encrypt.c: /tmp/cc9OwvZM.s:925: Warning: dwarf line number information for .data ignored
encrypt.c: /tmp/cc9OwvZM.s:926: Warning: dwarf line number information for .data ignored
encrypt.c: /tmp/cc9OwvZM.s:937: Warning: dwarf line number information for .data ignored
encrypt.c: /tmp/cc9OwvZM.s:944: Warning: dwarf line number information for .data ignored
encrypt.c: /tmp/cc9OwvZM.s:947: Warning: dwarf line number information for .data ignored
encrypt.c: /tmp/cc9OwvZM.s:948: Warning: dwarf line number information for .data ignored
encrypt.c: /tmp/cc9OwvZM.s:955: Warning: dwarf line number information for .data ignored
encrypt.c: /tmp/cc9OwvZM.s:956: Warning: dwarf line number information for .data ignored
encrypt.c: /tmp/cc9OwvZM.s:959: Warning: dwarf line number information for .data ignored
encrypt.c: /tmp/cc9OwvZM.s:961: Warning: dwarf line number information for .data ignored
encrypt.c: /tmp/cc9OwvZM.s:964: Warning: dwarf line number information for .data ignored
encrypt.c: /tmp/cc9OwvZM.s:972: Warning: dwarf line number information for .data ignored
encrypt.c: /tmp/cc9OwvZM.s:983: Warning: dwarf line number information for .data ignored
encrypt.c: /tmp/cc9OwvZM.s:985: Warning: dwarf line number information for .data ignored
encrypt.c: /tmp/cc9OwvZM.s:986: Warning: dwarf line number information for .data ignored
encrypt.c: /tmp/cc9OwvZM.s:987: Warning: dwarf line number information for .data ignored
encrypt.c: /tmp/cc9OwvZM.s:994: Warning: dwarf line number information for .data ignored
encrypt.c: /tmp/cc9OwvZM.s:1001: Warning: dwarf line number information for .data ignored
encrypt.c: /tmp/cc9OwvZM.s:1004: Warning: dwarf line number information for .data ignored
encrypt.c: /tmp/cc9OwvZM.s:1009: Warning: dwarf line number information for .data ignored
encrypt.c: /tmp/cc9OwvZM.s:1014: Warning: dwarf line number information for .data ignored
encrypt.c: /tmp/cc9OwvZM.s:1017: Warning: dwarf line number information for .data ignored
encrypt.c: ...

Number of similar (implementation,compiler) pairs: 1, namely:
ImplementationCompiler
T:avx1gcc -march=native -mtune=native -O2 -fwrapv -fPIC -fPIE -gdwarf-4 -Wall (12.2.0)

Compiler output


encrypt.c: /tmp/cc1njqdt.s: Assembler messages:
encrypt.c: /tmp/cc1njqdt.s:922: Warning: dwarf line number information for .data ignored
encrypt.c: /tmp/cc1njqdt.s:924: Warning: dwarf line number information for .data ignored
encrypt.c: /tmp/cc1njqdt.s:925: Warning: dwarf line number information for .data ignored
encrypt.c: /tmp/cc1njqdt.s:926: Warning: dwarf line number information for .data ignored
encrypt.c: /tmp/cc1njqdt.s:937: Warning: dwarf line number information for .data ignored
encrypt.c: /tmp/cc1njqdt.s:944: Warning: dwarf line number information for .data ignored
encrypt.c: /tmp/cc1njqdt.s:947: Warning: dwarf line number information for .data ignored
encrypt.c: /tmp/cc1njqdt.s:948: Warning: dwarf line number information for .data ignored
encrypt.c: /tmp/cc1njqdt.s:955: Warning: dwarf line number information for .data ignored
encrypt.c: /tmp/cc1njqdt.s:956: Warning: dwarf line number information for .data ignored
encrypt.c: /tmp/cc1njqdt.s:959: Warning: dwarf line number information for .data ignored
encrypt.c: /tmp/cc1njqdt.s:961: Warning: dwarf line number information for .data ignored
encrypt.c: /tmp/cc1njqdt.s:964: Warning: dwarf line number information for .data ignored
encrypt.c: /tmp/cc1njqdt.s:972: Warning: dwarf line number information for .data ignored
encrypt.c: /tmp/cc1njqdt.s:983: Warning: dwarf line number information for .data ignored
encrypt.c: /tmp/cc1njqdt.s:985: Warning: dwarf line number information for .data ignored
encrypt.c: /tmp/cc1njqdt.s:986: Warning: dwarf line number information for .data ignored
encrypt.c: /tmp/cc1njqdt.s:987: Warning: dwarf line number information for .data ignored
encrypt.c: /tmp/cc1njqdt.s:994: Warning: dwarf line number information for .data ignored
encrypt.c: /tmp/cc1njqdt.s:1001: Warning: dwarf line number information for .data ignored
encrypt.c: /tmp/cc1njqdt.s:1004: Warning: dwarf line number information for .data ignored
encrypt.c: /tmp/cc1njqdt.s:1009: Warning: dwarf line number information for .data ignored
encrypt.c: /tmp/cc1njqdt.s:1014: Warning: dwarf line number information for .data ignored
encrypt.c: /tmp/cc1njqdt.s:1017: Warning: dwarf line number information for .data ignored
encrypt.c: ...

Number of similar (implementation,compiler) pairs: 1, namely:
ImplementationCompiler
T:avx1gcc -march=native -mtune=native -O3 -fwrapv -fPIC -fPIE -gdwarf-4 -Wall (12.2.0)

Compiler output


encrypt.c: /tmp/ccxpGaE7.s: Assembler messages:
encrypt.c: /tmp/ccxpGaE7.s:921: Warning: dwarf line number information for .data ignored
encrypt.c: /tmp/ccxpGaE7.s:923: Warning: dwarf line number information for .data ignored
encrypt.c: /tmp/ccxpGaE7.s:934: Warning: dwarf line number information for .data ignored
encrypt.c: /tmp/ccxpGaE7.s:935: Warning: dwarf line number information for .data ignored
encrypt.c: /tmp/ccxpGaE7.s:936: Warning: dwarf line number information for .data ignored
encrypt.c: /tmp/ccxpGaE7.s:943: Warning: dwarf line number information for .data ignored
encrypt.c: /tmp/ccxpGaE7.s:946: Warning: dwarf line number information for .data ignored
encrypt.c: /tmp/ccxpGaE7.s:947: Warning: dwarf line number information for .data ignored
encrypt.c: /tmp/ccxpGaE7.s:952: Warning: dwarf line number information for .data ignored
encrypt.c: /tmp/ccxpGaE7.s:953: Warning: dwarf line number information for .data ignored
encrypt.c: /tmp/ccxpGaE7.s:956: Warning: dwarf line number information for .data ignored
encrypt.c: /tmp/ccxpGaE7.s:958: Warning: dwarf line number information for .data ignored
encrypt.c: /tmp/ccxpGaE7.s:961: Warning: dwarf line number information for .data ignored
encrypt.c: /tmp/ccxpGaE7.s:969: Warning: dwarf line number information for .data ignored
encrypt.c: /tmp/ccxpGaE7.s:979: Warning: dwarf line number information for .data ignored
encrypt.c: /tmp/ccxpGaE7.s:981: Warning: dwarf line number information for .data ignored
encrypt.c: /tmp/ccxpGaE7.s:993: Warning: dwarf line number information for .data ignored
encrypt.c: /tmp/ccxpGaE7.s:997: Warning: dwarf line number information for .data ignored
encrypt.c: /tmp/ccxpGaE7.s:998: Warning: dwarf line number information for .data ignored
encrypt.c: /tmp/ccxpGaE7.s:999: Warning: dwarf line number information for .data ignored
encrypt.c: /tmp/ccxpGaE7.s:1006: Warning: dwarf line number information for .data ignored
encrypt.c: /tmp/ccxpGaE7.s:1009: Warning: dwarf line number information for .data ignored
encrypt.c: /tmp/ccxpGaE7.s:1012: Warning: dwarf line number information for .data ignored
encrypt.c: /tmp/ccxpGaE7.s:1015: Warning: dwarf line number information for .data ignored
encrypt.c: ...

Number of similar (implementation,compiler) pairs: 1, namely:
ImplementationCompiler
T:avx1gcc -march=native -mtune=native -O -fwrapv -fPIC -fPIE -gdwarf-4 -Wall (12.2.0)

Compiler output


encrypt.c: /tmp/ccTuz9Bd.s: Assembler messages:
encrypt.c: /tmp/ccTuz9Bd.s:921: Warning: dwarf line number information for .data ignored
encrypt.c: /tmp/ccTuz9Bd.s:923: Warning: dwarf line number information for .data ignored
encrypt.c: /tmp/ccTuz9Bd.s:924: Warning: dwarf line number information for .data ignored
encrypt.c: /tmp/ccTuz9Bd.s:925: Warning: dwarf line number information for .data ignored
encrypt.c: /tmp/ccTuz9Bd.s:936: Warning: dwarf line number information for .data ignored
encrypt.c: /tmp/ccTuz9Bd.s:943: Warning: dwarf line number information for .data ignored
encrypt.c: /tmp/ccTuz9Bd.s:946: Warning: dwarf line number information for .data ignored
encrypt.c: /tmp/ccTuz9Bd.s:947: Warning: dwarf line number information for .data ignored
encrypt.c: /tmp/ccTuz9Bd.s:954: Warning: dwarf line number information for .data ignored
encrypt.c: /tmp/ccTuz9Bd.s:955: Warning: dwarf line number information for .data ignored
encrypt.c: /tmp/ccTuz9Bd.s:958: Warning: dwarf line number information for .data ignored
encrypt.c: /tmp/ccTuz9Bd.s:960: Warning: dwarf line number information for .data ignored
encrypt.c: /tmp/ccTuz9Bd.s:963: Warning: dwarf line number information for .data ignored
encrypt.c: /tmp/ccTuz9Bd.s:971: Warning: dwarf line number information for .data ignored
encrypt.c: /tmp/ccTuz9Bd.s:981: Warning: dwarf line number information for .data ignored
encrypt.c: /tmp/ccTuz9Bd.s:983: Warning: dwarf line number information for .data ignored
encrypt.c: /tmp/ccTuz9Bd.s:984: Warning: dwarf line number information for .data ignored
encrypt.c: /tmp/ccTuz9Bd.s:985: Warning: dwarf line number information for .data ignored
encrypt.c: /tmp/ccTuz9Bd.s:992: Warning: dwarf line number information for .data ignored
encrypt.c: /tmp/ccTuz9Bd.s:999: Warning: dwarf line number information for .data ignored
encrypt.c: /tmp/ccTuz9Bd.s:1002: Warning: dwarf line number information for .data ignored
encrypt.c: /tmp/ccTuz9Bd.s:1005: Warning: dwarf line number information for .data ignored
encrypt.c: /tmp/ccTuz9Bd.s:1012: Warning: dwarf line number information for .data ignored
encrypt.c: /tmp/ccTuz9Bd.s:1015: Warning: dwarf line number information for .data ignored
encrypt.c: ...

Number of similar (implementation,compiler) pairs: 1, namely:
ImplementationCompiler
T:avx1gcc -march=native -mtune=native -Os -fwrapv -fPIC -fPIE -gdwarf-4 -Wall (12.2.0)

Compiler output


try.c: /usr/bin/ld: libcrypto_aead_omdsha256k128n96tau96v1.a(omdsha256.o):.../supercop-data/know/amd64/try/c/clang_-march=native_-O2_-fwrapv_-Qunused-arguments_-fPIC_-fPIE_-gdwarf-4_-Wall/timingleaks/crypto_aead/omdsha256k128n96tau96v1/sse4/work/./omdsha256.h:137: multiple definition of `Hash'; libcrypto_aead_omdsha256k128n96tau96v1.a(encrypt.o):.../supercop-data/know/amd64/try/c/clang_-march=native_-O2_-fwrapv_-Qunused-arguments_-fPIC_-fPIE_-gdwarf-4_-Wall/timingleaks/crypto_aead/omdsha256k128n96tau96v1/sse4/work/./omdsha256.h:137: first defined here
try.c: clang: error: linker command failed with exit code 1 (use -v to see invocation)

Number of similar (implementation,compiler) pairs: 1, namely:
ImplementationCompiler
T:sse4clang -march=native -O2 -fwrapv -Qunused-arguments -fPIC -fPIE -gdwarf-4 -Wall (Debian_Clang_14.0.6)

Compiler output


try.c: /usr/bin/ld: libcrypto_aead_omdsha256k128n96tau96v1.a(omdsha256.o):.../supercop-data/know/amd64/try/c/clang_-march=native_-O3_-fwrapv_-Qunused-arguments_-fPIC_-fPIE_-gdwarf-4_-Wall/timingleaks/crypto_aead/omdsha256k128n96tau96v1/sse4/work/./omdsha256.h:137: multiple definition of `Hash'; libcrypto_aead_omdsha256k128n96tau96v1.a(encrypt.o):.../supercop-data/know/amd64/try/c/clang_-march=native_-O3_-fwrapv_-Qunused-arguments_-fPIC_-fPIE_-gdwarf-4_-Wall/timingleaks/crypto_aead/omdsha256k128n96tau96v1/sse4/work/./omdsha256.h:137: first defined here
try.c: clang: error: linker command failed with exit code 1 (use -v to see invocation)

Number of similar (implementation,compiler) pairs: 1, namely:
ImplementationCompiler
T:sse4clang -march=native -O3 -fwrapv -Qunused-arguments -fPIC -fPIE -gdwarf-4 -Wall (Debian_Clang_14.0.6)

Compiler output


try.c: /usr/bin/ld: libcrypto_aead_omdsha256k128n96tau96v1.a(omdsha256.o):.../supercop-data/know/amd64/try/c/clang_-march=native_-O_-fwrapv_-Qunused-arguments_-fPIC_-fPIE_-gdwarf-4_-Wall/timingleaks/crypto_aead/omdsha256k128n96tau96v1/sse4/work/./omdsha256.h:137: multiple definition of `Hash'; libcrypto_aead_omdsha256k128n96tau96v1.a(encrypt.o):.../supercop-data/know/amd64/try/c/clang_-march=native_-O_-fwrapv_-Qunused-arguments_-fPIC_-fPIE_-gdwarf-4_-Wall/timingleaks/crypto_aead/omdsha256k128n96tau96v1/sse4/work/./omdsha256.h:137: first defined here
try.c: clang: error: linker command failed with exit code 1 (use -v to see invocation)

Number of similar (implementation,compiler) pairs: 1, namely:
ImplementationCompiler
T:sse4clang -march=native -O -fwrapv -Qunused-arguments -fPIC -fPIE -gdwarf-4 -Wall (Debian_Clang_14.0.6)

Compiler output


try.c: /usr/bin/ld: libcrypto_aead_omdsha256k128n96tau96v1.a(omdsha256.o):.../supercop-data/know/amd64/try/c/clang_-march=native_-Os_-fwrapv_-Qunused-arguments_-fPIC_-fPIE_-gdwarf-4_-Wall/timingleaks/crypto_aead/omdsha256k128n96tau96v1/sse4/work/./omdsha256.h:137: multiple definition of `Hash'; libcrypto_aead_omdsha256k128n96tau96v1.a(encrypt.o):.../supercop-data/know/amd64/try/c/clang_-march=native_-Os_-fwrapv_-Qunused-arguments_-fPIC_-fPIE_-gdwarf-4_-Wall/timingleaks/crypto_aead/omdsha256k128n96tau96v1/sse4/work/./omdsha256.h:137: first defined here
try.c: clang: error: linker command failed with exit code 1 (use -v to see invocation)

Number of similar (implementation,compiler) pairs: 1, namely:
ImplementationCompiler
T:sse4clang -march=native -Os -fwrapv -Qunused-arguments -fPIC -fPIE -gdwarf-4 -Wall (Debian_Clang_14.0.6)

Compiler output


try.c: /usr/bin/ld: libcrypto_aead_omdsha256k128n96tau96v1.a(omdsha256.o):.../supercop-data/know/amd64/try/c/clang_-mcpu=native_-O3_-fwrapv_-Qunused-arguments_-fPIC_-fPIE_-gdwarf-4_-Wall/timingleaks/crypto_aead/omdsha256k128n96tau96v1/sse4/work/./omdsha256.h:137: multiple definition of `Hash'; libcrypto_aead_omdsha256k128n96tau96v1.a(encrypt.o):.../supercop-data/know/amd64/try/c/clang_-mcpu=native_-O3_-fwrapv_-Qunused-arguments_-fPIC_-fPIE_-gdwarf-4_-Wall/timingleaks/crypto_aead/omdsha256k128n96tau96v1/sse4/work/./omdsha256.h:137: first defined here
try.c: clang: error: linker command failed with exit code 1 (use -v to see invocation)

Number of similar (implementation,compiler) pairs: 1, namely:
ImplementationCompiler
T:sse4clang -mcpu=native -O3 -fwrapv -Qunused-arguments -fPIC -fPIE -gdwarf-4 -Wall (Debian_Clang_14.0.6)

Compiler output


encrypt.c: /tmp/ccj2CIVw.s: Assembler messages:
encrypt.c: /tmp/ccj2CIVw.s:961: Warning: dwarf line number information for .data ignored
encrypt.c: /tmp/ccj2CIVw.s:963: Warning: dwarf line number information for .data ignored
encrypt.c: /tmp/ccj2CIVw.s:964: Warning: dwarf line number information for .data ignored
encrypt.c: /tmp/ccj2CIVw.s:965: Warning: dwarf line number information for .data ignored
encrypt.c: /tmp/ccj2CIVw.s:976: Warning: dwarf line number information for .data ignored
encrypt.c: /tmp/ccj2CIVw.s:983: Warning: dwarf line number information for .data ignored
encrypt.c: /tmp/ccj2CIVw.s:986: Warning: dwarf line number information for .data ignored
encrypt.c: /tmp/ccj2CIVw.s:987: Warning: dwarf line number information for .data ignored
encrypt.c: /tmp/ccj2CIVw.s:994: Warning: dwarf line number information for .data ignored
encrypt.c: /tmp/ccj2CIVw.s:995: Warning: dwarf line number information for .data ignored
encrypt.c: /tmp/ccj2CIVw.s:998: Warning: dwarf line number information for .data ignored
encrypt.c: /tmp/ccj2CIVw.s:1000: Warning: dwarf line number information for .data ignored
encrypt.c: /tmp/ccj2CIVw.s:1003: Warning: dwarf line number information for .data ignored
encrypt.c: /tmp/ccj2CIVw.s:1011: Warning: dwarf line number information for .data ignored
encrypt.c: /tmp/ccj2CIVw.s:1022: Warning: dwarf line number information for .data ignored
encrypt.c: /tmp/ccj2CIVw.s:1024: Warning: dwarf line number information for .data ignored
encrypt.c: /tmp/ccj2CIVw.s:1025: Warning: dwarf line number information for .data ignored
encrypt.c: /tmp/ccj2CIVw.s:1026: Warning: dwarf line number information for .data ignored
encrypt.c: /tmp/ccj2CIVw.s:1033: Warning: dwarf line number information for .data ignored
encrypt.c: /tmp/ccj2CIVw.s:1040: Warning: dwarf line number information for .data ignored
encrypt.c: /tmp/ccj2CIVw.s:1043: Warning: dwarf line number information for .data ignored
encrypt.c: /tmp/ccj2CIVw.s:1048: Warning: dwarf line number information for .data ignored
encrypt.c: /tmp/ccj2CIVw.s:1053: Warning: dwarf line number information for .data ignored
encrypt.c: /tmp/ccj2CIVw.s:1056: Warning: dwarf line number information for .data ignored
encrypt.c: ...

Number of similar (implementation,compiler) pairs: 1, namely:
ImplementationCompiler
T:sse4gcc -march=native -mtune=native -O2 -fwrapv -fPIC -fPIE -gdwarf-4 -Wall (12.2.0)

Compiler output


encrypt.c: /tmp/ccRqRHyd.s: Assembler messages:
encrypt.c: /tmp/ccRqRHyd.s:961: Warning: dwarf line number information for .data ignored
encrypt.c: /tmp/ccRqRHyd.s:963: Warning: dwarf line number information for .data ignored
encrypt.c: /tmp/ccRqRHyd.s:964: Warning: dwarf line number information for .data ignored
encrypt.c: /tmp/ccRqRHyd.s:965: Warning: dwarf line number information for .data ignored
encrypt.c: /tmp/ccRqRHyd.s:976: Warning: dwarf line number information for .data ignored
encrypt.c: /tmp/ccRqRHyd.s:983: Warning: dwarf line number information for .data ignored
encrypt.c: /tmp/ccRqRHyd.s:986: Warning: dwarf line number information for .data ignored
encrypt.c: /tmp/ccRqRHyd.s:987: Warning: dwarf line number information for .data ignored
encrypt.c: /tmp/ccRqRHyd.s:994: Warning: dwarf line number information for .data ignored
encrypt.c: /tmp/ccRqRHyd.s:995: Warning: dwarf line number information for .data ignored
encrypt.c: /tmp/ccRqRHyd.s:998: Warning: dwarf line number information for .data ignored
encrypt.c: /tmp/ccRqRHyd.s:1000: Warning: dwarf line number information for .data ignored
encrypt.c: /tmp/ccRqRHyd.s:1003: Warning: dwarf line number information for .data ignored
encrypt.c: /tmp/ccRqRHyd.s:1011: Warning: dwarf line number information for .data ignored
encrypt.c: /tmp/ccRqRHyd.s:1022: Warning: dwarf line number information for .data ignored
encrypt.c: /tmp/ccRqRHyd.s:1024: Warning: dwarf line number information for .data ignored
encrypt.c: /tmp/ccRqRHyd.s:1025: Warning: dwarf line number information for .data ignored
encrypt.c: /tmp/ccRqRHyd.s:1026: Warning: dwarf line number information for .data ignored
encrypt.c: /tmp/ccRqRHyd.s:1033: Warning: dwarf line number information for .data ignored
encrypt.c: /tmp/ccRqRHyd.s:1040: Warning: dwarf line number information for .data ignored
encrypt.c: /tmp/ccRqRHyd.s:1043: Warning: dwarf line number information for .data ignored
encrypt.c: /tmp/ccRqRHyd.s:1048: Warning: dwarf line number information for .data ignored
encrypt.c: /tmp/ccRqRHyd.s:1053: Warning: dwarf line number information for .data ignored
encrypt.c: /tmp/ccRqRHyd.s:1056: Warning: dwarf line number information for .data ignored
encrypt.c: ...

Number of similar (implementation,compiler) pairs: 1, namely:
ImplementationCompiler
T:sse4gcc -march=native -mtune=native -O3 -fwrapv -fPIC -fPIE -gdwarf-4 -Wall (12.2.0)

Compiler output


encrypt.c: /tmp/ccaLYytl.s: Assembler messages:
encrypt.c: /tmp/ccaLYytl.s:960: Warning: dwarf line number information for .data ignored
encrypt.c: /tmp/ccaLYytl.s:962: Warning: dwarf line number information for .data ignored
encrypt.c: /tmp/ccaLYytl.s:973: Warning: dwarf line number information for .data ignored
encrypt.c: /tmp/ccaLYytl.s:974: Warning: dwarf line number information for .data ignored
encrypt.c: /tmp/ccaLYytl.s:975: Warning: dwarf line number information for .data ignored
encrypt.c: /tmp/ccaLYytl.s:982: Warning: dwarf line number information for .data ignored
encrypt.c: /tmp/ccaLYytl.s:985: Warning: dwarf line number information for .data ignored
encrypt.c: /tmp/ccaLYytl.s:986: Warning: dwarf line number information for .data ignored
encrypt.c: /tmp/ccaLYytl.s:991: Warning: dwarf line number information for .data ignored
encrypt.c: /tmp/ccaLYytl.s:992: Warning: dwarf line number information for .data ignored
encrypt.c: /tmp/ccaLYytl.s:995: Warning: dwarf line number information for .data ignored
encrypt.c: /tmp/ccaLYytl.s:997: Warning: dwarf line number information for .data ignored
encrypt.c: /tmp/ccaLYytl.s:1000: Warning: dwarf line number information for .data ignored
encrypt.c: /tmp/ccaLYytl.s:1008: Warning: dwarf line number information for .data ignored
encrypt.c: /tmp/ccaLYytl.s:1018: Warning: dwarf line number information for .data ignored
encrypt.c: /tmp/ccaLYytl.s:1020: Warning: dwarf line number information for .data ignored
encrypt.c: /tmp/ccaLYytl.s:1032: Warning: dwarf line number information for .data ignored
encrypt.c: /tmp/ccaLYytl.s:1036: Warning: dwarf line number information for .data ignored
encrypt.c: /tmp/ccaLYytl.s:1037: Warning: dwarf line number information for .data ignored
encrypt.c: /tmp/ccaLYytl.s:1038: Warning: dwarf line number information for .data ignored
encrypt.c: /tmp/ccaLYytl.s:1045: Warning: dwarf line number information for .data ignored
encrypt.c: /tmp/ccaLYytl.s:1048: Warning: dwarf line number information for .data ignored
encrypt.c: /tmp/ccaLYytl.s:1051: Warning: dwarf line number information for .data ignored
encrypt.c: /tmp/ccaLYytl.s:1054: Warning: dwarf line number information for .data ignored
encrypt.c: ...

Number of similar (implementation,compiler) pairs: 1, namely:
ImplementationCompiler
T:sse4gcc -march=native -mtune=native -O -fwrapv -fPIC -fPIE -gdwarf-4 -Wall (12.2.0)

Compiler output


encrypt.c: /tmp/ccZ8WmuX.s: Assembler messages:
encrypt.c: /tmp/ccZ8WmuX.s:960: Warning: dwarf line number information for .data ignored
encrypt.c: /tmp/ccZ8WmuX.s:962: Warning: dwarf line number information for .data ignored
encrypt.c: /tmp/ccZ8WmuX.s:963: Warning: dwarf line number information for .data ignored
encrypt.c: /tmp/ccZ8WmuX.s:964: Warning: dwarf line number information for .data ignored
encrypt.c: /tmp/ccZ8WmuX.s:975: Warning: dwarf line number information for .data ignored
encrypt.c: /tmp/ccZ8WmuX.s:982: Warning: dwarf line number information for .data ignored
encrypt.c: /tmp/ccZ8WmuX.s:985: Warning: dwarf line number information for .data ignored
encrypt.c: /tmp/ccZ8WmuX.s:986: Warning: dwarf line number information for .data ignored
encrypt.c: /tmp/ccZ8WmuX.s:993: Warning: dwarf line number information for .data ignored
encrypt.c: /tmp/ccZ8WmuX.s:994: Warning: dwarf line number information for .data ignored
encrypt.c: /tmp/ccZ8WmuX.s:997: Warning: dwarf line number information for .data ignored
encrypt.c: /tmp/ccZ8WmuX.s:999: Warning: dwarf line number information for .data ignored
encrypt.c: /tmp/ccZ8WmuX.s:1002: Warning: dwarf line number information for .data ignored
encrypt.c: /tmp/ccZ8WmuX.s:1010: Warning: dwarf line number information for .data ignored
encrypt.c: /tmp/ccZ8WmuX.s:1020: Warning: dwarf line number information for .data ignored
encrypt.c: /tmp/ccZ8WmuX.s:1022: Warning: dwarf line number information for .data ignored
encrypt.c: /tmp/ccZ8WmuX.s:1023: Warning: dwarf line number information for .data ignored
encrypt.c: /tmp/ccZ8WmuX.s:1024: Warning: dwarf line number information for .data ignored
encrypt.c: /tmp/ccZ8WmuX.s:1031: Warning: dwarf line number information for .data ignored
encrypt.c: /tmp/ccZ8WmuX.s:1038: Warning: dwarf line number information for .data ignored
encrypt.c: /tmp/ccZ8WmuX.s:1041: Warning: dwarf line number information for .data ignored
encrypt.c: /tmp/ccZ8WmuX.s:1044: Warning: dwarf line number information for .data ignored
encrypt.c: /tmp/ccZ8WmuX.s:1051: Warning: dwarf line number information for .data ignored
encrypt.c: /tmp/ccZ8WmuX.s:1054: Warning: dwarf line number information for .data ignored
encrypt.c: ...

Number of similar (implementation,compiler) pairs: 1, namely:
ImplementationCompiler
T:sse4gcc -march=native -mtune=native -Os -fwrapv -fPIC -fPIE -gdwarf-4 -Wall (12.2.0)

Namespace violations


omdsha256.o calc_L_i T
omdsha256.o double_block T
omdsha256.o final_masking_associated_data T
omdsha256.o final_masking_message T
omdsha256.o hash T
omdsha256.o increment_masking_associated_data T
omdsha256.o increment_masking_message T
omdsha256.o key_func T
omdsha256.o l2b T
omdsha256.o ntz T
omdsha256.o omdsha256_process T
omdsha256.o triple_block T
omdsha256.o xor_block T
sha256.o sha256_comp T

Number of similar (implementation,compiler) pairs: 9, namely:
ImplementationCompiler
T:refclang -march=native -O2 -fwrapv -Qunused-arguments -fPIC -fPIE -gdwarf-4 -Wall (Debian_Clang_14.0.6)
T:refclang -march=native -O3 -fwrapv -Qunused-arguments -fPIC -fPIE -gdwarf-4 -Wall (Debian_Clang_14.0.6)
T:refclang -march=native -O -fwrapv -Qunused-arguments -fPIC -fPIE -gdwarf-4 -Wall (Debian_Clang_14.0.6)
T:refclang -march=native -Os -fwrapv -Qunused-arguments -fPIC -fPIE -gdwarf-4 -Wall (Debian_Clang_14.0.6)
T:refclang -mcpu=native -O3 -fwrapv -Qunused-arguments -fPIC -fPIE -gdwarf-4 -Wall (Debian_Clang_14.0.6)
T:refgcc -march=native -mtune=native -O2 -fwrapv -fPIC -fPIE -gdwarf-4 -Wall (12.2.0)
T:refgcc -march=native -mtune=native -O3 -fwrapv -fPIC -fPIE -gdwarf-4 -Wall (12.2.0)
T:refgcc -march=native -mtune=native -O -fwrapv -fPIC -fPIE -gdwarf-4 -Wall (12.2.0)
T:refgcc -march=native -mtune=native -Os -fwrapv -fPIC -fPIE -gdwarf-4 -Wall (12.2.0)