Test results for amd64, jasper3, crypto_hashblocks/sha512

[Page version: 20250321 02:58:08]

Measurements for amd64, jasper3, crypto_hashblocks Test results for amd64, jasper3, crypto_hashblocks Test results for crypto_hashblocks/sha512
Computer: jasper3
Microarchitecture: amd64; Tremont (906c0)
Architecture: amd64
CPU ID: GenuineIntel-000906c0-20-bfebfbff
SUPERCOP version: 20250307
Operation: crypto_hashblocks
Primitive: sha512
TimeObject sizeTest sizeImplementationCompilerBenchmark dateSUPERCOP version
186863684 0 013494 804 888wflipclang -march=native -Os -fwrapv -Qunused-arguments -fPIC -fPIE -gdwarf-4 -Wall2025030920250307
191074838 0 016496 812 888compactclang -march=native -O2 -fwrapv -Qunused-arguments -fPIC -fPIE -gdwarf-4 -Wall2025030920250307
191674881 0 016872 780 952compactgcc -march=native -mtune=native -O3 -fwrapv -fPIC -fPIE -gdwarf-4 -Wall2025030920250307
194104460 0 015272 780 952compactgcc -march=native -mtune=native -O2 -fwrapv -fPIC -fPIE -gdwarf-4 -Wall2025030920250307
194385222 0 019184 812 888compactclang -march=native -O3 -fwrapv -Qunused-arguments -fPIC -fPIE -gdwarf-4 -Wall2025030920250307
195724193 0 018128 812 888wflipclang -march=native -O3 -fwrapv -Qunused-arguments -fPIC -fPIE -gdwarf-4 -Wall2025030920250307
195974380 0 014222 804 888compactclang -march=native -Os -fwrapv -Qunused-arguments -fPIC -fPIE -gdwarf-4 -Wall2025030920250307
196544398 0 014750 804 888compactclang -march=native -O -fwrapv -Qunused-arguments -fPIC -fPIE -gdwarf-4 -Wall2025030920250307
196734193 0 015824 812 888wflipclang -march=native -O2 -fwrapv -Qunused-arguments -fPIC -fPIE -gdwarf-4 -Wall2025030920250307
1969516324 0 025659 756 920inplacegcc -march=native -mtune=native -Os -fwrapv -fPIC -fPIE -gdwarf-4 -Wall2025030920250307
1979816280 0 025611 756 920refgcc -march=native -mtune=native -Os -fwrapv -fPIC -fPIE -gdwarf-4 -Wall2025030920250307
199323284 0 015208 780 952wflipgcc -march=native -mtune=native -O3 -fwrapv -fPIC -fPIE -gdwarf-4 -Wall2025030920250307
199444405 0 013779 756 920compactgcc -march=native -mtune=native -Os -fwrapv -fPIC -fPIE -gdwarf-4 -Wall2025030920250307
201364934 0 017512 812 888compactclang -mcpu=native -O3 -fwrapv -Qunused-arguments -fPIC -fPIE -gdwarf-4 -Wall2025030920250307
201403423 0 014184 780 952wflipgcc -march=native -mtune=native -O2 -fwrapv -fPIC -fPIE -gdwarf-4 -Wall2025030920250307
201803670 0 013011 756 920wflipgcc -march=native -mtune=native -Os -fwrapv -fPIC -fPIE -gdwarf-4 -Wall2025030920250307
2031717482 0 027302 804 888inplaceclang -march=native -Os -fwrapv -Qunused-arguments -fPIC -fPIE -gdwarf-4 -Wall2025030920250307
203671842 0 013480 812 888compact4clang -march=native -O2 -fwrapv -Qunused-arguments -fPIC -fPIE -gdwarf-4 -Wall2025030920250307
2057716527 0 028480 780 952inplacegcc -march=native -mtune=native -O3 -fwrapv -fPIC -fPIE -gdwarf-4 -Wall2025030920250307
205823824 0 014150 804 888wflipclang -march=native -O -fwrapv -Qunused-arguments -fPIC -fPIE -gdwarf-4 -Wall2025030920250307
2061416480 0 028400 780 952refgcc -march=native -mtune=native -O3 -fwrapv -fPIC -fPIE -gdwarf-4 -Wall2025030920250307
2063517046 0 027366 804 888refclang -march=native -O -fwrapv -Qunused-arguments -fPIC -fPIE -gdwarf-4 -Wall2025030920250307
2065417030 0 027350 804 888inplaceclang -march=native -O -fwrapv -Qunused-arguments -fPIC -fPIE -gdwarf-4 -Wall2025030920250307
2071917404 0 027222 804 888refclang -march=native -Os -fwrapv -Qunused-arguments -fPIC -fPIE -gdwarf-4 -Wall2025030920250307
207484525 0 014935 772 952compactgcc -march=native -mtune=native -O -fwrapv -fPIC -fPIE -gdwarf-4 -Wall2025030920250307
211071394 0 011222 804 888compact4clang -march=native -Os -fwrapv -Qunused-arguments -fPIC -fPIE -gdwarf-4 -Wall2025030920250307
2117416580 0 027320 780 952refgcc -march=native -mtune=native -O2 -fwrapv -fPIC -fPIE -gdwarf-4 -Wall2025030920250307
2118716720 0 027496 780 952inplacegcc -march=native -mtune=native -O2 -fwrapv -fPIC -fPIE -gdwarf-4 -Wall2025030920250307
215723869 0 016424 812 888wflipclang -mcpu=native -O3 -fwrapv -Qunused-arguments -fPIC -fPIE -gdwarf-4 -Wall2025030920250307
216172134 0 016072 812 888compact4clang -march=native -O3 -fwrapv -Qunused-arguments -fPIC -fPIE -gdwarf-4 -Wall2025030920250307
2165816583 0 026943 772 952inplacegcc -march=native -mtune=native -O -fwrapv -fPIC -fPIE -gdwarf-4 -Wall2025030920250307
222145497 0 015823 772 952wflipgcc -march=native -mtune=native -O -fwrapv -fPIC -fPIE -gdwarf-4 -Wall2025030920250307
222581366 0 011702 804 888compact4clang -march=native -O -fwrapv -Qunused-arguments -fPIC -fPIE -gdwarf-4 -Wall2025030920250307
2234017045 0 027375 772 952refgcc -march=native -mtune=native -O -fwrapv -fPIC -fPIE -gdwarf-4 -Wall2025030920250307
224301846 0 014400 812 888compact4clang -mcpu=native -O3 -fwrapv -Qunused-arguments -fPIC -fPIE -gdwarf-4 -Wall2025030920250307
225831469 0 012280 780 952compact4gcc -march=native -mtune=native -O2 -fwrapv -fPIC -fPIE -gdwarf-4 -Wall2025030920250307
227621321 0 010683 756 920compact4gcc -march=native -mtune=native -Os -fwrapv -fPIC -fPIE -gdwarf-4 -Wall2025030920250307
244202100 0 014064 780 952compact4gcc -march=native -mtune=native -O3 -fwrapv -fPIC -fPIE -gdwarf-4 -Wall2025030920250307
2474518319 0 030864 812 888inplaceclang -mcpu=native -O3 -fwrapv -Qunused-arguments -fPIC -fPIE -gdwarf-4 -Wall2025030920250307
2475118373 0 030912 812 888refclang -mcpu=native -O3 -fwrapv -Qunused-arguments -fPIC -fPIE -gdwarf-4 -Wall2025030920250307
2484518111 0 029736 812 888inplaceclang -march=native -O2 -fwrapv -Qunused-arguments -fPIC -fPIE -gdwarf-4 -Wall2025030920250307
2484818056 0 031976 812 888refclang -march=native -O3 -fwrapv -Qunused-arguments -fPIC -fPIE -gdwarf-4 -Wall2025030920250307
2487418111 0 032040 812 888inplaceclang -march=native -O3 -fwrapv -Qunused-arguments -fPIC -fPIE -gdwarf-4 -Wall2025030920250307
2498518056 0 029672 812 888refclang -march=native -O2 -fwrapv -Qunused-arguments -fPIC -fPIE -gdwarf-4 -Wall2025030920250307
251221472 0 011855 772 952compact4gcc -march=native -mtune=native -O -fwrapv -fPIC -fPIE -gdwarf-4 -Wall2025030920250307
281172733 0 016688 812 888compact2clang -march=native -O3 -fwrapv -Qunused-arguments -fPIC -fPIE -gdwarf-4 -Wall2025030920250307
282422381 0 014032 812 888compact2clang -march=native -O2 -fwrapv -Qunused-arguments -fPIC -fPIE -gdwarf-4 -Wall2025030920250307
288052474 0 015048 812 888compact2clang -mcpu=native -O3 -fwrapv -Qunused-arguments -fPIC -fPIE -gdwarf-4 -Wall2025030920250307
288531662 0 012014 804 888compact2clang -march=native -O -fwrapv -Qunused-arguments -fPIC -fPIE -gdwarf-4 -Wall2025030920250307
288581391 0 011222 804 888compact3clang -march=native -Os -fwrapv -Qunused-arguments -fPIC -fPIE -gdwarf-4 -Wall2025030920250307
292741853 0 013496 812 888compact3clang -march=native -O2 -fwrapv -Qunused-arguments -fPIC -fPIE -gdwarf-4 -Wall2025030920250307
295132129 0 016072 812 888compact3clang -march=native -O3 -fwrapv -Qunused-arguments -fPIC -fPIE -gdwarf-4 -Wall2025030920250307
298101547 0 011390 804 888compact2clang -march=native -Os -fwrapv -Qunused-arguments -fPIC -fPIE -gdwarf-4 -Wall2025030920250307
299321494 0 011830 804 888compact3clang -march=native -O -fwrapv -Qunused-arguments -fPIC -fPIE -gdwarf-4 -Wall2025030920250307
302271856 0 014416 812 888compact3clang -mcpu=native -O3 -fwrapv -Qunused-arguments -fPIC -fPIE -gdwarf-4 -Wall2025030920250307
321072161 0 014152 780 952compact2gcc -march=native -mtune=native -O3 -fwrapv -fPIC -fPIE -gdwarf-4 -Wall2025030920250307
323661740 0 012552 780 952compact2gcc -march=native -mtune=native -O2 -fwrapv -fPIC -fPIE -gdwarf-4 -Wall2025030920250307
338851672 0 011043 756 920compact2gcc -march=native -mtune=native -Os -fwrapv -fPIC -fPIE -gdwarf-4 -Wall2025030920250307
345181787 0 012199 772 952compact2gcc -march=native -mtune=native -O -fwrapv -fPIC -fPIE -gdwarf-4 -Wall2025030920250307
347571642 0 012456 780 952compact3gcc -march=native -mtune=native -O2 -fwrapv -fPIC -fPIE -gdwarf-4 -Wall2025030920250307
352092148 0 014112 780 952compact3gcc -march=native -mtune=native -O3 -fwrapv -fPIC -fPIE -gdwarf-4 -Wall2025030920250307
357571448 0 010811 756 920compact3gcc -march=native -mtune=native -Os -fwrapv -fPIC -fPIE -gdwarf-4 -Wall2025030920250307
370901621 0 012015 772 952compact3gcc -march=native -mtune=native -O -fwrapv -fPIC -fPIE -gdwarf-4 -Wall2025030920250307

Test failure


error 132
Illegal instruction

Number of similar (implementation,compiler) pairs: 9, namely:
ImplementationCompiler
avx2clang -march=native -O2 -fwrapv -Qunused-arguments -fPIC -fPIE -gdwarf-4 -Wall (Debian_Clang_11.0.1)
avx2clang -march=native -O3 -fwrapv -Qunused-arguments -fPIC -fPIE -gdwarf-4 -Wall (Debian_Clang_11.0.1)
avx2clang -march=native -O -fwrapv -Qunused-arguments -fPIC -fPIE -gdwarf-4 -Wall (Debian_Clang_11.0.1)
avx2clang -march=native -Os -fwrapv -Qunused-arguments -fPIC -fPIE -gdwarf-4 -Wall (Debian_Clang_11.0.1)
avx2clang -mcpu=native -O3 -fwrapv -Qunused-arguments -fPIC -fPIE -gdwarf-4 -Wall (Debian_Clang_11.0.1)
avx2gcc -march=native -mtune=native -O2 -fwrapv -fPIC -fPIE -gdwarf-4 -Wall (10.2.1_20210110)
avx2gcc -march=native -mtune=native -O3 -fwrapv -fPIC -fPIE -gdwarf-4 -Wall (10.2.1_20210110)
avx2gcc -march=native -mtune=native -O -fwrapv -fPIC -fPIE -gdwarf-4 -Wall (10.2.1_20210110)
avx2gcc -march=native -mtune=native -Os -fwrapv -fPIC -fPIE -gdwarf-4 -Wall (10.2.1_20210110)

Compiler output


inner.c: inner.c:88:14: error: always_inline function '_mm256_loadu_si256' requires target feature 'avx', but would be inlined into function 'crypto_hashblocks_sha512_avx_constbranchindex_inner' that is compiled without support for 'avx'
inner.c:         X0 = _mm256_loadu_si256((void *) (in+0));
inner.c:              ^
inner.c: inner.c:88:14: error: AVX vector return of type '__m256i' (vector of 4 'long long' values) without 'avx' enabled changes the ABI
inner.c: inner.c:89:37: error: always_inline function '_mm256_set_epi8' requires target feature 'avx', but would be inlined into function 'crypto_hashblocks_sha512_avx_constbranchindex_inner' that is compiled without support for 'avx'
inner.c:         X0 = _mm256_shuffle_epi8(X0,bigendian64);
inner.c:                                     ^
inner.c: inner.c:26:21: note: expanded from macro 'bigendian64'
inner.c: #define bigendian64 _mm256_set_epi8(8,9,10,11,12,13,14,15,0,1,2,3,4,5,6,7,8,9,10,11,12,13,14,15,0,1,2,3,4,5,6,7)
inner.c:                     ^
inner.c: inner.c:89:37: error: AVX vector return of type '__m256i' (vector of 4 'long long' values) without 'avx' enabled changes the ABI
inner.c: inner.c:26:21: note: expanded from macro 'bigendian64'
inner.c: #define bigendian64 _mm256_set_epi8(8,9,10,11,12,13,14,15,0,1,2,3,4,5,6,7,8,9,10,11,12,13,14,15,0,1,2,3,4,5,6,7)
inner.c:                     ^
inner.c: inner.c:89:14: error: always_inline function '_mm256_shuffle_epi8' requires target feature 'avx2', but would be inlined into function 'crypto_hashblocks_sha512_avx_constbranchindex_inner' that is compiled without support for 'avx2'
inner.c:         X0 = _mm256_shuffle_epi8(X0,bigendian64);
inner.c:              ^
inner.c: inner.c:89:14: error: AVX vector argument of type '__m256i' (vector of 4 'long long' values) without 'avx' enabled changes the ABI
inner.c: inner.c:90:14: error: always_inline function '_mm256_loadu_si256' requires target feature 'avx', but would be inlined into function 'crypto_hashblocks_sha512_avx_constbranchindex_inner' that is compiled without support for 'avx'
inner.c:         D0 = _mm256_loadu_si256((void *) &constants[0]);
inner.c:              ^
inner.c: inner.c:90:14: error: AVX vector return of type '__m256i' (vector of 4 'long long' values) without 'avx' enabled changes the ABI
inner.c: inner.c:91:14: error: always_inline function '_mm256_add_epi64' requires target feature 'avx2', but would be inlined into function 'crypto_hashblocks_sha512_avx_constbranchindex_inner' that is compiled without support for 'avx2'
inner.c:         D0 = _mm256_add_epi64(X0,D0);
inner.c:              ^
inner.c: ...

Number of similar (implementation,compiler) pairs: 5, namely:
ImplementationCompiler
avxclang -march=native -O2 -fwrapv -Qunused-arguments -fPIC -fPIE -gdwarf-4 -Wall (Debian_Clang_11.0.1)
avxclang -march=native -O3 -fwrapv -Qunused-arguments -fPIC -fPIE -gdwarf-4 -Wall (Debian_Clang_11.0.1)
avxclang -march=native -O -fwrapv -Qunused-arguments -fPIC -fPIE -gdwarf-4 -Wall (Debian_Clang_11.0.1)
avxclang -march=native -Os -fwrapv -Qunused-arguments -fPIC -fPIE -gdwarf-4 -Wall (Debian_Clang_11.0.1)
avxclang -mcpu=native -O3 -fwrapv -Qunused-arguments -fPIC -fPIE -gdwarf-4 -Wall (Debian_Clang_11.0.1)

Compiler output


inner.c: inner.c: In function 'crypto_hashblocks_sha512_avx_constbranchindex_inner':
inner.c: inner.c:88:12: warning: AVX vector return without AVX enabled changes the ABI [-Wpsabi]
inner.c:    88 |         X0 = _mm256_loadu_si256((void *) (in+0));
inner.c:       |         ~~~^~~~~~~~~~~~~~~~~~~~~~~~~~~~~~~~~~~~~
inner.c: In file included from /usr/lib/gcc/x86_64-linux-gnu/10/include/immintrin.h:53,
inner.c:                  from inner.c:3:
inner.c: /usr/lib/gcc/x86_64-linux-gnu/10/include/avx2intrin.h:126:1: error: inlining failed in call to 'always_inline' '_mm256_add_epi64': target specific option mismatch
inner.c:   126 | _mm256_add_epi64 (__m256i __A, __m256i __B)
inner.c:       | ^~~~~~~~~~~~~~~~
inner.c: inner.c:122:15: note: called from here
inner.c:   122 |         D12 = _mm256_add_epi64(X12,D12);
inner.c:       |               ^~~~~~~~~~~~~~~~~~~~~~~~~
inner.c: In file included from /usr/lib/gcc/x86_64-linux-gnu/10/include/immintrin.h:51,
inner.c:                  from inner.c:3:
inner.c: /usr/lib/gcc/x86_64-linux-gnu/10/include/avxintrin.h:920:1: error: inlining failed in call to 'always_inline' '_mm256_loadu_si256': target specific option mismatch
inner.c:   920 | _mm256_loadu_si256 (__m256i_u const *__P)
inner.c:       | ^~~~~~~~~~~~~~~~~~
inner.c: inner.c:121:15: note: called from here
inner.c:   121 |         D12 = _mm256_loadu_si256((void *) &constants[12]);
inner.c:       |               ^~~~~~~~~~~~~~~~~~~~~~~~~~~~~~~~~~~~~~~~~~~
inner.c: In file included from /usr/lib/gcc/x86_64-linux-gnu/10/include/immintrin.h:53,
inner.c:                  from inner.c:3:
inner.c: /usr/lib/gcc/x86_64-linux-gnu/10/include/avx2intrin.h:588:1: error: inlining failed in call to 'always_inline' '_mm256_shuffle_epi8': target specific option mismatch
inner.c:   588 | _mm256_shuffle_epi8 (__m256i __X, __m256i __Y)
inner.c:       | ^~~~~~~~~~~~~~~~~~~
inner.c: ...

Number of similar (implementation,compiler) pairs: 4, namely:
ImplementationCompiler
avxgcc -march=native -mtune=native -O2 -fwrapv -fPIC -fPIE -gdwarf-4 -Wall (10.2.1_20210110)
avxgcc -march=native -mtune=native -O3 -fwrapv -fPIC -fPIE -gdwarf-4 -Wall (10.2.1_20210110)
avxgcc -march=native -mtune=native -O -fwrapv -fPIC -fPIE -gdwarf-4 -Wall (10.2.1_20210110)
avxgcc -march=native -mtune=native -Os -fwrapv -fPIC -fPIE -gdwarf-4 -Wall (10.2.1_20210110)

Compiler output


try.c: /usr/bin/ld: libcrypto_hashblocks_sha512.a(blocks.o): in function `crypto_hashblocks_sha512_dolbeau_intelavx2rorxasm_constbranchindex':
try.c: .../supercop-data/jasper3/amd64/try/c/clang_-march=native_-O2_-fwrapv_-Qunused-arguments_-fPIC_-fPIE_-gdwarf-4_-Wall/constbranchindex/crypto_hashblocks/sha512/dolbeau/intelavx2rorxasm/work/blocks.c:45: undefined reference to `sha512_rorx'
try.c: clang: error: linker command failed with exit code 1 (use -v to see invocation)

Number of similar (implementation,compiler) pairs: 1, namely:
ImplementationCompiler
dolbeau/intelavx2rorxasmclang -march=native -O2 -fwrapv -Qunused-arguments -fPIC -fPIE -gdwarf-4 -Wall (Debian_Clang_11.0.1)

Compiler output


try.c: /usr/bin/ld: libcrypto_hashblocks_sha512.a(blocks.o): in function `crypto_hashblocks_sha512_dolbeau_intelavx2rorxasm_constbranchindex':
try.c: .../supercop-data/jasper3/amd64/try/c/clang_-march=native_-O3_-fwrapv_-Qunused-arguments_-fPIC_-fPIE_-gdwarf-4_-Wall/constbranchindex/crypto_hashblocks/sha512/dolbeau/intelavx2rorxasm/work/blocks.c:45: undefined reference to `sha512_rorx'
try.c: clang: error: linker command failed with exit code 1 (use -v to see invocation)

Number of similar (implementation,compiler) pairs: 1, namely:
ImplementationCompiler
dolbeau/intelavx2rorxasmclang -march=native -O3 -fwrapv -Qunused-arguments -fPIC -fPIE -gdwarf-4 -Wall (Debian_Clang_11.0.1)

Compiler output


try.c: /usr/bin/ld: libcrypto_hashblocks_sha512.a(blocks.o): in function `crypto_hashblocks_sha512_dolbeau_intelavx2rorxasm_constbranchindex':
try.c: .../supercop-data/jasper3/amd64/try/c/clang_-march=native_-O_-fwrapv_-Qunused-arguments_-fPIC_-fPIE_-gdwarf-4_-Wall/constbranchindex/crypto_hashblocks/sha512/dolbeau/intelavx2rorxasm/work/blocks.c:45: undefined reference to `sha512_rorx'
try.c: clang: error: linker command failed with exit code 1 (use -v to see invocation)

Number of similar (implementation,compiler) pairs: 1, namely:
ImplementationCompiler
dolbeau/intelavx2rorxasmclang -march=native -O -fwrapv -Qunused-arguments -fPIC -fPIE -gdwarf-4 -Wall (Debian_Clang_11.0.1)

Compiler output


try.c: /usr/bin/ld: libcrypto_hashblocks_sha512.a(blocks.o): in function `crypto_hashblocks_sha512_dolbeau_intelavx2rorxasm_constbranchindex':
try.c: .../supercop-data/jasper3/amd64/try/c/clang_-march=native_-Os_-fwrapv_-Qunused-arguments_-fPIC_-fPIE_-gdwarf-4_-Wall/constbranchindex/crypto_hashblocks/sha512/dolbeau/intelavx2rorxasm/work/blocks.c:45: undefined reference to `sha512_rorx'
try.c: clang: error: linker command failed with exit code 1 (use -v to see invocation)

Number of similar (implementation,compiler) pairs: 1, namely:
ImplementationCompiler
dolbeau/intelavx2rorxasmclang -march=native -Os -fwrapv -Qunused-arguments -fPIC -fPIE -gdwarf-4 -Wall (Debian_Clang_11.0.1)

Compiler output


try.c: /usr/bin/ld: libcrypto_hashblocks_sha512.a(blocks.o): in function `crypto_hashblocks_sha512_dolbeau_intelavx2rorxasm_constbranchindex':
try.c: .../supercop-data/jasper3/amd64/try/c/clang_-mcpu=native_-O3_-fwrapv_-Qunused-arguments_-fPIC_-fPIE_-gdwarf-4_-Wall/constbranchindex/crypto_hashblocks/sha512/dolbeau/intelavx2rorxasm/work/blocks.c:45: undefined reference to `sha512_rorx'
try.c: clang: error: linker command failed with exit code 1 (use -v to see invocation)

Number of similar (implementation,compiler) pairs: 1, namely:
ImplementationCompiler
dolbeau/intelavx2rorxasmclang -mcpu=native -O3 -fwrapv -Qunused-arguments -fPIC -fPIE -gdwarf-4 -Wall (Debian_Clang_11.0.1)

Compiler output


try.c: /usr/bin/ld: libcrypto_hashblocks_sha512.a(blocks.o): in function `crypto_hashblocks_sha512_dolbeau_intelavx2rorxasm_constbranchindex':
try.c: .../supercop-data/jasper3/amd64/try/c/gcc_-march=native_-mtune=native_-O2_-fwrapv_-fPIC_-fPIE_-gdwarf-4_-Wall/constbranchindex/crypto_hashblocks/sha512/dolbeau/intelavx2rorxasm/work/blocks.c:45: undefined reference to `sha512_rorx'
try.c: collect2: error: ld returned 1 exit status

Number of similar (implementation,compiler) pairs: 1, namely:
ImplementationCompiler
dolbeau/intelavx2rorxasmgcc -march=native -mtune=native -O2 -fwrapv -fPIC -fPIE -gdwarf-4 -Wall (10.2.1_20210110)

Compiler output


try.c: /usr/bin/ld: libcrypto_hashblocks_sha512.a(blocks.o): in function `crypto_hashblocks_sha512_dolbeau_intelavx2rorxasm_constbranchindex':
try.c: .../supercop-data/jasper3/amd64/try/c/gcc_-march=native_-mtune=native_-O3_-fwrapv_-fPIC_-fPIE_-gdwarf-4_-Wall/constbranchindex/crypto_hashblocks/sha512/dolbeau/intelavx2rorxasm/work/blocks.c:45: undefined reference to `sha512_rorx'
try.c: collect2: error: ld returned 1 exit status

Number of similar (implementation,compiler) pairs: 1, namely:
ImplementationCompiler
dolbeau/intelavx2rorxasmgcc -march=native -mtune=native -O3 -fwrapv -fPIC -fPIE -gdwarf-4 -Wall (10.2.1_20210110)

Compiler output


try.c: /usr/bin/ld: libcrypto_hashblocks_sha512.a(blocks.o): in function `crypto_hashblocks_sha512_dolbeau_intelavx2rorxasm_constbranchindex':
try.c: .../supercop-data/jasper3/amd64/try/c/gcc_-march=native_-mtune=native_-O_-fwrapv_-fPIC_-fPIE_-gdwarf-4_-Wall/constbranchindex/crypto_hashblocks/sha512/dolbeau/intelavx2rorxasm/work/blocks.c:45: undefined reference to `sha512_rorx'
try.c: collect2: error: ld returned 1 exit status

Number of similar (implementation,compiler) pairs: 1, namely:
ImplementationCompiler
dolbeau/intelavx2rorxasmgcc -march=native -mtune=native -O -fwrapv -fPIC -fPIE -gdwarf-4 -Wall (10.2.1_20210110)

Compiler output


try.c: /usr/bin/ld: libcrypto_hashblocks_sha512.a(blocks.o): in function `crypto_hashblocks_sha512_dolbeau_intelavx2rorxasm_constbranchindex':
try.c: .../supercop-data/jasper3/amd64/try/c/gcc_-march=native_-mtune=native_-Os_-fwrapv_-fPIC_-fPIE_-gdwarf-4_-Wall/constbranchindex/crypto_hashblocks/sha512/dolbeau/intelavx2rorxasm/work/blocks.c:45: undefined reference to `sha512_rorx'
try.c: collect2: error: ld returned 1 exit status

Number of similar (implementation,compiler) pairs: 1, namely:
ImplementationCompiler
dolbeau/intelavx2rorxasmgcc -march=native -mtune=native -Os -fwrapv -fPIC -fPIE -gdwarf-4 -Wall (10.2.1_20210110)

Compiler output


try.c: /usr/bin/ld: libcrypto_hashblocks_sha512.a(blocks.o): in function `crypto_hashblocks_sha512_dolbeau_intelavxasm_constbranchindex':
try.c: .../supercop-data/jasper3/amd64/try/c/clang_-march=native_-O2_-fwrapv_-Qunused-arguments_-fPIC_-fPIE_-gdwarf-4_-Wall/constbranchindex/crypto_hashblocks/sha512/dolbeau/intelavxasm/work/blocks.c:45: undefined reference to `sha512_avx'
try.c: clang: error: linker command failed with exit code 1 (use -v to see invocation)

Number of similar (implementation,compiler) pairs: 1, namely:
ImplementationCompiler
dolbeau/intelavxasmclang -march=native -O2 -fwrapv -Qunused-arguments -fPIC -fPIE -gdwarf-4 -Wall (Debian_Clang_11.0.1)

Compiler output


try.c: /usr/bin/ld: libcrypto_hashblocks_sha512.a(blocks.o): in function `crypto_hashblocks_sha512_dolbeau_intelavxasm_constbranchindex':
try.c: .../supercop-data/jasper3/amd64/try/c/clang_-march=native_-O3_-fwrapv_-Qunused-arguments_-fPIC_-fPIE_-gdwarf-4_-Wall/constbranchindex/crypto_hashblocks/sha512/dolbeau/intelavxasm/work/blocks.c:45: undefined reference to `sha512_avx'
try.c: clang: error: linker command failed with exit code 1 (use -v to see invocation)

Number of similar (implementation,compiler) pairs: 1, namely:
ImplementationCompiler
dolbeau/intelavxasmclang -march=native -O3 -fwrapv -Qunused-arguments -fPIC -fPIE -gdwarf-4 -Wall (Debian_Clang_11.0.1)

Compiler output


try.c: /usr/bin/ld: libcrypto_hashblocks_sha512.a(blocks.o): in function `crypto_hashblocks_sha512_dolbeau_intelavxasm_constbranchindex':
try.c: .../supercop-data/jasper3/amd64/try/c/clang_-march=native_-O_-fwrapv_-Qunused-arguments_-fPIC_-fPIE_-gdwarf-4_-Wall/constbranchindex/crypto_hashblocks/sha512/dolbeau/intelavxasm/work/blocks.c:45: undefined reference to `sha512_avx'
try.c: clang: error: linker command failed with exit code 1 (use -v to see invocation)

Number of similar (implementation,compiler) pairs: 1, namely:
ImplementationCompiler
dolbeau/intelavxasmclang -march=native -O -fwrapv -Qunused-arguments -fPIC -fPIE -gdwarf-4 -Wall (Debian_Clang_11.0.1)

Compiler output


try.c: /usr/bin/ld: libcrypto_hashblocks_sha512.a(blocks.o): in function `crypto_hashblocks_sha512_dolbeau_intelavxasm_constbranchindex':
try.c: .../supercop-data/jasper3/amd64/try/c/clang_-march=native_-Os_-fwrapv_-Qunused-arguments_-fPIC_-fPIE_-gdwarf-4_-Wall/constbranchindex/crypto_hashblocks/sha512/dolbeau/intelavxasm/work/blocks.c:45: undefined reference to `sha512_avx'
try.c: clang: error: linker command failed with exit code 1 (use -v to see invocation)

Number of similar (implementation,compiler) pairs: 1, namely:
ImplementationCompiler
dolbeau/intelavxasmclang -march=native -Os -fwrapv -Qunused-arguments -fPIC -fPIE -gdwarf-4 -Wall (Debian_Clang_11.0.1)

Compiler output


try.c: /usr/bin/ld: libcrypto_hashblocks_sha512.a(blocks.o): in function `crypto_hashblocks_sha512_dolbeau_intelavxasm_constbranchindex':
try.c: .../supercop-data/jasper3/amd64/try/c/clang_-mcpu=native_-O3_-fwrapv_-Qunused-arguments_-fPIC_-fPIE_-gdwarf-4_-Wall/constbranchindex/crypto_hashblocks/sha512/dolbeau/intelavxasm/work/blocks.c:45: undefined reference to `sha512_avx'
try.c: clang: error: linker command failed with exit code 1 (use -v to see invocation)

Number of similar (implementation,compiler) pairs: 1, namely:
ImplementationCompiler
dolbeau/intelavxasmclang -mcpu=native -O3 -fwrapv -Qunused-arguments -fPIC -fPIE -gdwarf-4 -Wall (Debian_Clang_11.0.1)

Compiler output


try.c: /usr/bin/ld: libcrypto_hashblocks_sha512.a(blocks.o): in function `crypto_hashblocks_sha512_dolbeau_intelavxasm_constbranchindex':
try.c: .../supercop-data/jasper3/amd64/try/c/gcc_-march=native_-mtune=native_-O2_-fwrapv_-fPIC_-fPIE_-gdwarf-4_-Wall/constbranchindex/crypto_hashblocks/sha512/dolbeau/intelavxasm/work/blocks.c:45: undefined reference to `sha512_avx'
try.c: collect2: error: ld returned 1 exit status

Number of similar (implementation,compiler) pairs: 1, namely:
ImplementationCompiler
dolbeau/intelavxasmgcc -march=native -mtune=native -O2 -fwrapv -fPIC -fPIE -gdwarf-4 -Wall (10.2.1_20210110)

Compiler output


try.c: /usr/bin/ld: libcrypto_hashblocks_sha512.a(blocks.o): in function `crypto_hashblocks_sha512_dolbeau_intelavxasm_constbranchindex':
try.c: .../supercop-data/jasper3/amd64/try/c/gcc_-march=native_-mtune=native_-O3_-fwrapv_-fPIC_-fPIE_-gdwarf-4_-Wall/constbranchindex/crypto_hashblocks/sha512/dolbeau/intelavxasm/work/blocks.c:45: undefined reference to `sha512_avx'
try.c: collect2: error: ld returned 1 exit status

Number of similar (implementation,compiler) pairs: 1, namely:
ImplementationCompiler
dolbeau/intelavxasmgcc -march=native -mtune=native -O3 -fwrapv -fPIC -fPIE -gdwarf-4 -Wall (10.2.1_20210110)

Compiler output


try.c: /usr/bin/ld: libcrypto_hashblocks_sha512.a(blocks.o): in function `crypto_hashblocks_sha512_dolbeau_intelavxasm_constbranchindex':
try.c: .../supercop-data/jasper3/amd64/try/c/gcc_-march=native_-mtune=native_-O_-fwrapv_-fPIC_-fPIE_-gdwarf-4_-Wall/constbranchindex/crypto_hashblocks/sha512/dolbeau/intelavxasm/work/blocks.c:45: undefined reference to `sha512_avx'
try.c: collect2: error: ld returned 1 exit status

Number of similar (implementation,compiler) pairs: 1, namely:
ImplementationCompiler
dolbeau/intelavxasmgcc -march=native -mtune=native -O -fwrapv -fPIC -fPIE -gdwarf-4 -Wall (10.2.1_20210110)

Compiler output


try.c: /usr/bin/ld: libcrypto_hashblocks_sha512.a(blocks.o): in function `crypto_hashblocks_sha512_dolbeau_intelavxasm_constbranchindex':
try.c: .../supercop-data/jasper3/amd64/try/c/gcc_-march=native_-mtune=native_-Os_-fwrapv_-fPIC_-fPIE_-gdwarf-4_-Wall/constbranchindex/crypto_hashblocks/sha512/dolbeau/intelavxasm/work/blocks.c:45: undefined reference to `sha512_avx'
try.c: collect2: error: ld returned 1 exit status

Number of similar (implementation,compiler) pairs: 1, namely:
ImplementationCompiler
dolbeau/intelavxasmgcc -march=native -mtune=native -Os -fwrapv -fPIC -fPIE -gdwarf-4 -Wall (10.2.1_20210110)

Compiler output


try.c: /usr/bin/ld: libcrypto_hashblocks_sha512.a(blocks.o): in function `crypto_hashblocks_sha512_dolbeau_intelsse4asm_constbranchindex':
try.c: .../supercop-data/jasper3/amd64/try/c/clang_-march=native_-O2_-fwrapv_-Qunused-arguments_-fPIC_-fPIE_-gdwarf-4_-Wall/constbranchindex/crypto_hashblocks/sha512/dolbeau/intelsse4asm/work/blocks.c:45: undefined reference to `sha512_sse4'
try.c: clang: error: linker command failed with exit code 1 (use -v to see invocation)

Number of similar (implementation,compiler) pairs: 1, namely:
ImplementationCompiler
dolbeau/intelsse4asmclang -march=native -O2 -fwrapv -Qunused-arguments -fPIC -fPIE -gdwarf-4 -Wall (Debian_Clang_11.0.1)

Compiler output


try.c: /usr/bin/ld: libcrypto_hashblocks_sha512.a(blocks.o): in function `crypto_hashblocks_sha512_dolbeau_intelsse4asm_constbranchindex':
try.c: .../supercop-data/jasper3/amd64/try/c/clang_-march=native_-O3_-fwrapv_-Qunused-arguments_-fPIC_-fPIE_-gdwarf-4_-Wall/constbranchindex/crypto_hashblocks/sha512/dolbeau/intelsse4asm/work/blocks.c:45: undefined reference to `sha512_sse4'
try.c: clang: error: linker command failed with exit code 1 (use -v to see invocation)

Number of similar (implementation,compiler) pairs: 1, namely:
ImplementationCompiler
dolbeau/intelsse4asmclang -march=native -O3 -fwrapv -Qunused-arguments -fPIC -fPIE -gdwarf-4 -Wall (Debian_Clang_11.0.1)

Compiler output


try.c: /usr/bin/ld: libcrypto_hashblocks_sha512.a(blocks.o): in function `crypto_hashblocks_sha512_dolbeau_intelsse4asm_constbranchindex':
try.c: .../supercop-data/jasper3/amd64/try/c/clang_-march=native_-O_-fwrapv_-Qunused-arguments_-fPIC_-fPIE_-gdwarf-4_-Wall/constbranchindex/crypto_hashblocks/sha512/dolbeau/intelsse4asm/work/blocks.c:45: undefined reference to `sha512_sse4'
try.c: clang: error: linker command failed with exit code 1 (use -v to see invocation)

Number of similar (implementation,compiler) pairs: 1, namely:
ImplementationCompiler
dolbeau/intelsse4asmclang -march=native -O -fwrapv -Qunused-arguments -fPIC -fPIE -gdwarf-4 -Wall (Debian_Clang_11.0.1)

Compiler output


try.c: /usr/bin/ld: libcrypto_hashblocks_sha512.a(blocks.o): in function `crypto_hashblocks_sha512_dolbeau_intelsse4asm_constbranchindex':
try.c: .../supercop-data/jasper3/amd64/try/c/clang_-march=native_-Os_-fwrapv_-Qunused-arguments_-fPIC_-fPIE_-gdwarf-4_-Wall/constbranchindex/crypto_hashblocks/sha512/dolbeau/intelsse4asm/work/blocks.c:45: undefined reference to `sha512_sse4'
try.c: clang: error: linker command failed with exit code 1 (use -v to see invocation)

Number of similar (implementation,compiler) pairs: 1, namely:
ImplementationCompiler
dolbeau/intelsse4asmclang -march=native -Os -fwrapv -Qunused-arguments -fPIC -fPIE -gdwarf-4 -Wall (Debian_Clang_11.0.1)

Compiler output


try.c: /usr/bin/ld: libcrypto_hashblocks_sha512.a(blocks.o): in function `crypto_hashblocks_sha512_dolbeau_intelsse4asm_constbranchindex':
try.c: .../supercop-data/jasper3/amd64/try/c/clang_-mcpu=native_-O3_-fwrapv_-Qunused-arguments_-fPIC_-fPIE_-gdwarf-4_-Wall/constbranchindex/crypto_hashblocks/sha512/dolbeau/intelsse4asm/work/blocks.c:45: undefined reference to `sha512_sse4'
try.c: clang: error: linker command failed with exit code 1 (use -v to see invocation)

Number of similar (implementation,compiler) pairs: 1, namely:
ImplementationCompiler
dolbeau/intelsse4asmclang -mcpu=native -O3 -fwrapv -Qunused-arguments -fPIC -fPIE -gdwarf-4 -Wall (Debian_Clang_11.0.1)

Compiler output


try.c: /usr/bin/ld: libcrypto_hashblocks_sha512.a(blocks.o): in function `crypto_hashblocks_sha512_dolbeau_intelsse4asm_constbranchindex':
try.c: .../supercop-data/jasper3/amd64/try/c/gcc_-march=native_-mtune=native_-O2_-fwrapv_-fPIC_-fPIE_-gdwarf-4_-Wall/constbranchindex/crypto_hashblocks/sha512/dolbeau/intelsse4asm/work/blocks.c:45: undefined reference to `sha512_sse4'
try.c: collect2: error: ld returned 1 exit status

Number of similar (implementation,compiler) pairs: 1, namely:
ImplementationCompiler
dolbeau/intelsse4asmgcc -march=native -mtune=native -O2 -fwrapv -fPIC -fPIE -gdwarf-4 -Wall (10.2.1_20210110)

Compiler output


try.c: /usr/bin/ld: libcrypto_hashblocks_sha512.a(blocks.o): in function `crypto_hashblocks_sha512_dolbeau_intelsse4asm_constbranchindex':
try.c: .../supercop-data/jasper3/amd64/try/c/gcc_-march=native_-mtune=native_-O3_-fwrapv_-fPIC_-fPIE_-gdwarf-4_-Wall/constbranchindex/crypto_hashblocks/sha512/dolbeau/intelsse4asm/work/blocks.c:45: undefined reference to `sha512_sse4'
try.c: collect2: error: ld returned 1 exit status

Number of similar (implementation,compiler) pairs: 1, namely:
ImplementationCompiler
dolbeau/intelsse4asmgcc -march=native -mtune=native -O3 -fwrapv -fPIC -fPIE -gdwarf-4 -Wall (10.2.1_20210110)

Compiler output


try.c: /usr/bin/ld: libcrypto_hashblocks_sha512.a(blocks.o): in function `crypto_hashblocks_sha512_dolbeau_intelsse4asm_constbranchindex':
try.c: .../supercop-data/jasper3/amd64/try/c/gcc_-march=native_-mtune=native_-O_-fwrapv_-fPIC_-fPIE_-gdwarf-4_-Wall/constbranchindex/crypto_hashblocks/sha512/dolbeau/intelsse4asm/work/blocks.c:45: undefined reference to `sha512_sse4'
try.c: collect2: error: ld returned 1 exit status

Number of similar (implementation,compiler) pairs: 1, namely:
ImplementationCompiler
dolbeau/intelsse4asmgcc -march=native -mtune=native -O -fwrapv -fPIC -fPIE -gdwarf-4 -Wall (10.2.1_20210110)

Compiler output


try.c: /usr/bin/ld: libcrypto_hashblocks_sha512.a(blocks.o): in function `crypto_hashblocks_sha512_dolbeau_intelsse4asm_constbranchindex':
try.c: .../supercop-data/jasper3/amd64/try/c/gcc_-march=native_-mtune=native_-Os_-fwrapv_-fPIC_-fPIE_-gdwarf-4_-Wall/constbranchindex/crypto_hashblocks/sha512/dolbeau/intelsse4asm/work/blocks.c:45: undefined reference to `sha512_sse4'
try.c: collect2: error: ld returned 1 exit status

Number of similar (implementation,compiler) pairs: 1, namely:
ImplementationCompiler
dolbeau/intelsse4asmgcc -march=native -mtune=native -Os -fwrapv -fPIC -fPIE -gdwarf-4 -Wall (10.2.1_20210110)

Passed TIMECOP


TIMECOP iterations: 10

Number of similar (implementation,compiler) pairs: 63, namely:
ImplementationCompiler
compactclang -march=native -O2 -fwrapv -Qunused-arguments -fPIC -fPIE -gdwarf-4 -Wall (Debian_Clang_11.0.1)
compactclang -march=native -O3 -fwrapv -Qunused-arguments -fPIC -fPIE -gdwarf-4 -Wall (Debian_Clang_11.0.1)
compactclang -march=native -O -fwrapv -Qunused-arguments -fPIC -fPIE -gdwarf-4 -Wall (Debian_Clang_11.0.1)
compactclang -march=native -Os -fwrapv -Qunused-arguments -fPIC -fPIE -gdwarf-4 -Wall (Debian_Clang_11.0.1)
compactclang -mcpu=native -O3 -fwrapv -Qunused-arguments -fPIC -fPIE -gdwarf-4 -Wall (Debian_Clang_11.0.1)
compactgcc -march=native -mtune=native -O2 -fwrapv -fPIC -fPIE -gdwarf-4 -Wall (10.2.1_20210110)
compactgcc -march=native -mtune=native -O3 -fwrapv -fPIC -fPIE -gdwarf-4 -Wall (10.2.1_20210110)
compactgcc -march=native -mtune=native -O -fwrapv -fPIC -fPIE -gdwarf-4 -Wall (10.2.1_20210110)
compactgcc -march=native -mtune=native -Os -fwrapv -fPIC -fPIE -gdwarf-4 -Wall (10.2.1_20210110)
compact2clang -march=native -O2 -fwrapv -Qunused-arguments -fPIC -fPIE -gdwarf-4 -Wall (Debian_Clang_11.0.1)
compact2clang -march=native -O3 -fwrapv -Qunused-arguments -fPIC -fPIE -gdwarf-4 -Wall (Debian_Clang_11.0.1)
compact2clang -march=native -O -fwrapv -Qunused-arguments -fPIC -fPIE -gdwarf-4 -Wall (Debian_Clang_11.0.1)
compact2clang -march=native -Os -fwrapv -Qunused-arguments -fPIC -fPIE -gdwarf-4 -Wall (Debian_Clang_11.0.1)
compact2clang -mcpu=native -O3 -fwrapv -Qunused-arguments -fPIC -fPIE -gdwarf-4 -Wall (Debian_Clang_11.0.1)
compact2gcc -march=native -mtune=native -O2 -fwrapv -fPIC -fPIE -gdwarf-4 -Wall (10.2.1_20210110)
compact2gcc -march=native -mtune=native -O3 -fwrapv -fPIC -fPIE -gdwarf-4 -Wall (10.2.1_20210110)
compact2gcc -march=native -mtune=native -O -fwrapv -fPIC -fPIE -gdwarf-4 -Wall (10.2.1_20210110)
compact2gcc -march=native -mtune=native -Os -fwrapv -fPIC -fPIE -gdwarf-4 -Wall (10.2.1_20210110)
compact3clang -march=native -O2 -fwrapv -Qunused-arguments -fPIC -fPIE -gdwarf-4 -Wall (Debian_Clang_11.0.1)
compact3clang -march=native -O3 -fwrapv -Qunused-arguments -fPIC -fPIE -gdwarf-4 -Wall (Debian_Clang_11.0.1)
compact3clang -march=native -O -fwrapv -Qunused-arguments -fPIC -fPIE -gdwarf-4 -Wall (Debian_Clang_11.0.1)
compact3clang -march=native -Os -fwrapv -Qunused-arguments -fPIC -fPIE -gdwarf-4 -Wall (Debian_Clang_11.0.1)
compact3clang -mcpu=native -O3 -fwrapv -Qunused-arguments -fPIC -fPIE -gdwarf-4 -Wall (Debian_Clang_11.0.1)
compact3gcc -march=native -mtune=native -O2 -fwrapv -fPIC -fPIE -gdwarf-4 -Wall (10.2.1_20210110)
compact3gcc -march=native -mtune=native -O3 -fwrapv -fPIC -fPIE -gdwarf-4 -Wall (10.2.1_20210110)
compact3gcc -march=native -mtune=native -O -fwrapv -fPIC -fPIE -gdwarf-4 -Wall (10.2.1_20210110)
compact3gcc -march=native -mtune=native -Os -fwrapv -fPIC -fPIE -gdwarf-4 -Wall (10.2.1_20210110)
compact4clang -march=native -O2 -fwrapv -Qunused-arguments -fPIC -fPIE -gdwarf-4 -Wall (Debian_Clang_11.0.1)
compact4clang -march=native -O3 -fwrapv -Qunused-arguments -fPIC -fPIE -gdwarf-4 -Wall (Debian_Clang_11.0.1)
compact4clang -march=native -O -fwrapv -Qunused-arguments -fPIC -fPIE -gdwarf-4 -Wall (Debian_Clang_11.0.1)
compact4clang -march=native -Os -fwrapv -Qunused-arguments -fPIC -fPIE -gdwarf-4 -Wall (Debian_Clang_11.0.1)
compact4clang -mcpu=native -O3 -fwrapv -Qunused-arguments -fPIC -fPIE -gdwarf-4 -Wall (Debian_Clang_11.0.1)
compact4gcc -march=native -mtune=native -O2 -fwrapv -fPIC -fPIE -gdwarf-4 -Wall (10.2.1_20210110)
compact4gcc -march=native -mtune=native -O3 -fwrapv -fPIC -fPIE -gdwarf-4 -Wall (10.2.1_20210110)
compact4gcc -march=native -mtune=native -O -fwrapv -fPIC -fPIE -gdwarf-4 -Wall (10.2.1_20210110)
compact4gcc -march=native -mtune=native -Os -fwrapv -fPIC -fPIE -gdwarf-4 -Wall (10.2.1_20210110)
inplaceclang -march=native -O2 -fwrapv -Qunused-arguments -fPIC -fPIE -gdwarf-4 -Wall (Debian_Clang_11.0.1)
inplaceclang -march=native -O3 -fwrapv -Qunused-arguments -fPIC -fPIE -gdwarf-4 -Wall (Debian_Clang_11.0.1)
inplaceclang -march=native -O -fwrapv -Qunused-arguments -fPIC -fPIE -gdwarf-4 -Wall (Debian_Clang_11.0.1)
inplaceclang -march=native -Os -fwrapv -Qunused-arguments -fPIC -fPIE -gdwarf-4 -Wall (Debian_Clang_11.0.1)
inplaceclang -mcpu=native -O3 -fwrapv -Qunused-arguments -fPIC -fPIE -gdwarf-4 -Wall (Debian_Clang_11.0.1)
inplacegcc -march=native -mtune=native -O2 -fwrapv -fPIC -fPIE -gdwarf-4 -Wall (10.2.1_20210110)
inplacegcc -march=native -mtune=native -O3 -fwrapv -fPIC -fPIE -gdwarf-4 -Wall (10.2.1_20210110)
inplacegcc -march=native -mtune=native -O -fwrapv -fPIC -fPIE -gdwarf-4 -Wall (10.2.1_20210110)
inplacegcc -march=native -mtune=native -Os -fwrapv -fPIC -fPIE -gdwarf-4 -Wall (10.2.1_20210110)
refclang -march=native -O2 -fwrapv -Qunused-arguments -fPIC -fPIE -gdwarf-4 -Wall (Debian_Clang_11.0.1)
refclang -march=native -O3 -fwrapv -Qunused-arguments -fPIC -fPIE -gdwarf-4 -Wall (Debian_Clang_11.0.1)
refclang -march=native -O -fwrapv -Qunused-arguments -fPIC -fPIE -gdwarf-4 -Wall (Debian_Clang_11.0.1)
refclang -march=native -Os -fwrapv -Qunused-arguments -fPIC -fPIE -gdwarf-4 -Wall (Debian_Clang_11.0.1)
refclang -mcpu=native -O3 -fwrapv -Qunused-arguments -fPIC -fPIE -gdwarf-4 -Wall (Debian_Clang_11.0.1)
refgcc -march=native -mtune=native -O2 -fwrapv -fPIC -fPIE -gdwarf-4 -Wall (10.2.1_20210110)
refgcc -march=native -mtune=native -O3 -fwrapv -fPIC -fPIE -gdwarf-4 -Wall (10.2.1_20210110)
refgcc -march=native -mtune=native -O -fwrapv -fPIC -fPIE -gdwarf-4 -Wall (10.2.1_20210110)
refgcc -march=native -mtune=native -Os -fwrapv -fPIC -fPIE -gdwarf-4 -Wall (10.2.1_20210110)
wflipclang -march=native -O2 -fwrapv -Qunused-arguments -fPIC -fPIE -gdwarf-4 -Wall (Debian_Clang_11.0.1)
wflipclang -march=native -O3 -fwrapv -Qunused-arguments -fPIC -fPIE -gdwarf-4 -Wall (Debian_Clang_11.0.1)
wflipclang -march=native -O -fwrapv -Qunused-arguments -fPIC -fPIE -gdwarf-4 -Wall (Debian_Clang_11.0.1)
wflipclang -march=native -Os -fwrapv -Qunused-arguments -fPIC -fPIE -gdwarf-4 -Wall (Debian_Clang_11.0.1)
wflipclang -mcpu=native -O3 -fwrapv -Qunused-arguments -fPIC -fPIE -gdwarf-4 -Wall (Debian_Clang_11.0.1)
wflipgcc -march=native -mtune=native -O2 -fwrapv -fPIC -fPIE -gdwarf-4 -Wall (10.2.1_20210110)
wflipgcc -march=native -mtune=native -O3 -fwrapv -fPIC -fPIE -gdwarf-4 -Wall (10.2.1_20210110)
wflipgcc -march=native -mtune=native -O -fwrapv -fPIC -fPIE -gdwarf-4 -Wall (10.2.1_20210110)
wflipgcc -march=native -mtune=native -Os -fwrapv -fPIC -fPIE -gdwarf-4 -Wall (10.2.1_20210110)