Test results for amd64, jasper, crypto_aead/ascon80pqv12
[Page version: 20250327 12:34:49]
Measurements for amd64, jasper, crypto_aead
Test results for amd64, jasper, crypto_aead
Test results for crypto_aead/ascon80pqv12
Computer: jasper
Microarchitecture: amd64; Tremont (906c0)
Architecture: amd64
CPU ID: GenuineIntel-000906c0-20-bfebfbff
SUPERCOP version: 20250307
Operation: crypto_aead
Primitive: ascon80pqv12
Time | Object size | Test size | Implementation | Compiler | Benchmark date | SUPERCOP version |
93895 | 15006 0 0 | 31296 812 1016 | opt64 | clang -mcpu=native -O3 -fwrapv -Qunused-arguments -fPIC -fPIE -gdwarf-4 -Wall | 20250310 | 20250307 |
95887 | 14959 0 0 | 28366 804 1016 | opt64 | clang -march=native -Os -fwrapv -Qunused-arguments -fPIC -fPIE -gdwarf-4 -Wall | 20250310 | 20250307 |
96116 | 15002 0 0 | 32584 812 1016 | opt64 | clang -march=native -O3 -fwrapv -Qunused-arguments -fPIC -fPIE -gdwarf-4 -Wall | 20250310 | 20250307 |
96171 | 14986 0 0 | 30264 812 1016 | opt64 | clang -march=native -O2 -fwrapv -Qunused-arguments -fPIC -fPIE -gdwarf-4 -Wall | 20250310 | 20250307 |
96414 | 15064 0 0 | 29038 804 1016 | opt64 | clang -march=native -O -fwrapv -Qunused-arguments -fPIC -fPIE -gdwarf-4 -Wall | 20250310 | 20250307 |
98551 | 20005 0 0 | 35072 812 1016 | ref | clang -march=native -O2 -fwrapv -Qunused-arguments -fPIC -fPIE -gdwarf-4 -Wall | 20250310 | 20250307 |
98621 | 20005 0 0 | 37376 812 1016 | ref | clang -march=native -O3 -fwrapv -Qunused-arguments -fPIC -fPIE -gdwarf-4 -Wall | 20250310 | 20250307 |
99330 | 22794 0 0 | 38744 812 1016 | ref | clang -mcpu=native -O3 -fwrapv -Qunused-arguments -fPIC -fPIE -gdwarf-4 -Wall | 20250310 | 20250307 |
100869 | 16265 0 0 | 30728 780 1080 | opt64 | gcc -march=native -mtune=native -O2 -fwrapv -fPIC -fPIE -gdwarf-4 -Wall | 20250310 | 20250307 |
101249 | 16265 0 0 | 31912 780 1080 | opt64 | gcc -march=native -mtune=native -O3 -fwrapv -fPIC -fPIE -gdwarf-4 -Wall | 20250310 | 20250307 |
102026 | 15931 0 0 | 28795 756 1048 | opt64 | gcc -march=native -mtune=native -Os -fwrapv -fPIC -fPIE -gdwarf-4 -Wall | 20250310 | 20250307 |
112127 | 1853 0 0 | 19416 812 1016 | opt64_lowsize | clang -march=native -O3 -fwrapv -Qunused-arguments -fPIC -fPIE -gdwarf-4 -Wall | 20250310 | 20250307 |
112180 | 1761 0 0 | 18016 812 1016 | opt64_lowsize | clang -mcpu=native -O3 -fwrapv -Qunused-arguments -fPIC -fPIE -gdwarf-4 -Wall | 20250310 | 20250307 |
112670 | 18736 0 0 | 34376 780 1080 | ref | gcc -march=native -mtune=native -O3 -fwrapv -fPIC -fPIE -gdwarf-4 -Wall | 20250310 | 20250307 |
112851 | 1776 0 0 | 17032 812 1016 | opt64_lowsize | clang -march=native -O2 -fwrapv -Qunused-arguments -fPIC -fPIE -gdwarf-4 -Wall | 20250310 | 20250307 |
113016 | 1586 0 0 | 14966 804 1016 | opt64_lowsize | clang -march=native -Os -fwrapv -Qunused-arguments -fPIC -fPIE -gdwarf-4 -Wall | 20250310 | 20250307 |
113218 | 1599 0 0 | 15534 804 1016 | opt64_lowsize | clang -march=native -O -fwrapv -Qunused-arguments -fPIC -fPIE -gdwarf-4 -Wall | 20250310 | 20250307 |
116614 | 19076 0 0 | 33111 772 1080 | opt64 | gcc -march=native -mtune=native -O -fwrapv -fPIC -fPIE -gdwarf-4 -Wall | 20250310 | 20250307 |
119442 | 2191 0 0 | 17840 780 1080 | opt64_lowsize | gcc -march=native -mtune=native -O3 -fwrapv -fPIC -fPIE -gdwarf-4 -Wall | 20250310 | 20250307 |
119796 | 1563 0 0 | 14387 756 1048 | opt64_lowsize | gcc -march=native -mtune=native -Os -fwrapv -fPIC -fPIE -gdwarf-4 -Wall | 20250310 | 20250307 |
121360 | 1801 0 0 | 16264 780 1080 | opt64_lowsize | gcc -march=native -mtune=native -O2 -fwrapv -fPIC -fPIE -gdwarf-4 -Wall | 20250310 | 20250307 |
124682 | 19377 0 0 | 32235 756 1048 | opt32 | gcc -march=native -mtune=native -Os -fwrapv -fPIC -fPIE -gdwarf-4 -Wall | 20250310 | 20250307 |
125451 | 19590 0 0 | 35880 812 1016 | opt32 | clang -mcpu=native -O3 -fwrapv -Qunused-arguments -fPIC -fPIE -gdwarf-4 -Wall | 20250310 | 20250307 |
127029 | 19785 0 0 | 35432 780 1080 | opt32 | gcc -march=native -mtune=native -O3 -fwrapv -fPIC -fPIE -gdwarf-4 -Wall | 20250310 | 20250307 |
127069 | 19585 0 0 | 32998 804 1016 | opt32 | clang -march=native -Os -fwrapv -Qunused-arguments -fPIC -fPIE -gdwarf-4 -Wall | 20250310 | 20250307 |
127093 | 19817 0 0 | 34280 780 1080 | opt32 | gcc -march=native -mtune=native -O2 -fwrapv -fPIC -fPIE -gdwarf-4 -Wall | 20250310 | 20250307 |
127097 | 19623 0 0 | 34896 812 1016 | opt32 | clang -march=native -O2 -fwrapv -Qunused-arguments -fPIC -fPIE -gdwarf-4 -Wall | 20250310 | 20250307 |
127365 | 19639 0 0 | 37216 812 1016 | opt32 | clang -march=native -O3 -fwrapv -Qunused-arguments -fPIC -fPIE -gdwarf-4 -Wall | 20250310 | 20250307 |
128850 | 10898 0 0 | 25368 780 1080 | ref | gcc -march=native -mtune=native -O2 -fwrapv -fPIC -fPIE -gdwarf-4 -Wall | 20250310 | 20250307 |
130057 | 2900 0 0 | 16911 772 1080 | opt64_lowsize | gcc -march=native -mtune=native -O -fwrapv -fPIC -fPIE -gdwarf-4 -Wall | 20250310 | 20250307 |
130283 | 19880 0 0 | 33854 804 1016 | opt32 | clang -march=native -O -fwrapv -Qunused-arguments -fPIC -fPIE -gdwarf-4 -Wall | 20250310 | 20250307 |
130649 | 10889 0 0 | 24935 772 1080 | ref | gcc -march=native -mtune=native -O -fwrapv -fPIC -fPIE -gdwarf-4 -Wall | 20250310 | 20250307 |
132921 | 17433 0 0 | 30726 804 1016 | ref | clang -march=native -Os -fwrapv -Qunused-arguments -fPIC -fPIE -gdwarf-4 -Wall | 20250310 | 20250307 |
133852 | 1814 0 0 | 18080 812 1016 | opt32_lowsize | clang -mcpu=native -O3 -fwrapv -Qunused-arguments -fPIC -fPIE -gdwarf-4 -Wall | 20250310 | 20250307 |
133856 | 1886 0 0 | 19464 812 1016 | opt32_lowsize | clang -march=native -O3 -fwrapv -Qunused-arguments -fPIC -fPIE -gdwarf-4 -Wall | 20250310 | 20250307 |
134256 | 1615 0 0 | 14998 804 1016 | opt32_lowsize | clang -march=native -Os -fwrapv -Qunused-arguments -fPIC -fPIE -gdwarf-4 -Wall | 20250310 | 20250307 |
134628 | 1632 0 0 | 15582 804 1016 | opt32_lowsize | clang -march=native -O -fwrapv -Qunused-arguments -fPIC -fPIE -gdwarf-4 -Wall | 20250310 | 20250307 |
134680 | 1809 0 0 | 17080 812 1016 | opt32_lowsize | clang -march=native -O2 -fwrapv -Qunused-arguments -fPIC -fPIE -gdwarf-4 -Wall | 20250310 | 20250307 |
138981 | 1626 0 0 | 14443 756 1048 | opt32_lowsize | gcc -march=native -mtune=native -Os -fwrapv -fPIC -fPIE -gdwarf-4 -Wall | 20250310 | 20250307 |
140952 | 23324 0 0 | 37351 772 1080 | opt32 | gcc -march=native -mtune=native -O -fwrapv -fPIC -fPIE -gdwarf-4 -Wall | 20250310 | 20250307 |
141155 | 2251 0 0 | 17896 780 1080 | opt32_lowsize | gcc -march=native -mtune=native -O3 -fwrapv -fPIC -fPIE -gdwarf-4 -Wall | 20250310 | 20250307 |
142426 | 1861 0 0 | 16320 780 1080 | opt32_lowsize | gcc -march=native -mtune=native -O2 -fwrapv -fPIC -fPIE -gdwarf-4 -Wall | 20250310 | 20250307 |
154769 | 2962 0 0 | 16983 772 1080 | opt32_lowsize | gcc -march=native -mtune=native -O -fwrapv -fPIC -fPIE -gdwarf-4 -Wall | 20250310 | 20250307 |
170483 | 2220 0 0 | 15123 756 1048 | ref | gcc -march=native -mtune=native -Os -fwrapv -fPIC -fPIE -gdwarf-4 -Wall | 20250310 | 20250307 |
276765 | 14720 0 0 | 29168 780 1080 | bi32 | gcc -march=native -mtune=native -O2 -fwrapv -fPIC -fPIE -gdwarf-4 -Wall | 20250310 | 20250307 |
277144 | 14752 0 0 | 30376 780 1080 | bi32 | gcc -march=native -mtune=native -O3 -fwrapv -fPIC -fPIE -gdwarf-4 -Wall | 20250310 | 20250307 |
277189 | 14635 0 0 | 27475 756 1048 | bi32 | gcc -march=native -mtune=native -Os -fwrapv -fPIC -fPIE -gdwarf-4 -Wall | 20250310 | 20250307 |
291524 | 8962 0 0 | 23520 780 1080 | bi32_lowreg | gcc -march=native -mtune=native -O2 -fwrapv -fPIC -fPIE -gdwarf-4 -Wall | 20250310 | 20250307 |
292116 | 8962 0 0 | 24688 780 1080 | bi32_lowreg | gcc -march=native -mtune=native -O3 -fwrapv -fPIC -fPIE -gdwarf-4 -Wall | 20250310 | 20250307 |
293565 | 2784 0 0 | 16814 804 1016 | ref | clang -march=native -O -fwrapv -Qunused-arguments -fPIC -fPIE -gdwarf-4 -Wall | 20250310 | 20250307 |
295163 | 15722 0 0 | 33272 812 1016 | bi32 | clang -march=native -O3 -fwrapv -Qunused-arguments -fPIC -fPIE -gdwarf-4 -Wall | 20250310 | 20250307 |
295942 | 15722 0 0 | 30968 812 1016 | bi32 | clang -march=native -O2 -fwrapv -Qunused-arguments -fPIC -fPIE -gdwarf-4 -Wall | 20250310 | 20250307 |
296306 | 17344 0 0 | 31359 772 1080 | bi32 | gcc -march=native -mtune=native -O -fwrapv -fPIC -fPIE -gdwarf-4 -Wall | 20250310 | 20250307 |
298103 | 15978 0 0 | 32208 812 1016 | bi32 | clang -mcpu=native -O3 -fwrapv -Qunused-arguments -fPIC -fPIE -gdwarf-4 -Wall | 20250310 | 20250307 |
298179 | 15791 0 0 | 29742 804 1016 | bi32 | clang -march=native -O -fwrapv -Qunused-arguments -fPIC -fPIE -gdwarf-4 -Wall | 20250310 | 20250307 |
300816 | 15807 0 0 | 29182 804 1016 | bi32 | clang -march=native -Os -fwrapv -Qunused-arguments -fPIC -fPIE -gdwarf-4 -Wall | 20250310 | 20250307 |
308955 | 8895 0 0 | 21827 756 1048 | bi32_lowreg | gcc -march=native -mtune=native -Os -fwrapv -fPIC -fPIE -gdwarf-4 -Wall | 20250310 | 20250307 |
311143 | 3131 0 0 | 18760 780 1080 | bi32_lowsize | gcc -march=native -mtune=native -O3 -fwrapv -fPIC -fPIE -gdwarf-4 -Wall | 20250310 | 20250307 |
311389 | 2610 0 0 | 17072 780 1080 | bi32_lowsize | gcc -march=native -mtune=native -O2 -fwrapv -fPIC -fPIE -gdwarf-4 -Wall | 20250310 | 20250307 |
313540 | 9580 0 0 | 27232 812 1016 | bi32_lowreg | clang -march=native -O3 -fwrapv -Qunused-arguments -fPIC -fPIE -gdwarf-4 -Wall | 20250310 | 20250307 |
314415 | 9580 0 0 | 24928 812 1016 | bi32_lowreg | clang -march=native -O2 -fwrapv -Qunused-arguments -fPIC -fPIE -gdwarf-4 -Wall | 20250310 | 20250307 |
315092 | 9483 0 0 | 22950 804 1016 | bi32_lowreg | clang -march=native -Os -fwrapv -Qunused-arguments -fPIC -fPIE -gdwarf-4 -Wall | 20250310 | 20250307 |
319331 | 2947 0 0 | 20512 812 1016 | bi32_lowsize | clang -march=native -O3 -fwrapv -Qunused-arguments -fPIC -fPIE -gdwarf-4 -Wall | 20250310 | 20250307 |
319912 | 2695 0 0 | 16062 804 1016 | bi32_lowsize | clang -march=native -Os -fwrapv -Qunused-arguments -fPIC -fPIE -gdwarf-4 -Wall | 20250310 | 20250307 |
320522 | 2383 0 0 | 15211 756 1048 | bi32_lowsize | gcc -march=native -mtune=native -Os -fwrapv -fPIC -fPIE -gdwarf-4 -Wall | 20250310 | 20250307 |
321466 | 2861 0 0 | 18112 812 1016 | bi32_lowsize | clang -march=native -O2 -fwrapv -Qunused-arguments -fPIC -fPIE -gdwarf-4 -Wall | 20250310 | 20250307 |
327072 | 9612 0 0 | 25960 812 1016 | bi32_lowreg | clang -mcpu=native -O3 -fwrapv -Qunused-arguments -fPIC -fPIE -gdwarf-4 -Wall | 20250310 | 20250307 |
331847 | 10682 0 0 | 24823 772 1080 | bi32_lowreg | gcc -march=native -mtune=native -O -fwrapv -fPIC -fPIE -gdwarf-4 -Wall | 20250310 | 20250307 |
335550 | 2705 0 0 | 16662 804 1016 | bi32_lowsize | clang -march=native -O -fwrapv -Qunused-arguments -fPIC -fPIE -gdwarf-4 -Wall | 20250310 | 20250307 |
337348 | 2826 0 0 | 19096 812 1016 | bi32_lowsize | clang -mcpu=native -O3 -fwrapv -Qunused-arguments -fPIC -fPIE -gdwarf-4 -Wall | 20250310 | 20250307 |
339557 | 2758 0 0 | 16783 772 1080 | bi32_lowsize | gcc -march=native -mtune=native -O -fwrapv -fPIC -fPIE -gdwarf-4 -Wall | 20250310 | 20250307 |
345238 | 9428 0 0 | 23470 804 1016 | bi32_lowreg | clang -march=native -O -fwrapv -Qunused-arguments -fPIC -fPIE -gdwarf-4 -Wall | 20250310 | 20250307 |
439008 | 4990 0 0 | 20288 812 1016 | opt8 | clang -march=native -O2 -fwrapv -Qunused-arguments -fPIC -fPIE -gdwarf-4 -Wall | 20250310 | 20250307 |
440129 | 5354 0 0 | 20656 812 1016 | opt8_lowsize | clang -march=native -O2 -fwrapv -Qunused-arguments -fPIC -fPIE -gdwarf-4 -Wall | 20250310 | 20250307 |
473961 | 2952 0 0 | 16382 804 1016 | opt8 | clang -march=native -Os -fwrapv -Qunused-arguments -fPIC -fPIE -gdwarf-4 -Wall | 20250310 | 20250307 |
494223 | 3013 0 0 | 16406 804 1016 | opt8_lowsize | clang -march=native -Os -fwrapv -Qunused-arguments -fPIC -fPIE -gdwarf-4 -Wall | 20250310 | 20250307 |
805689 | 5838 0 0 | 23440 812 1016 | opt8 | clang -march=native -O3 -fwrapv -Qunused-arguments -fPIC -fPIE -gdwarf-4 -Wall | 20250310 | 20250307 |
808574 | 6426 0 0 | 24032 812 1016 | opt8_lowsize | clang -march=native -O3 -fwrapv -Qunused-arguments -fPIC -fPIE -gdwarf-4 -Wall | 20250310 | 20250307 |
822313 | 5732 0 0 | 22056 812 1016 | opt8 | clang -mcpu=native -O3 -fwrapv -Qunused-arguments -fPIC -fPIE -gdwarf-4 -Wall | 20250310 | 20250307 |
822742 | 6365 0 0 | 22672 812 1016 | opt8_lowsize | clang -mcpu=native -O3 -fwrapv -Qunused-arguments -fPIC -fPIE -gdwarf-4 -Wall | 20250310 | 20250307 |
977490 | 3350 0 0 | 17358 804 1016 | opt8 | clang -march=native -O -fwrapv -Qunused-arguments -fPIC -fPIE -gdwarf-4 -Wall | 20250310 | 20250307 |
978915 | 3406 0 0 | 17390 804 1016 | opt8_lowsize | clang -march=native -O -fwrapv -Qunused-arguments -fPIC -fPIE -gdwarf-4 -Wall | 20250310 | 20250307 |
1026733 | 9356 0 0 | 22230 804 1016 | bi8 | clang -march=native -Os -fwrapv -Qunused-arguments -fPIC -fPIE -gdwarf-4 -Wall | 20250310 | 20250307 |
1033171 | 9389 0 0 | 26448 812 1016 | bi8 | clang -march=native -O3 -fwrapv -Qunused-arguments -fPIC -fPIE -gdwarf-4 -Wall | 20250310 | 20250307 |
1035408 | 9389 0 0 | 24144 812 1016 | bi8 | clang -march=native -O2 -fwrapv -Qunused-arguments -fPIC -fPIE -gdwarf-4 -Wall | 20250310 | 20250307 |
1097836 | 9584 0 0 | 25368 812 1016 | bi8 | clang -mcpu=native -O3 -fwrapv -Qunused-arguments -fPIC -fPIE -gdwarf-4 -Wall | 20250310 | 20250307 |
1099408 | 9847 0 0 | 23446 804 1016 | bi8 | clang -march=native -O -fwrapv -Qunused-arguments -fPIC -fPIE -gdwarf-4 -Wall | 20250310 | 20250307 |
1128896 | 10270 0 0 | 25512 780 1080 | bi8 | gcc -march=native -mtune=native -O3 -fwrapv -fPIC -fPIE -gdwarf-4 -Wall | 20250310 | 20250307 |
1193891 | 13784 0 0 | 27447 772 1080 | bi8 | gcc -march=native -mtune=native -O -fwrapv -fPIC -fPIE -gdwarf-4 -Wall | 20250310 | 20250307 |
1200981 | 10956 0 0 | 25016 780 1080 | bi8 | gcc -march=native -mtune=native -O2 -fwrapv -fPIC -fPIE -gdwarf-4 -Wall | 20250310 | 20250307 |
1203947 | 12177 0 0 | 24667 756 1048 | bi8 | gcc -march=native -mtune=native -Os -fwrapv -fPIC -fPIE -gdwarf-4 -Wall | 20250310 | 20250307 |
1861937 | 5364 0 0 | 19864 780 1080 | opt8 | gcc -march=native -mtune=native -O2 -fwrapv -fPIC -fPIE -gdwarf-4 -Wall | 20250310 | 20250307 |
1880251 | 5120 0 0 | 19624 780 1080 | opt8_lowsize | gcc -march=native -mtune=native -O2 -fwrapv -fPIC -fPIE -gdwarf-4 -Wall | 20250310 | 20250307 |
1881930 | 5670 0 0 | 19735 772 1080 | opt8 | gcc -march=native -mtune=native -O -fwrapv -fPIC -fPIE -gdwarf-4 -Wall | 20250310 | 20250307 |
1903488 | 5510 0 0 | 19567 772 1080 | opt8_lowsize | gcc -march=native -mtune=native -O -fwrapv -fPIC -fPIE -gdwarf-4 -Wall | 20250310 | 20250307 |
1937712 | 6607 0 0 | 22280 780 1080 | opt8_lowsize | gcc -march=native -mtune=native -O3 -fwrapv -fPIC -fPIE -gdwarf-4 -Wall | 20250310 | 20250307 |
1952806 | 6728 0 0 | 22416 780 1080 | opt8 | gcc -march=native -mtune=native -O3 -fwrapv -fPIC -fPIE -gdwarf-4 -Wall | 20250310 | 20250307 |
1965853 | 4763 0 0 | 17619 756 1048 | opt8_lowsize | gcc -march=native -mtune=native -Os -fwrapv -fPIC -fPIE -gdwarf-4 -Wall | 20250310 | 20250307 |
1966807 | 4940 0 0 | 17835 756 1048 | opt8 | gcc -march=native -mtune=native -Os -fwrapv -fPIC -fPIE -gdwarf-4 -Wall | 20250310 | 20250307 |
Compiler output
ascon.S: ascon.S:1:10: fatal error: 'xtensa/coreasm.h' file not found
ascon.S: #include <xtensa/coreasm.h>
ascon.S: ^~~~~~~~~~~~~~~~~~
ascon.S: 1 error generated.
Number of similar (implementation,compiler) pairs: 5, namely:
Implementation | Compiler |
T:asm_esp32 | clang -march=native -O2 -fwrapv -Qunused-arguments -fPIC -fPIE -gdwarf-4 -Wall (Debian_Clang_11.0.1) |
T:asm_esp32 | clang -march=native -O3 -fwrapv -Qunused-arguments -fPIC -fPIE -gdwarf-4 -Wall (Debian_Clang_11.0.1) |
T:asm_esp32 | clang -march=native -O -fwrapv -Qunused-arguments -fPIC -fPIE -gdwarf-4 -Wall (Debian_Clang_11.0.1) |
T:asm_esp32 | clang -march=native -Os -fwrapv -Qunused-arguments -fPIC -fPIE -gdwarf-4 -Wall (Debian_Clang_11.0.1) |
T:asm_esp32 | clang -mcpu=native -O3 -fwrapv -Qunused-arguments -fPIC -fPIE -gdwarf-4 -Wall (Debian_Clang_11.0.1) |
Compiler output
ascon.S: ascon.S:1:10: fatal error: xtensa/coreasm.h: No such file or directory
ascon.S: 1 | #include <xtensa/coreasm.h>
ascon.S: | ^~~~~~~~~~~~~~~~~~
ascon.S: compilation terminated.
Number of similar (implementation,compiler) pairs: 4, namely:
Implementation | Compiler |
T:asm_esp32 | gcc -march=native -mtune=native -O2 -fwrapv -fPIC -fPIE -gdwarf-4 -Wall (10.2.1_20210110) |
T:asm_esp32 | gcc -march=native -mtune=native -O3 -fwrapv -fPIC -fPIE -gdwarf-4 -Wall (10.2.1_20210110) |
T:asm_esp32 | gcc -march=native -mtune=native -O -fwrapv -fPIC -fPIE -gdwarf-4 -Wall (10.2.1_20210110) |
T:asm_esp32 | gcc -march=native -mtune=native -Os -fwrapv -fPIC -fPIE -gdwarf-4 -Wall (10.2.1_20210110) |
Compiler output
permutations.S: permutations.S:29:10: fatal error: 'avr/io.h' file not found
permutations.S: #include "avr/io.h"
permutations.S: ^~~~~~~~~~
permutations.S: 1 error generated.
Number of similar (implementation,compiler) pairs: 10, namely:
Implementation | Compiler |
avr | clang -march=native -O2 -fwrapv -Qunused-arguments -fPIC -fPIE -gdwarf-4 -Wall (Debian_Clang_11.0.1) |
avr | clang -march=native -O3 -fwrapv -Qunused-arguments -fPIC -fPIE -gdwarf-4 -Wall (Debian_Clang_11.0.1) |
avr | clang -march=native -O -fwrapv -Qunused-arguments -fPIC -fPIE -gdwarf-4 -Wall (Debian_Clang_11.0.1) |
avr | clang -march=native -Os -fwrapv -Qunused-arguments -fPIC -fPIE -gdwarf-4 -Wall (Debian_Clang_11.0.1) |
avr | clang -mcpu=native -O3 -fwrapv -Qunused-arguments -fPIC -fPIE -gdwarf-4 -Wall (Debian_Clang_11.0.1) |
avr_lowsize | clang -march=native -O2 -fwrapv -Qunused-arguments -fPIC -fPIE -gdwarf-4 -Wall (Debian_Clang_11.0.1) |
avr_lowsize | clang -march=native -O3 -fwrapv -Qunused-arguments -fPIC -fPIE -gdwarf-4 -Wall (Debian_Clang_11.0.1) |
avr_lowsize | clang -march=native -O -fwrapv -Qunused-arguments -fPIC -fPIE -gdwarf-4 -Wall (Debian_Clang_11.0.1) |
avr_lowsize | clang -march=native -Os -fwrapv -Qunused-arguments -fPIC -fPIE -gdwarf-4 -Wall (Debian_Clang_11.0.1) |
avr_lowsize | clang -mcpu=native -O3 -fwrapv -Qunused-arguments -fPIC -fPIE -gdwarf-4 -Wall (Debian_Clang_11.0.1) |
Compiler output
aead.c: In file included from round.h:8,
aead.c: from permutations.h:11,
aead.c: from aead.c:5:
aead.c: word.h:61:11: warning: 'crypto_int64_bitmod_01' is static but used in inline function 'NOTZERO' which is not static
aead.c: 61 | return (crypto_int64_bitmod_01(((int)(result & 0xff) - 1),8)) - 1;
aead.c: | ^~~~~~~~~~~~~~~~~~~~~~
permutations.S: permutations.S:29:10: fatal error: avr/io.h: No such file or directory
permutations.S: 29 | #include "avr/io.h"
permutations.S: | ^~~~~~~~~~
permutations.S: compilation terminated.
Number of similar (implementation,compiler) pairs: 4, namely:
Implementation | Compiler |
avr | gcc -march=native -mtune=native -O2 -fwrapv -fPIC -fPIE -gdwarf-4 -Wall (10.2.1_20210110) |
avr | gcc -march=native -mtune=native -O3 -fwrapv -fPIC -fPIE -gdwarf-4 -Wall (10.2.1_20210110) |
avr | gcc -march=native -mtune=native -O -fwrapv -fPIC -fPIE -gdwarf-4 -Wall (10.2.1_20210110) |
avr | gcc -march=native -mtune=native -Os -fwrapv -fPIC -fPIE -gdwarf-4 -Wall (10.2.1_20210110) |
Compiler output
aead.c: In file included from round.h:8,
aead.c: from permutations.h:11,
aead.c: from aead.c:5:
aead.c: word.h:61:11: warning: 'crypto_int64_bitmod_01' is static but used in inline function 'NOTZERO' which is not static
aead.c: 61 | return (crypto_int64_bitmod_01(((int)(result & 0xff) - 1),8)) - 1;
aead.c: | ^~~~~~~~~~~~~~~~~~~~~~
update.c: In file included from round.h:8,
update.c: from permutations.h:11,
update.c: from update.c:3:
update.c: word.h:61:11: warning: 'crypto_int64_bitmod_01' is static but used in inline function 'NOTZERO' which is not static
update.c: 61 | return (crypto_int64_bitmod_01(((int)(result & 0xff) - 1),8)) - 1;
update.c: | ^~~~~~~~~~~~~~~~~~~~~~
permutations.S: permutations.S:29:10: fatal error: avr/io.h: No such file or directory
permutations.S: 29 | #include "avr/io.h"
permutations.S: | ^~~~~~~~~~
permutations.S: compilation terminated.
Number of similar (implementation,compiler) pairs: 4, namely:
Implementation | Compiler |
avr_lowsize | gcc -march=native -mtune=native -O2 -fwrapv -fPIC -fPIE -gdwarf-4 -Wall (10.2.1_20210110) |
avr_lowsize | gcc -march=native -mtune=native -O3 -fwrapv -fPIC -fPIE -gdwarf-4 -Wall (10.2.1_20210110) |
avr_lowsize | gcc -march=native -mtune=native -O -fwrapv -fPIC -fPIE -gdwarf-4 -Wall (10.2.1_20210110) |
avr_lowsize | gcc -march=native -mtune=native -Os -fwrapv -fPIC -fPIE -gdwarf-4 -Wall (10.2.1_20210110) |
Compiler output
aead.c: In file included from round.h:8,
aead.c: from permutations.h:11,
aead.c: from aead.c:4:
aead.c: word.h:55:11: warning: 'crypto_int64_bitmod_01' is static but used in inline function 'NOTZERO' which is not static
aead.c: 55 | return (crypto_int64_bitmod_01(((int)(result & 0xff) - 1),8)) - 1;
aead.c: | ^~~~~~~~~~~~~~~~~~~~~~
permutations.c: In file included from round.h:8,
permutations.c: from permutations.h:11,
permutations.c: from permutations.c:1:
permutations.c: word.h:55:11: warning: 'crypto_int64_bitmod_01' is static but used in inline function 'NOTZERO' which is not static
permutations.c: 55 | return (crypto_int64_bitmod_01(((int)(result & 0xff) - 1),8)) - 1;
permutations.c: | ^~~~~~~~~~~~~~~~~~~~~~
Number of similar (implementation,compiler) pairs: 12, namely:
Implementation | Compiler |
bi32 | gcc -march=native -mtune=native -O2 -fwrapv -fPIC -fPIE -gdwarf-4 -Wall (10.2.1_20210110) |
bi32 | gcc -march=native -mtune=native -O3 -fwrapv -fPIC -fPIE -gdwarf-4 -Wall (10.2.1_20210110) |
bi32 | gcc -march=native -mtune=native -O -fwrapv -fPIC -fPIE -gdwarf-4 -Wall (10.2.1_20210110) |
bi32 | gcc -march=native -mtune=native -Os -fwrapv -fPIC -fPIE -gdwarf-4 -Wall (10.2.1_20210110) |
bi32_lowreg | gcc -march=native -mtune=native -O2 -fwrapv -fPIC -fPIE -gdwarf-4 -Wall (10.2.1_20210110) |
bi32_lowreg | gcc -march=native -mtune=native -O3 -fwrapv -fPIC -fPIE -gdwarf-4 -Wall (10.2.1_20210110) |
bi32_lowreg | gcc -march=native -mtune=native -O -fwrapv -fPIC -fPIE -gdwarf-4 -Wall (10.2.1_20210110) |
bi32_lowreg | gcc -march=native -mtune=native -Os -fwrapv -fPIC -fPIE -gdwarf-4 -Wall (10.2.1_20210110) |
bi8 | gcc -march=native -mtune=native -O2 -fwrapv -fPIC -fPIE -gdwarf-4 -Wall (10.2.1_20210110) |
bi8 | gcc -march=native -mtune=native -O3 -fwrapv -fPIC -fPIE -gdwarf-4 -Wall (10.2.1_20210110) |
bi8 | gcc -march=native -mtune=native -O -fwrapv -fPIC -fPIE -gdwarf-4 -Wall (10.2.1_20210110) |
bi8 | gcc -march=native -mtune=native -Os -fwrapv -fPIC -fPIE -gdwarf-4 -Wall (10.2.1_20210110) |
Compiler output
update.c: update.c:21:13: warning: unused variable 'rate' [-Wunused-variable]
update.c: const int rate = ASCON_AEAD_RATE;
update.c: ^
update.c: 1 warning generated.
Number of similar (implementation,compiler) pairs: 15, namely:
Implementation | Compiler |
bi32_lowsize | clang -march=native -O2 -fwrapv -Qunused-arguments -fPIC -fPIE -gdwarf-4 -Wall (Debian_Clang_11.0.1) |
bi32_lowsize | clang -march=native -O3 -fwrapv -Qunused-arguments -fPIC -fPIE -gdwarf-4 -Wall (Debian_Clang_11.0.1) |
bi32_lowsize | clang -march=native -O -fwrapv -Qunused-arguments -fPIC -fPIE -gdwarf-4 -Wall (Debian_Clang_11.0.1) |
bi32_lowsize | clang -march=native -Os -fwrapv -Qunused-arguments -fPIC -fPIE -gdwarf-4 -Wall (Debian_Clang_11.0.1) |
bi32_lowsize | clang -mcpu=native -O3 -fwrapv -Qunused-arguments -fPIC -fPIE -gdwarf-4 -Wall (Debian_Clang_11.0.1) |
opt32_lowsize | clang -march=native -O2 -fwrapv -Qunused-arguments -fPIC -fPIE -gdwarf-4 -Wall (Debian_Clang_11.0.1) |
opt32_lowsize | clang -march=native -O3 -fwrapv -Qunused-arguments -fPIC -fPIE -gdwarf-4 -Wall (Debian_Clang_11.0.1) |
opt32_lowsize | clang -march=native -O -fwrapv -Qunused-arguments -fPIC -fPIE -gdwarf-4 -Wall (Debian_Clang_11.0.1) |
opt32_lowsize | clang -march=native -Os -fwrapv -Qunused-arguments -fPIC -fPIE -gdwarf-4 -Wall (Debian_Clang_11.0.1) |
opt32_lowsize | clang -mcpu=native -O3 -fwrapv -Qunused-arguments -fPIC -fPIE -gdwarf-4 -Wall (Debian_Clang_11.0.1) |
opt64_lowsize | clang -march=native -O2 -fwrapv -Qunused-arguments -fPIC -fPIE -gdwarf-4 -Wall (Debian_Clang_11.0.1) |
opt64_lowsize | clang -march=native -O3 -fwrapv -Qunused-arguments -fPIC -fPIE -gdwarf-4 -Wall (Debian_Clang_11.0.1) |
opt64_lowsize | clang -march=native -O -fwrapv -Qunused-arguments -fPIC -fPIE -gdwarf-4 -Wall (Debian_Clang_11.0.1) |
opt64_lowsize | clang -march=native -Os -fwrapv -Qunused-arguments -fPIC -fPIE -gdwarf-4 -Wall (Debian_Clang_11.0.1) |
opt64_lowsize | clang -mcpu=native -O3 -fwrapv -Qunused-arguments -fPIC -fPIE -gdwarf-4 -Wall (Debian_Clang_11.0.1) |
Compiler output
aead.c: In file included from round.h:8,
aead.c: from permutations.h:11,
aead.c: from aead.c:3:
aead.c: word.h:55:11: warning: 'crypto_int64_bitmod_01' is static but used in inline function 'NOTZERO' which is not static
aead.c: 55 | return (crypto_int64_bitmod_01(((int)(result & 0xff) - 1),8)) - 1;
aead.c: | ^~~~~~~~~~~~~~~~~~~~~~
crypto_aead.c: In file included from round.h:8,
crypto_aead.c: from permutations.h:11,
crypto_aead.c: from crypto_aead.c:8:
crypto_aead.c: word.h:55:11: warning: 'crypto_int64_bitmod_01' is static but used in inline function 'NOTZERO' which is not static
crypto_aead.c: 55 | return (crypto_int64_bitmod_01(((int)(result & 0xff) - 1),8)) - 1;
crypto_aead.c: | ^~~~~~~~~~~~~~~~~~~~~~
permutations.c: In file included from round.h:8,
permutations.c: from permutations.h:11,
permutations.c: from permutations.c:1:
permutations.c: word.h:55:11: warning: 'crypto_int64_bitmod_01' is static but used in inline function 'NOTZERO' which is not static
permutations.c: 55 | return (crypto_int64_bitmod_01(((int)(result & 0xff) - 1),8)) - 1;
permutations.c: | ^~~~~~~~~~~~~~~~~~~~~~
update.c: update.c: In function 'ascon_update':
update.c: update.c:21:13: warning: unused variable 'rate' [-Wunused-variable]
update.c: 21 | const int rate = ASCON_AEAD_RATE;
update.c: | ^~~~
update.c: In file included from round.h:8,
update.c: from permutations.h:11,
update.c: from update.c:3:
update.c: update.c: At top level:
update.c: word.h:55:11: warning: 'crypto_int64_bitmod_01' is static but used in inline function 'NOTZERO' which is not static
update.c: 55 | return (crypto_int64_bitmod_01(((int)(result & 0xff) - 1),8)) - 1;
update.c: | ^~~~~~~~~~~~~~~~~~~~~~
Number of similar (implementation,compiler) pairs: 4, namely:
Implementation | Compiler |
bi32_lowsize | gcc -march=native -mtune=native -O2 -fwrapv -fPIC -fPIE -gdwarf-4 -Wall (10.2.1_20210110) |
bi32_lowsize | gcc -march=native -mtune=native -O3 -fwrapv -fPIC -fPIE -gdwarf-4 -Wall (10.2.1_20210110) |
bi32_lowsize | gcc -march=native -mtune=native -O -fwrapv -fPIC -fPIE -gdwarf-4 -Wall (10.2.1_20210110) |
bi32_lowsize | gcc -march=native -mtune=native -Os -fwrapv -fPIC -fPIE -gdwarf-4 -Wall (10.2.1_20210110) |
Compiler output
try.c: /usr/bin/ld: /tmp/try-small-72fc20.o: in function `doit':
try.c: .../supercop-data/jasper/amd64/try/c/clang_-march=native_-O2_-fwrapv_-Qunused-arguments_-fPIC_-fPIE_-gdwarf-4_-Wall/timingleaks/crypto_aead/ascon80pqv12/esp32/work/./try.c:133: undefined reference to `crypto_aead_ascon80pqv12_esp32_timingleaks_encrypt'
try.c: /usr/bin/ld: .../supercop-data/jasper/amd64/try/c/clang_-march=native_-O2_-fwrapv_-Qunused-arguments_-fPIC_-fPIE_-gdwarf-4_-Wall/timingleaks/crypto_aead/ascon80pqv12/esp32/work/./try.c:135: undefined reference to `crypto_aead_ascon80pqv12_esp32_timingleaks_decrypt'
try.c: /usr/bin/ld: /tmp/try-small-72fc20.o: in function `test':
try.c: .../supercop-data/jasper/amd64/try/c/clang_-march=native_-O2_-fwrapv_-Qunused-arguments_-fPIC_-fPIE_-gdwarf-4_-Wall/timingleaks/crypto_aead/ascon80pqv12/esp32/work/./try.c:159: undefined reference to `crypto_aead_ascon80pqv12_esp32_timingleaks_encrypt'
try.c: /usr/bin/ld: .../supercop-data/jasper/amd64/try/c/clang_-march=native_-O2_-fwrapv_-Qunused-arguments_-fPIC_-fPIE_-gdwarf-4_-Wall/timingleaks/crypto_aead/ascon80pqv12/esp32/work/./try.c:189: undefined reference to `crypto_aead_ascon80pqv12_esp32_timingleaks_encrypt'
try.c: /usr/bin/ld: .../supercop-data/jasper/amd64/try/c/clang_-march=native_-O2_-fwrapv_-Qunused-arguments_-fPIC_-fPIE_-gdwarf-4_-Wall/timingleaks/crypto_aead/ascon80pqv12/esp32/work/./try.c:300: undefined reference to `crypto_aead_ascon80pqv12_esp32_timingleaks_decrypt'
try.c: /usr/bin/ld: .../supercop-data/jasper/amd64/try/c/clang_-march=native_-O2_-fwrapv_-Qunused-arguments_-fPIC_-fPIE_-gdwarf-4_-Wall/timingleaks/crypto_aead/ascon80pqv12/esp32/work/./try.c:331: undefined reference to `crypto_aead_ascon80pqv12_esp32_timingleaks_decrypt'
try.c: /usr/bin/ld: .../supercop-data/jasper/amd64/try/c/clang_-march=native_-O2_-fwrapv_-Qunused-arguments_-fPIC_-fPIE_-gdwarf-4_-Wall/timingleaks/crypto_aead/ascon80pqv12/esp32/work/./try.c:476: undefined reference to `crypto_aead_ascon80pqv12_esp32_timingleaks_decrypt'
try.c: /usr/bin/ld: .../supercop-data/jasper/amd64/try/c/clang_-march=native_-O2_-fwrapv_-Qunused-arguments_-fPIC_-fPIE_-gdwarf-4_-Wall/timingleaks/crypto_aead/ascon80pqv12/esp32/work/./try.c:480: undefined reference to `crypto_aead_ascon80pqv12_esp32_timingleaks_decrypt'
try.c: /usr/bin/ld: .../supercop-data/jasper/amd64/try/c/clang_-march=native_-O2_-fwrapv_-Qunused-arguments_-fPIC_-fPIE_-gdwarf-4_-Wall/timingleaks/crypto_aead/ascon80pqv12/esp32/work/./try.c:484: undefined reference to `crypto_aead_ascon80pqv12_esp32_timingleaks_decrypt'
try.c: clang: error: linker command failed with exit code 1 (use -v to see invocation)
Number of similar (implementation,compiler) pairs: 1, namely:
Implementation | Compiler |
T:esp32 | clang -march=native -O2 -fwrapv -Qunused-arguments -fPIC -fPIE -gdwarf-4 -Wall (Debian_Clang_11.0.1) |
Compiler output
try.c: /usr/bin/ld: /tmp/try-small-a91b7f.o: in function `doit':
try.c: .../supercop-data/jasper/amd64/try/c/clang_-march=native_-O3_-fwrapv_-Qunused-arguments_-fPIC_-fPIE_-gdwarf-4_-Wall/timingleaks/crypto_aead/ascon80pqv12/esp32/work/./try.c:133: undefined reference to `crypto_aead_ascon80pqv12_esp32_timingleaks_encrypt'
try.c: /usr/bin/ld: .../supercop-data/jasper/amd64/try/c/clang_-march=native_-O3_-fwrapv_-Qunused-arguments_-fPIC_-fPIE_-gdwarf-4_-Wall/timingleaks/crypto_aead/ascon80pqv12/esp32/work/./try.c:135: undefined reference to `crypto_aead_ascon80pqv12_esp32_timingleaks_decrypt'
try.c: /usr/bin/ld: /tmp/try-small-a91b7f.o: in function `test':
try.c: .../supercop-data/jasper/amd64/try/c/clang_-march=native_-O3_-fwrapv_-Qunused-arguments_-fPIC_-fPIE_-gdwarf-4_-Wall/timingleaks/crypto_aead/ascon80pqv12/esp32/work/./try.c:159: undefined reference to `crypto_aead_ascon80pqv12_esp32_timingleaks_encrypt'
try.c: /usr/bin/ld: .../supercop-data/jasper/amd64/try/c/clang_-march=native_-O3_-fwrapv_-Qunused-arguments_-fPIC_-fPIE_-gdwarf-4_-Wall/timingleaks/crypto_aead/ascon80pqv12/esp32/work/./try.c:189: undefined reference to `crypto_aead_ascon80pqv12_esp32_timingleaks_encrypt'
try.c: /usr/bin/ld: .../supercop-data/jasper/amd64/try/c/clang_-march=native_-O3_-fwrapv_-Qunused-arguments_-fPIC_-fPIE_-gdwarf-4_-Wall/timingleaks/crypto_aead/ascon80pqv12/esp32/work/./try.c:300: undefined reference to `crypto_aead_ascon80pqv12_esp32_timingleaks_decrypt'
try.c: /usr/bin/ld: .../supercop-data/jasper/amd64/try/c/clang_-march=native_-O3_-fwrapv_-Qunused-arguments_-fPIC_-fPIE_-gdwarf-4_-Wall/timingleaks/crypto_aead/ascon80pqv12/esp32/work/./try.c:331: undefined reference to `crypto_aead_ascon80pqv12_esp32_timingleaks_decrypt'
try.c: /usr/bin/ld: .../supercop-data/jasper/amd64/try/c/clang_-march=native_-O3_-fwrapv_-Qunused-arguments_-fPIC_-fPIE_-gdwarf-4_-Wall/timingleaks/crypto_aead/ascon80pqv12/esp32/work/./try.c:476: undefined reference to `crypto_aead_ascon80pqv12_esp32_timingleaks_decrypt'
try.c: /usr/bin/ld: .../supercop-data/jasper/amd64/try/c/clang_-march=native_-O3_-fwrapv_-Qunused-arguments_-fPIC_-fPIE_-gdwarf-4_-Wall/timingleaks/crypto_aead/ascon80pqv12/esp32/work/./try.c:480: undefined reference to `crypto_aead_ascon80pqv12_esp32_timingleaks_decrypt'
try.c: /usr/bin/ld: .../supercop-data/jasper/amd64/try/c/clang_-march=native_-O3_-fwrapv_-Qunused-arguments_-fPIC_-fPIE_-gdwarf-4_-Wall/timingleaks/crypto_aead/ascon80pqv12/esp32/work/./try.c:484: undefined reference to `crypto_aead_ascon80pqv12_esp32_timingleaks_decrypt'
try.c: clang: error: linker command failed with exit code 1 (use -v to see invocation)
Number of similar (implementation,compiler) pairs: 1, namely:
Implementation | Compiler |
T:esp32 | clang -march=native -O3 -fwrapv -Qunused-arguments -fPIC -fPIE -gdwarf-4 -Wall (Debian_Clang_11.0.1) |
Compiler output
try.c: /usr/bin/ld: /tmp/try-small-465f01.o: in function `doit':
try.c: .../supercop-data/jasper/amd64/try/c/clang_-march=native_-O_-fwrapv_-Qunused-arguments_-fPIC_-fPIE_-gdwarf-4_-Wall/timingleaks/crypto_aead/ascon80pqv12/esp32/work/./try.c:133: undefined reference to `crypto_aead_ascon80pqv12_esp32_timingleaks_encrypt'
try.c: /usr/bin/ld: .../supercop-data/jasper/amd64/try/c/clang_-march=native_-O_-fwrapv_-Qunused-arguments_-fPIC_-fPIE_-gdwarf-4_-Wall/timingleaks/crypto_aead/ascon80pqv12/esp32/work/./try.c:135: undefined reference to `crypto_aead_ascon80pqv12_esp32_timingleaks_decrypt'
try.c: /usr/bin/ld: /tmp/try-small-465f01.o: in function `test':
try.c: .../supercop-data/jasper/amd64/try/c/clang_-march=native_-O_-fwrapv_-Qunused-arguments_-fPIC_-fPIE_-gdwarf-4_-Wall/timingleaks/crypto_aead/ascon80pqv12/esp32/work/./try.c:159: undefined reference to `crypto_aead_ascon80pqv12_esp32_timingleaks_encrypt'
try.c: /usr/bin/ld: .../supercop-data/jasper/amd64/try/c/clang_-march=native_-O_-fwrapv_-Qunused-arguments_-fPIC_-fPIE_-gdwarf-4_-Wall/timingleaks/crypto_aead/ascon80pqv12/esp32/work/./try.c:189: undefined reference to `crypto_aead_ascon80pqv12_esp32_timingleaks_encrypt'
try.c: /usr/bin/ld: .../supercop-data/jasper/amd64/try/c/clang_-march=native_-O_-fwrapv_-Qunused-arguments_-fPIC_-fPIE_-gdwarf-4_-Wall/timingleaks/crypto_aead/ascon80pqv12/esp32/work/./try.c:300: undefined reference to `crypto_aead_ascon80pqv12_esp32_timingleaks_decrypt'
try.c: /usr/bin/ld: .../supercop-data/jasper/amd64/try/c/clang_-march=native_-O_-fwrapv_-Qunused-arguments_-fPIC_-fPIE_-gdwarf-4_-Wall/timingleaks/crypto_aead/ascon80pqv12/esp32/work/./try.c:331: undefined reference to `crypto_aead_ascon80pqv12_esp32_timingleaks_decrypt'
try.c: /usr/bin/ld: .../supercop-data/jasper/amd64/try/c/clang_-march=native_-O_-fwrapv_-Qunused-arguments_-fPIC_-fPIE_-gdwarf-4_-Wall/timingleaks/crypto_aead/ascon80pqv12/esp32/work/./try.c:476: undefined reference to `crypto_aead_ascon80pqv12_esp32_timingleaks_decrypt'
try.c: /usr/bin/ld: .../supercop-data/jasper/amd64/try/c/clang_-march=native_-O_-fwrapv_-Qunused-arguments_-fPIC_-fPIE_-gdwarf-4_-Wall/timingleaks/crypto_aead/ascon80pqv12/esp32/work/./try.c:480: undefined reference to `crypto_aead_ascon80pqv12_esp32_timingleaks_decrypt'
try.c: /usr/bin/ld: .../supercop-data/jasper/amd64/try/c/clang_-march=native_-O_-fwrapv_-Qunused-arguments_-fPIC_-fPIE_-gdwarf-4_-Wall/timingleaks/crypto_aead/ascon80pqv12/esp32/work/./try.c:484: undefined reference to `crypto_aead_ascon80pqv12_esp32_timingleaks_decrypt'
try.c: clang: error: linker command failed with exit code 1 (use -v to see invocation)
Number of similar (implementation,compiler) pairs: 1, namely:
Implementation | Compiler |
T:esp32 | clang -march=native -O -fwrapv -Qunused-arguments -fPIC -fPIE -gdwarf-4 -Wall (Debian_Clang_11.0.1) |
Compiler output
try.c: /usr/bin/ld: /tmp/try-small-0810e5.o: in function `doit':
try.c: .../supercop-data/jasper/amd64/try/c/clang_-march=native_-Os_-fwrapv_-Qunused-arguments_-fPIC_-fPIE_-gdwarf-4_-Wall/timingleaks/crypto_aead/ascon80pqv12/esp32/work/./try.c:133: undefined reference to `crypto_aead_ascon80pqv12_esp32_timingleaks_encrypt'
try.c: /usr/bin/ld: .../supercop-data/jasper/amd64/try/c/clang_-march=native_-Os_-fwrapv_-Qunused-arguments_-fPIC_-fPIE_-gdwarf-4_-Wall/timingleaks/crypto_aead/ascon80pqv12/esp32/work/./try.c:135: undefined reference to `crypto_aead_ascon80pqv12_esp32_timingleaks_decrypt'
try.c: /usr/bin/ld: /tmp/try-small-0810e5.o: in function `test':
try.c: .../supercop-data/jasper/amd64/try/c/clang_-march=native_-Os_-fwrapv_-Qunused-arguments_-fPIC_-fPIE_-gdwarf-4_-Wall/timingleaks/crypto_aead/ascon80pqv12/esp32/work/./try.c:159: undefined reference to `crypto_aead_ascon80pqv12_esp32_timingleaks_encrypt'
try.c: /usr/bin/ld: .../supercop-data/jasper/amd64/try/c/clang_-march=native_-Os_-fwrapv_-Qunused-arguments_-fPIC_-fPIE_-gdwarf-4_-Wall/timingleaks/crypto_aead/ascon80pqv12/esp32/work/./try.c:189: undefined reference to `crypto_aead_ascon80pqv12_esp32_timingleaks_encrypt'
try.c: /usr/bin/ld: .../supercop-data/jasper/amd64/try/c/clang_-march=native_-Os_-fwrapv_-Qunused-arguments_-fPIC_-fPIE_-gdwarf-4_-Wall/timingleaks/crypto_aead/ascon80pqv12/esp32/work/./try.c:300: undefined reference to `crypto_aead_ascon80pqv12_esp32_timingleaks_decrypt'
try.c: /usr/bin/ld: .../supercop-data/jasper/amd64/try/c/clang_-march=native_-Os_-fwrapv_-Qunused-arguments_-fPIC_-fPIE_-gdwarf-4_-Wall/timingleaks/crypto_aead/ascon80pqv12/esp32/work/./try.c:331: undefined reference to `crypto_aead_ascon80pqv12_esp32_timingleaks_decrypt'
try.c: /usr/bin/ld: .../supercop-data/jasper/amd64/try/c/clang_-march=native_-Os_-fwrapv_-Qunused-arguments_-fPIC_-fPIE_-gdwarf-4_-Wall/timingleaks/crypto_aead/ascon80pqv12/esp32/work/./try.c:476: undefined reference to `crypto_aead_ascon80pqv12_esp32_timingleaks_decrypt'
try.c: /usr/bin/ld: .../supercop-data/jasper/amd64/try/c/clang_-march=native_-Os_-fwrapv_-Qunused-arguments_-fPIC_-fPIE_-gdwarf-4_-Wall/timingleaks/crypto_aead/ascon80pqv12/esp32/work/./try.c:480: undefined reference to `crypto_aead_ascon80pqv12_esp32_timingleaks_decrypt'
try.c: /usr/bin/ld: .../supercop-data/jasper/amd64/try/c/clang_-march=native_-Os_-fwrapv_-Qunused-arguments_-fPIC_-fPIE_-gdwarf-4_-Wall/timingleaks/crypto_aead/ascon80pqv12/esp32/work/./try.c:484: undefined reference to `crypto_aead_ascon80pqv12_esp32_timingleaks_decrypt'
try.c: clang: error: linker command failed with exit code 1 (use -v to see invocation)
Number of similar (implementation,compiler) pairs: 1, namely:
Implementation | Compiler |
T:esp32 | clang -march=native -Os -fwrapv -Qunused-arguments -fPIC -fPIE -gdwarf-4 -Wall (Debian_Clang_11.0.1) |
Compiler output
try.c: /usr/bin/ld: /tmp/try-small-4ed95e.o: in function `doit':
try.c: .../supercop-data/jasper/amd64/try/c/clang_-mcpu=native_-O3_-fwrapv_-Qunused-arguments_-fPIC_-fPIE_-gdwarf-4_-Wall/timingleaks/crypto_aead/ascon80pqv12/esp32/work/./try.c:133: undefined reference to `crypto_aead_ascon80pqv12_esp32_timingleaks_encrypt'
try.c: /usr/bin/ld: .../supercop-data/jasper/amd64/try/c/clang_-mcpu=native_-O3_-fwrapv_-Qunused-arguments_-fPIC_-fPIE_-gdwarf-4_-Wall/timingleaks/crypto_aead/ascon80pqv12/esp32/work/./try.c:135: undefined reference to `crypto_aead_ascon80pqv12_esp32_timingleaks_decrypt'
try.c: /usr/bin/ld: /tmp/try-small-4ed95e.o: in function `test':
try.c: .../supercop-data/jasper/amd64/try/c/clang_-mcpu=native_-O3_-fwrapv_-Qunused-arguments_-fPIC_-fPIE_-gdwarf-4_-Wall/timingleaks/crypto_aead/ascon80pqv12/esp32/work/./try.c:159: undefined reference to `crypto_aead_ascon80pqv12_esp32_timingleaks_encrypt'
try.c: /usr/bin/ld: .../supercop-data/jasper/amd64/try/c/clang_-mcpu=native_-O3_-fwrapv_-Qunused-arguments_-fPIC_-fPIE_-gdwarf-4_-Wall/timingleaks/crypto_aead/ascon80pqv12/esp32/work/./try.c:189: undefined reference to `crypto_aead_ascon80pqv12_esp32_timingleaks_encrypt'
try.c: /usr/bin/ld: .../supercop-data/jasper/amd64/try/c/clang_-mcpu=native_-O3_-fwrapv_-Qunused-arguments_-fPIC_-fPIE_-gdwarf-4_-Wall/timingleaks/crypto_aead/ascon80pqv12/esp32/work/./try.c:300: undefined reference to `crypto_aead_ascon80pqv12_esp32_timingleaks_decrypt'
try.c: /usr/bin/ld: .../supercop-data/jasper/amd64/try/c/clang_-mcpu=native_-O3_-fwrapv_-Qunused-arguments_-fPIC_-fPIE_-gdwarf-4_-Wall/timingleaks/crypto_aead/ascon80pqv12/esp32/work/./try.c:331: undefined reference to `crypto_aead_ascon80pqv12_esp32_timingleaks_decrypt'
try.c: /usr/bin/ld: .../supercop-data/jasper/amd64/try/c/clang_-mcpu=native_-O3_-fwrapv_-Qunused-arguments_-fPIC_-fPIE_-gdwarf-4_-Wall/timingleaks/crypto_aead/ascon80pqv12/esp32/work/./try.c:476: undefined reference to `crypto_aead_ascon80pqv12_esp32_timingleaks_decrypt'
try.c: /usr/bin/ld: .../supercop-data/jasper/amd64/try/c/clang_-mcpu=native_-O3_-fwrapv_-Qunused-arguments_-fPIC_-fPIE_-gdwarf-4_-Wall/timingleaks/crypto_aead/ascon80pqv12/esp32/work/./try.c:480: undefined reference to `crypto_aead_ascon80pqv12_esp32_timingleaks_decrypt'
try.c: /usr/bin/ld: .../supercop-data/jasper/amd64/try/c/clang_-mcpu=native_-O3_-fwrapv_-Qunused-arguments_-fPIC_-fPIE_-gdwarf-4_-Wall/timingleaks/crypto_aead/ascon80pqv12/esp32/work/./try.c:484: undefined reference to `crypto_aead_ascon80pqv12_esp32_timingleaks_decrypt'
try.c: clang: error: linker command failed with exit code 1 (use -v to see invocation)
Number of similar (implementation,compiler) pairs: 1, namely:
Implementation | Compiler |
T:esp32 | clang -mcpu=native -O3 -fwrapv -Qunused-arguments -fPIC -fPIE -gdwarf-4 -Wall (Debian_Clang_11.0.1) |
Compiler output
try.c: /usr/bin/ld: /tmp/cc6L5RVz.o: in function `doit':
try.c: .../supercop-data/jasper/amd64/try/c/gcc_-march=native_-mtune=native_-O2_-fwrapv_-fPIC_-fPIE_-gdwarf-4_-Wall/timingleaks/crypto_aead/ascon80pqv12/esp32/work/try.c:133: undefined reference to `crypto_aead_ascon80pqv12_esp32_timingleaks_encrypt'
try.c: /usr/bin/ld: .../supercop-data/jasper/amd64/try/c/gcc_-march=native_-mtune=native_-O2_-fwrapv_-fPIC_-fPIE_-gdwarf-4_-Wall/timingleaks/crypto_aead/ascon80pqv12/esp32/work/try.c:135: undefined reference to `crypto_aead_ascon80pqv12_esp32_timingleaks_decrypt'
try.c: /usr/bin/ld: /tmp/cc6L5RVz.o: in function `test':
try.c: .../supercop-data/jasper/amd64/try/c/gcc_-march=native_-mtune=native_-O2_-fwrapv_-fPIC_-fPIE_-gdwarf-4_-Wall/timingleaks/crypto_aead/ascon80pqv12/esp32/work/try.c:189: undefined reference to `crypto_aead_ascon80pqv12_esp32_timingleaks_encrypt'
try.c: /usr/bin/ld: .../supercop-data/jasper/amd64/try/c/gcc_-march=native_-mtune=native_-O2_-fwrapv_-fPIC_-fPIE_-gdwarf-4_-Wall/timingleaks/crypto_aead/ascon80pqv12/esp32/work/try.c:300: undefined reference to `crypto_aead_ascon80pqv12_esp32_timingleaks_decrypt'
try.c: /usr/bin/ld: .../supercop-data/jasper/amd64/try/c/gcc_-march=native_-mtune=native_-O2_-fwrapv_-fPIC_-fPIE_-gdwarf-4_-Wall/timingleaks/crypto_aead/ascon80pqv12/esp32/work/try.c:331: undefined reference to `crypto_aead_ascon80pqv12_esp32_timingleaks_decrypt'
try.c: /usr/bin/ld: .../supercop-data/jasper/amd64/try/c/gcc_-march=native_-mtune=native_-O2_-fwrapv_-fPIC_-fPIE_-gdwarf-4_-Wall/timingleaks/crypto_aead/ascon80pqv12/esp32/work/try.c:476: undefined reference to `crypto_aead_ascon80pqv12_esp32_timingleaks_decrypt'
try.c: /usr/bin/ld: .../supercop-data/jasper/amd64/try/c/gcc_-march=native_-mtune=native_-O2_-fwrapv_-fPIC_-fPIE_-gdwarf-4_-Wall/timingleaks/crypto_aead/ascon80pqv12/esp32/work/try.c:480: undefined reference to `crypto_aead_ascon80pqv12_esp32_timingleaks_decrypt'
try.c: /usr/bin/ld: .../supercop-data/jasper/amd64/try/c/gcc_-march=native_-mtune=native_-O2_-fwrapv_-fPIC_-fPIE_-gdwarf-4_-Wall/timingleaks/crypto_aead/ascon80pqv12/esp32/work/try.c:484: undefined reference to `crypto_aead_ascon80pqv12_esp32_timingleaks_decrypt'
try.c: /usr/bin/ld: .../supercop-data/jasper/amd64/try/c/gcc_-march=native_-mtune=native_-O2_-fwrapv_-fPIC_-fPIE_-gdwarf-4_-Wall/timingleaks/crypto_aead/ascon80pqv12/esp32/work/try.c:159: undefined reference to `crypto_aead_ascon80pqv12_esp32_timingleaks_encrypt'
try.c: collect2: error: ld returned 1 exit status
Number of similar (implementation,compiler) pairs: 1, namely:
Implementation | Compiler |
T:esp32 | gcc -march=native -mtune=native -O2 -fwrapv -fPIC -fPIE -gdwarf-4 -Wall (10.2.1_20210110) |
Compiler output
try.c: /usr/bin/ld: /tmp/ccDQtaUA.o: in function `doit':
try.c: .../supercop-data/jasper/amd64/try/c/gcc_-march=native_-mtune=native_-O3_-fwrapv_-fPIC_-fPIE_-gdwarf-4_-Wall/timingleaks/crypto_aead/ascon80pqv12/esp32/work/try.c:133: undefined reference to `crypto_aead_ascon80pqv12_esp32_timingleaks_encrypt'
try.c: /usr/bin/ld: .../supercop-data/jasper/amd64/try/c/gcc_-march=native_-mtune=native_-O3_-fwrapv_-fPIC_-fPIE_-gdwarf-4_-Wall/timingleaks/crypto_aead/ascon80pqv12/esp32/work/try.c:135: undefined reference to `crypto_aead_ascon80pqv12_esp32_timingleaks_decrypt'
try.c: /usr/bin/ld: /tmp/ccDQtaUA.o: in function `test':
try.c: .../supercop-data/jasper/amd64/try/c/gcc_-march=native_-mtune=native_-O3_-fwrapv_-fPIC_-fPIE_-gdwarf-4_-Wall/timingleaks/crypto_aead/ascon80pqv12/esp32/work/try.c:189: undefined reference to `crypto_aead_ascon80pqv12_esp32_timingleaks_encrypt'
try.c: /usr/bin/ld: .../supercop-data/jasper/amd64/try/c/gcc_-march=native_-mtune=native_-O3_-fwrapv_-fPIC_-fPIE_-gdwarf-4_-Wall/timingleaks/crypto_aead/ascon80pqv12/esp32/work/try.c:300: undefined reference to `crypto_aead_ascon80pqv12_esp32_timingleaks_decrypt'
try.c: /usr/bin/ld: .../supercop-data/jasper/amd64/try/c/gcc_-march=native_-mtune=native_-O3_-fwrapv_-fPIC_-fPIE_-gdwarf-4_-Wall/timingleaks/crypto_aead/ascon80pqv12/esp32/work/try.c:331: undefined reference to `crypto_aead_ascon80pqv12_esp32_timingleaks_decrypt'
try.c: /usr/bin/ld: .../supercop-data/jasper/amd64/try/c/gcc_-march=native_-mtune=native_-O3_-fwrapv_-fPIC_-fPIE_-gdwarf-4_-Wall/timingleaks/crypto_aead/ascon80pqv12/esp32/work/try.c:476: undefined reference to `crypto_aead_ascon80pqv12_esp32_timingleaks_decrypt'
try.c: /usr/bin/ld: .../supercop-data/jasper/amd64/try/c/gcc_-march=native_-mtune=native_-O3_-fwrapv_-fPIC_-fPIE_-gdwarf-4_-Wall/timingleaks/crypto_aead/ascon80pqv12/esp32/work/try.c:480: undefined reference to `crypto_aead_ascon80pqv12_esp32_timingleaks_decrypt'
try.c: /usr/bin/ld: .../supercop-data/jasper/amd64/try/c/gcc_-march=native_-mtune=native_-O3_-fwrapv_-fPIC_-fPIE_-gdwarf-4_-Wall/timingleaks/crypto_aead/ascon80pqv12/esp32/work/try.c:484: undefined reference to `crypto_aead_ascon80pqv12_esp32_timingleaks_decrypt'
try.c: /usr/bin/ld: .../supercop-data/jasper/amd64/try/c/gcc_-march=native_-mtune=native_-O3_-fwrapv_-fPIC_-fPIE_-gdwarf-4_-Wall/timingleaks/crypto_aead/ascon80pqv12/esp32/work/try.c:159: undefined reference to `crypto_aead_ascon80pqv12_esp32_timingleaks_encrypt'
try.c: collect2: error: ld returned 1 exit status
Number of similar (implementation,compiler) pairs: 1, namely:
Implementation | Compiler |
T:esp32 | gcc -march=native -mtune=native -O3 -fwrapv -fPIC -fPIE -gdwarf-4 -Wall (10.2.1_20210110) |
Compiler output
try.c: /usr/bin/ld: /tmp/ccNKqltk.o: in function `doit':
try.c: .../supercop-data/jasper/amd64/try/c/gcc_-march=native_-mtune=native_-O_-fwrapv_-fPIC_-fPIE_-gdwarf-4_-Wall/timingleaks/crypto_aead/ascon80pqv12/esp32/work/try.c:133: undefined reference to `crypto_aead_ascon80pqv12_esp32_timingleaks_encrypt'
try.c: /usr/bin/ld: .../supercop-data/jasper/amd64/try/c/gcc_-march=native_-mtune=native_-O_-fwrapv_-fPIC_-fPIE_-gdwarf-4_-Wall/timingleaks/crypto_aead/ascon80pqv12/esp32/work/try.c:135: undefined reference to `crypto_aead_ascon80pqv12_esp32_timingleaks_decrypt'
try.c: /usr/bin/ld: /tmp/ccNKqltk.o: in function `test':
try.c: .../supercop-data/jasper/amd64/try/c/gcc_-march=native_-mtune=native_-O_-fwrapv_-fPIC_-fPIE_-gdwarf-4_-Wall/timingleaks/crypto_aead/ascon80pqv12/esp32/work/try.c:159: undefined reference to `crypto_aead_ascon80pqv12_esp32_timingleaks_encrypt'
try.c: /usr/bin/ld: .../supercop-data/jasper/amd64/try/c/gcc_-march=native_-mtune=native_-O_-fwrapv_-fPIC_-fPIE_-gdwarf-4_-Wall/timingleaks/crypto_aead/ascon80pqv12/esp32/work/try.c:189: undefined reference to `crypto_aead_ascon80pqv12_esp32_timingleaks_encrypt'
try.c: /usr/bin/ld: .../supercop-data/jasper/amd64/try/c/gcc_-march=native_-mtune=native_-O_-fwrapv_-fPIC_-fPIE_-gdwarf-4_-Wall/timingleaks/crypto_aead/ascon80pqv12/esp32/work/try.c:300: undefined reference to `crypto_aead_ascon80pqv12_esp32_timingleaks_decrypt'
try.c: /usr/bin/ld: .../supercop-data/jasper/amd64/try/c/gcc_-march=native_-mtune=native_-O_-fwrapv_-fPIC_-fPIE_-gdwarf-4_-Wall/timingleaks/crypto_aead/ascon80pqv12/esp32/work/try.c:331: undefined reference to `crypto_aead_ascon80pqv12_esp32_timingleaks_decrypt'
try.c: /usr/bin/ld: .../supercop-data/jasper/amd64/try/c/gcc_-march=native_-mtune=native_-O_-fwrapv_-fPIC_-fPIE_-gdwarf-4_-Wall/timingleaks/crypto_aead/ascon80pqv12/esp32/work/try.c:476: undefined reference to `crypto_aead_ascon80pqv12_esp32_timingleaks_decrypt'
try.c: /usr/bin/ld: .../supercop-data/jasper/amd64/try/c/gcc_-march=native_-mtune=native_-O_-fwrapv_-fPIC_-fPIE_-gdwarf-4_-Wall/timingleaks/crypto_aead/ascon80pqv12/esp32/work/try.c:480: undefined reference to `crypto_aead_ascon80pqv12_esp32_timingleaks_decrypt'
try.c: /usr/bin/ld: .../supercop-data/jasper/amd64/try/c/gcc_-march=native_-mtune=native_-O_-fwrapv_-fPIC_-fPIE_-gdwarf-4_-Wall/timingleaks/crypto_aead/ascon80pqv12/esp32/work/try.c:484: undefined reference to `crypto_aead_ascon80pqv12_esp32_timingleaks_decrypt'
try.c: collect2: error: ld returned 1 exit status
Number of similar (implementation,compiler) pairs: 1, namely:
Implementation | Compiler |
T:esp32 | gcc -march=native -mtune=native -O -fwrapv -fPIC -fPIE -gdwarf-4 -Wall (10.2.1_20210110) |
Compiler output
try.c: /usr/bin/ld: /tmp/cceu0IdW.o: in function `doit':
try.c: .../supercop-data/jasper/amd64/try/c/gcc_-march=native_-mtune=native_-Os_-fwrapv_-fPIC_-fPIE_-gdwarf-4_-Wall/timingleaks/crypto_aead/ascon80pqv12/esp32/work/try.c:133: undefined reference to `crypto_aead_ascon80pqv12_esp32_timingleaks_encrypt'
try.c: /usr/bin/ld: .../supercop-data/jasper/amd64/try/c/gcc_-march=native_-mtune=native_-Os_-fwrapv_-fPIC_-fPIE_-gdwarf-4_-Wall/timingleaks/crypto_aead/ascon80pqv12/esp32/work/try.c:135: undefined reference to `crypto_aead_ascon80pqv12_esp32_timingleaks_decrypt'
try.c: /usr/bin/ld: /tmp/cceu0IdW.o: in function `test':
try.c: .../supercop-data/jasper/amd64/try/c/gcc_-march=native_-mtune=native_-Os_-fwrapv_-fPIC_-fPIE_-gdwarf-4_-Wall/timingleaks/crypto_aead/ascon80pqv12/esp32/work/try.c:159: undefined reference to `crypto_aead_ascon80pqv12_esp32_timingleaks_encrypt'
try.c: /usr/bin/ld: .../supercop-data/jasper/amd64/try/c/gcc_-march=native_-mtune=native_-Os_-fwrapv_-fPIC_-fPIE_-gdwarf-4_-Wall/timingleaks/crypto_aead/ascon80pqv12/esp32/work/try.c:189: undefined reference to `crypto_aead_ascon80pqv12_esp32_timingleaks_encrypt'
try.c: /usr/bin/ld: .../supercop-data/jasper/amd64/try/c/gcc_-march=native_-mtune=native_-Os_-fwrapv_-fPIC_-fPIE_-gdwarf-4_-Wall/timingleaks/crypto_aead/ascon80pqv12/esp32/work/try.c:300: undefined reference to `crypto_aead_ascon80pqv12_esp32_timingleaks_decrypt'
try.c: /usr/bin/ld: .../supercop-data/jasper/amd64/try/c/gcc_-march=native_-mtune=native_-Os_-fwrapv_-fPIC_-fPIE_-gdwarf-4_-Wall/timingleaks/crypto_aead/ascon80pqv12/esp32/work/try.c:331: undefined reference to `crypto_aead_ascon80pqv12_esp32_timingleaks_decrypt'
try.c: /usr/bin/ld: .../supercop-data/jasper/amd64/try/c/gcc_-march=native_-mtune=native_-Os_-fwrapv_-fPIC_-fPIE_-gdwarf-4_-Wall/timingleaks/crypto_aead/ascon80pqv12/esp32/work/try.c:476: undefined reference to `crypto_aead_ascon80pqv12_esp32_timingleaks_decrypt'
try.c: /usr/bin/ld: .../supercop-data/jasper/amd64/try/c/gcc_-march=native_-mtune=native_-Os_-fwrapv_-fPIC_-fPIE_-gdwarf-4_-Wall/timingleaks/crypto_aead/ascon80pqv12/esp32/work/try.c:480: undefined reference to `crypto_aead_ascon80pqv12_esp32_timingleaks_decrypt'
try.c: /usr/bin/ld: .../supercop-data/jasper/amd64/try/c/gcc_-march=native_-mtune=native_-Os_-fwrapv_-fPIC_-fPIE_-gdwarf-4_-Wall/timingleaks/crypto_aead/ascon80pqv12/esp32/work/try.c:484: undefined reference to `crypto_aead_ascon80pqv12_esp32_timingleaks_decrypt'
try.c: collect2: error: ld returned 1 exit status
Number of similar (implementation,compiler) pairs: 1, namely:
Implementation | Compiler |
T:esp32 | gcc -march=native -mtune=native -Os -fwrapv -fPIC -fPIE -gdwarf-4 -Wall (10.2.1_20210110) |
Compiler output
aead.c: In file included from round.h:8,
aead.c: from permutations.h:11,
aead.c: from aead.c:4:
aead.c: word.h:32:11: warning: 'crypto_int64_bitmod_01' is static but used in inline function 'NOTZERO' which is not static
aead.c: 32 | return (crypto_int64_bitmod_01(((int)(result & 0xff) - 1),8)) - 1;
aead.c: | ^~~~~~~~~~~~~~~~~~~~~~
permutations.c: In file included from round.h:8,
permutations.c: from permutations.h:11,
permutations.c: from permutations.c:1:
permutations.c: word.h:32:11: warning: 'crypto_int64_bitmod_01' is static but used in inline function 'NOTZERO' which is not static
permutations.c: 32 | return (crypto_int64_bitmod_01(((int)(result & 0xff) - 1),8)) - 1;
permutations.c: | ^~~~~~~~~~~~~~~~~~~~~~
Number of similar (implementation,compiler) pairs: 8, namely:
Implementation | Compiler |
opt32 | gcc -march=native -mtune=native -O2 -fwrapv -fPIC -fPIE -gdwarf-4 -Wall (10.2.1_20210110) |
opt32 | gcc -march=native -mtune=native -O3 -fwrapv -fPIC -fPIE -gdwarf-4 -Wall (10.2.1_20210110) |
opt32 | gcc -march=native -mtune=native -O -fwrapv -fPIC -fPIE -gdwarf-4 -Wall (10.2.1_20210110) |
opt32 | gcc -march=native -mtune=native -Os -fwrapv -fPIC -fPIE -gdwarf-4 -Wall (10.2.1_20210110) |
opt64 | gcc -march=native -mtune=native -O2 -fwrapv -fPIC -fPIE -gdwarf-4 -Wall (10.2.1_20210110) |
opt64 | gcc -march=native -mtune=native -O3 -fwrapv -fPIC -fPIE -gdwarf-4 -Wall (10.2.1_20210110) |
opt64 | gcc -march=native -mtune=native -O -fwrapv -fPIC -fPIE -gdwarf-4 -Wall (10.2.1_20210110) |
opt64 | gcc -march=native -mtune=native -Os -fwrapv -fPIC -fPIE -gdwarf-4 -Wall (10.2.1_20210110) |
Compiler output
aead.c: In file included from round.h:8,
aead.c: from permutations.h:11,
aead.c: from aead.c:3:
aead.c: word.h:32:11: warning: 'crypto_int64_bitmod_01' is static but used in inline function 'NOTZERO' which is not static
aead.c: 32 | return (crypto_int64_bitmod_01(((int)(result & 0xff) - 1),8)) - 1;
aead.c: | ^~~~~~~~~~~~~~~~~~~~~~
crypto_aead.c: In file included from round.h:8,
crypto_aead.c: from permutations.h:11,
crypto_aead.c: from crypto_aead.c:8:
crypto_aead.c: word.h:32:11: warning: 'crypto_int64_bitmod_01' is static but used in inline function 'NOTZERO' which is not static
crypto_aead.c: 32 | return (crypto_int64_bitmod_01(((int)(result & 0xff) - 1),8)) - 1;
crypto_aead.c: | ^~~~~~~~~~~~~~~~~~~~~~
permutations.c: In file included from round.h:8,
permutations.c: from permutations.h:11,
permutations.c: from permutations.c:1:
permutations.c: word.h:32:11: warning: 'crypto_int64_bitmod_01' is static but used in inline function 'NOTZERO' which is not static
permutations.c: 32 | return (crypto_int64_bitmod_01(((int)(result & 0xff) - 1),8)) - 1;
permutations.c: | ^~~~~~~~~~~~~~~~~~~~~~
update.c: update.c: In function 'ascon_update':
update.c: update.c:21:13: warning: unused variable 'rate' [-Wunused-variable]
update.c: 21 | const int rate = ASCON_AEAD_RATE;
update.c: | ^~~~
update.c: In file included from round.h:8,
update.c: from permutations.h:11,
update.c: from update.c:3:
update.c: update.c: At top level:
update.c: word.h:32:11: warning: 'crypto_int64_bitmod_01' is static but used in inline function 'NOTZERO' which is not static
update.c: 32 | return (crypto_int64_bitmod_01(((int)(result & 0xff) - 1),8)) - 1;
update.c: | ^~~~~~~~~~~~~~~~~~~~~~
Number of similar (implementation,compiler) pairs: 8, namely:
Implementation | Compiler |
opt32_lowsize | gcc -march=native -mtune=native -O2 -fwrapv -fPIC -fPIE -gdwarf-4 -Wall (10.2.1_20210110) |
opt32_lowsize | gcc -march=native -mtune=native -O3 -fwrapv -fPIC -fPIE -gdwarf-4 -Wall (10.2.1_20210110) |
opt32_lowsize | gcc -march=native -mtune=native -O -fwrapv -fPIC -fPIE -gdwarf-4 -Wall (10.2.1_20210110) |
opt32_lowsize | gcc -march=native -mtune=native -Os -fwrapv -fPIC -fPIE -gdwarf-4 -Wall (10.2.1_20210110) |
opt64_lowsize | gcc -march=native -mtune=native -O2 -fwrapv -fPIC -fPIE -gdwarf-4 -Wall (10.2.1_20210110) |
opt64_lowsize | gcc -march=native -mtune=native -O3 -fwrapv -fPIC -fPIE -gdwarf-4 -Wall (10.2.1_20210110) |
opt64_lowsize | gcc -march=native -mtune=native -O -fwrapv -fPIC -fPIE -gdwarf-4 -Wall (10.2.1_20210110) |
opt64_lowsize | gcc -march=native -mtune=native -Os -fwrapv -fPIC -fPIE -gdwarf-4 -Wall (10.2.1_20210110) |
Compiler output
aead.c: In file included from round.h:8,
aead.c: from permutations.h:11,
aead.c: from aead.c:5:
aead.c: word.h:61:11: warning: 'crypto_int64_bitmod_01' is static but used in inline function 'NOTZERO' which is not static
aead.c: 61 | return (crypto_int64_bitmod_01(((int)(result & 0xff) - 1),8)) - 1;
aead.c: | ^~~~~~~~~~~~~~~~~~~~~~
permutations.c: In file included from round.h:8,
permutations.c: from permutations.h:11,
permutations.c: from permutations.c:1:
permutations.c: word.h:61:11: warning: 'crypto_int64_bitmod_01' is static but used in inline function 'NOTZERO' which is not static
permutations.c: 61 | return (crypto_int64_bitmod_01(((int)(result & 0xff) - 1),8)) - 1;
permutations.c: | ^~~~~~~~~~~~~~~~~~~~~~
Number of similar (implementation,compiler) pairs: 4, namely:
Implementation | Compiler |
opt8 | gcc -march=native -mtune=native -O2 -fwrapv -fPIC -fPIE -gdwarf-4 -Wall (10.2.1_20210110) |
opt8 | gcc -march=native -mtune=native -O3 -fwrapv -fPIC -fPIE -gdwarf-4 -Wall (10.2.1_20210110) |
opt8 | gcc -march=native -mtune=native -O -fwrapv -fPIC -fPIE -gdwarf-4 -Wall (10.2.1_20210110) |
opt8 | gcc -march=native -mtune=native -Os -fwrapv -fPIC -fPIE -gdwarf-4 -Wall (10.2.1_20210110) |
Compiler output
aead.c: In file included from round.h:8,
aead.c: from permutations.h:11,
aead.c: from aead.c:5:
aead.c: word.h:61:11: warning: 'crypto_int64_bitmod_01' is static but used in inline function 'NOTZERO' which is not static
aead.c: 61 | return (crypto_int64_bitmod_01(((int)(result & 0xff) - 1),8)) - 1;
aead.c: | ^~~~~~~~~~~~~~~~~~~~~~
permutations.c: In file included from round.h:8,
permutations.c: from permutations.h:11,
permutations.c: from permutations.c:1:
permutations.c: word.h:61:11: warning: 'crypto_int64_bitmod_01' is static but used in inline function 'NOTZERO' which is not static
permutations.c: 61 | return (crypto_int64_bitmod_01(((int)(result & 0xff) - 1),8)) - 1;
permutations.c: | ^~~~~~~~~~~~~~~~~~~~~~
update.c: In file included from round.h:8,
update.c: from permutations.h:11,
update.c: from update.c:3:
update.c: word.h:61:11: warning: 'crypto_int64_bitmod_01' is static but used in inline function 'NOTZERO' which is not static
update.c: 61 | return (crypto_int64_bitmod_01(((int)(result & 0xff) - 1),8)) - 1;
update.c: | ^~~~~~~~~~~~~~~~~~~~~~
Number of similar (implementation,compiler) pairs: 4, namely:
Implementation | Compiler |
opt8_lowsize | gcc -march=native -mtune=native -O2 -fwrapv -fPIC -fPIE -gdwarf-4 -Wall (10.2.1_20210110) |
opt8_lowsize | gcc -march=native -mtune=native -O3 -fwrapv -fPIC -fPIE -gdwarf-4 -Wall (10.2.1_20210110) |
opt8_lowsize | gcc -march=native -mtune=native -O -fwrapv -fPIC -fPIE -gdwarf-4 -Wall (10.2.1_20210110) |
opt8_lowsize | gcc -march=native -mtune=native -Os -fwrapv -fPIC -fPIE -gdwarf-4 -Wall (10.2.1_20210110) |
Namespace violations
constants.o constants R
interleave.o B R
permutations.o P12 T
permutations.o P6 T
Number of similar (implementation,compiler) pairs: 9, namely:
Implementation | Compiler |
bi32 | clang -march=native -O2 -fwrapv -Qunused-arguments -fPIC -fPIE -gdwarf-4 -Wall (Debian_Clang_11.0.1) |
bi32 | clang -march=native -O3 -fwrapv -Qunused-arguments -fPIC -fPIE -gdwarf-4 -Wall (Debian_Clang_11.0.1) |
bi32 | clang -march=native -O -fwrapv -Qunused-arguments -fPIC -fPIE -gdwarf-4 -Wall (Debian_Clang_11.0.1) |
bi32 | clang -march=native -Os -fwrapv -Qunused-arguments -fPIC -fPIE -gdwarf-4 -Wall (Debian_Clang_11.0.1) |
bi32 | clang -mcpu=native -O3 -fwrapv -Qunused-arguments -fPIC -fPIE -gdwarf-4 -Wall (Debian_Clang_11.0.1) |
bi32 | gcc -march=native -mtune=native -O2 -fwrapv -fPIC -fPIE -gdwarf-4 -Wall (10.2.1_20210110) |
bi32 | gcc -march=native -mtune=native -O3 -fwrapv -fPIC -fPIE -gdwarf-4 -Wall (10.2.1_20210110) |
bi32 | gcc -march=native -mtune=native -O -fwrapv -fPIC -fPIE -gdwarf-4 -Wall (10.2.1_20210110) |
bi32 | gcc -march=native -mtune=native -Os -fwrapv -fPIC -fPIE -gdwarf-4 -Wall (10.2.1_20210110) |
Namespace violations
aead.o ascon_adata T
aead.o ascon_decrypt T
aead.o ascon_encrypt T
aead.o ascon_final T
aead.o ascon_initaead T
aead.o ascon_loadkey T
constants.o constants R
interleave.o B R
Number of similar (implementation,compiler) pairs: 9, namely:
Implementation | Compiler |
bi32_lowreg | clang -march=native -O2 -fwrapv -Qunused-arguments -fPIC -fPIE -gdwarf-4 -Wall (Debian_Clang_11.0.1) |
bi32_lowreg | clang -march=native -O3 -fwrapv -Qunused-arguments -fPIC -fPIE -gdwarf-4 -Wall (Debian_Clang_11.0.1) |
bi32_lowreg | clang -march=native -O -fwrapv -Qunused-arguments -fPIC -fPIE -gdwarf-4 -Wall (Debian_Clang_11.0.1) |
bi32_lowreg | clang -march=native -Os -fwrapv -Qunused-arguments -fPIC -fPIE -gdwarf-4 -Wall (Debian_Clang_11.0.1) |
bi32_lowreg | clang -mcpu=native -O3 -fwrapv -Qunused-arguments -fPIC -fPIE -gdwarf-4 -Wall (Debian_Clang_11.0.1) |
bi32_lowreg | gcc -march=native -mtune=native -O2 -fwrapv -fPIC -fPIE -gdwarf-4 -Wall (10.2.1_20210110) |
bi32_lowreg | gcc -march=native -mtune=native -O3 -fwrapv -fPIC -fPIE -gdwarf-4 -Wall (10.2.1_20210110) |
bi32_lowreg | gcc -march=native -mtune=native -O -fwrapv -fPIC -fPIE -gdwarf-4 -Wall (10.2.1_20210110) |
bi32_lowreg | gcc -march=native -mtune=native -Os -fwrapv -fPIC -fPIE -gdwarf-4 -Wall (10.2.1_20210110) |
Namespace violations
aead.o ascon_aead T
constants.o constants R
interleave.o B R
interleave.o FROMBI T
interleave.o TOBI T
permutations.o P T
update.o ascon_update T
Number of similar (implementation,compiler) pairs: 9, namely:
Implementation | Compiler |
bi32_lowsize | clang -march=native -O2 -fwrapv -Qunused-arguments -fPIC -fPIE -gdwarf-4 -Wall (Debian_Clang_11.0.1) |
bi32_lowsize | clang -march=native -O3 -fwrapv -Qunused-arguments -fPIC -fPIE -gdwarf-4 -Wall (Debian_Clang_11.0.1) |
bi32_lowsize | clang -march=native -O -fwrapv -Qunused-arguments -fPIC -fPIE -gdwarf-4 -Wall (Debian_Clang_11.0.1) |
bi32_lowsize | clang -march=native -Os -fwrapv -Qunused-arguments -fPIC -fPIE -gdwarf-4 -Wall (Debian_Clang_11.0.1) |
bi32_lowsize | clang -mcpu=native -O3 -fwrapv -Qunused-arguments -fPIC -fPIE -gdwarf-4 -Wall (Debian_Clang_11.0.1) |
bi32_lowsize | gcc -march=native -mtune=native -O2 -fwrapv -fPIC -fPIE -gdwarf-4 -Wall (10.2.1_20210110) |
bi32_lowsize | gcc -march=native -mtune=native -O3 -fwrapv -fPIC -fPIE -gdwarf-4 -Wall (10.2.1_20210110) |
bi32_lowsize | gcc -march=native -mtune=native -O -fwrapv -fPIC -fPIE -gdwarf-4 -Wall (10.2.1_20210110) |
bi32_lowsize | gcc -march=native -mtune=native -Os -fwrapv -fPIC -fPIE -gdwarf-4 -Wall (10.2.1_20210110) |
Namespace violations
constants.o constants R
interleave.o FROMBI T
interleave.o TOBI T
permutations.o P T
Number of similar (implementation,compiler) pairs: 9, namely:
Implementation | Compiler |
bi8 | clang -march=native -O2 -fwrapv -Qunused-arguments -fPIC -fPIE -gdwarf-4 -Wall (Debian_Clang_11.0.1) |
bi8 | clang -march=native -O3 -fwrapv -Qunused-arguments -fPIC -fPIE -gdwarf-4 -Wall (Debian_Clang_11.0.1) |
bi8 | clang -march=native -O -fwrapv -Qunused-arguments -fPIC -fPIE -gdwarf-4 -Wall (Debian_Clang_11.0.1) |
bi8 | clang -march=native -Os -fwrapv -Qunused-arguments -fPIC -fPIE -gdwarf-4 -Wall (Debian_Clang_11.0.1) |
bi8 | clang -mcpu=native -O3 -fwrapv -Qunused-arguments -fPIC -fPIE -gdwarf-4 -Wall (Debian_Clang_11.0.1) |
bi8 | gcc -march=native -mtune=native -O2 -fwrapv -fPIC -fPIE -gdwarf-4 -Wall (10.2.1_20210110) |
bi8 | gcc -march=native -mtune=native -O3 -fwrapv -fPIC -fPIE -gdwarf-4 -Wall (10.2.1_20210110) |
bi8 | gcc -march=native -mtune=native -O -fwrapv -fPIC -fPIE -gdwarf-4 -Wall (10.2.1_20210110) |
bi8 | gcc -march=native -mtune=native -Os -fwrapv -fPIC -fPIE -gdwarf-4 -Wall (10.2.1_20210110) |
Namespace violations
aead.o ascon_aead T
permutations.o P T
update.o ascon_update T
Number of similar (implementation,compiler) pairs: 18, namely:
Implementation | Compiler |
opt32_lowsize | clang -march=native -O2 -fwrapv -Qunused-arguments -fPIC -fPIE -gdwarf-4 -Wall (Debian_Clang_11.0.1) |
opt32_lowsize | clang -march=native -O3 -fwrapv -Qunused-arguments -fPIC -fPIE -gdwarf-4 -Wall (Debian_Clang_11.0.1) |
opt32_lowsize | clang -march=native -O -fwrapv -Qunused-arguments -fPIC -fPIE -gdwarf-4 -Wall (Debian_Clang_11.0.1) |
opt32_lowsize | clang -march=native -Os -fwrapv -Qunused-arguments -fPIC -fPIE -gdwarf-4 -Wall (Debian_Clang_11.0.1) |
opt32_lowsize | clang -mcpu=native -O3 -fwrapv -Qunused-arguments -fPIC -fPIE -gdwarf-4 -Wall (Debian_Clang_11.0.1) |
opt32_lowsize | gcc -march=native -mtune=native -O2 -fwrapv -fPIC -fPIE -gdwarf-4 -Wall (10.2.1_20210110) |
opt32_lowsize | gcc -march=native -mtune=native -O3 -fwrapv -fPIC -fPIE -gdwarf-4 -Wall (10.2.1_20210110) |
opt32_lowsize | gcc -march=native -mtune=native -O -fwrapv -fPIC -fPIE -gdwarf-4 -Wall (10.2.1_20210110) |
opt32_lowsize | gcc -march=native -mtune=native -Os -fwrapv -fPIC -fPIE -gdwarf-4 -Wall (10.2.1_20210110) |
opt64_lowsize | clang -march=native -O2 -fwrapv -Qunused-arguments -fPIC -fPIE -gdwarf-4 -Wall (Debian_Clang_11.0.1) |
opt64_lowsize | clang -march=native -O3 -fwrapv -Qunused-arguments -fPIC -fPIE -gdwarf-4 -Wall (Debian_Clang_11.0.1) |
opt64_lowsize | clang -march=native -O -fwrapv -Qunused-arguments -fPIC -fPIE -gdwarf-4 -Wall (Debian_Clang_11.0.1) |
opt64_lowsize | clang -march=native -Os -fwrapv -Qunused-arguments -fPIC -fPIE -gdwarf-4 -Wall (Debian_Clang_11.0.1) |
opt64_lowsize | clang -mcpu=native -O3 -fwrapv -Qunused-arguments -fPIC -fPIE -gdwarf-4 -Wall (Debian_Clang_11.0.1) |
opt64_lowsize | gcc -march=native -mtune=native -O2 -fwrapv -fPIC -fPIE -gdwarf-4 -Wall (10.2.1_20210110) |
opt64_lowsize | gcc -march=native -mtune=native -O3 -fwrapv -fPIC -fPIE -gdwarf-4 -Wall (10.2.1_20210110) |
opt64_lowsize | gcc -march=native -mtune=native -O -fwrapv -fPIC -fPIE -gdwarf-4 -Wall (10.2.1_20210110) |
opt64_lowsize | gcc -march=native -mtune=native -Os -fwrapv -fPIC -fPIE -gdwarf-4 -Wall (10.2.1_20210110) |
Namespace violations
aead.o ascon_adata T
aead.o ascon_decrypt T
aead.o ascon_encrypt T
aead.o ascon_final T
aead.o ascon_initaead T
aead.o ascon_loadkey T
permutations.o P T
Number of similar (implementation,compiler) pairs: 9, namely:
Implementation | Compiler |
opt8 | clang -march=native -O2 -fwrapv -Qunused-arguments -fPIC -fPIE -gdwarf-4 -Wall (Debian_Clang_11.0.1) |
opt8 | clang -march=native -O3 -fwrapv -Qunused-arguments -fPIC -fPIE -gdwarf-4 -Wall (Debian_Clang_11.0.1) |
opt8 | clang -march=native -O -fwrapv -Qunused-arguments -fPIC -fPIE -gdwarf-4 -Wall (Debian_Clang_11.0.1) |
opt8 | clang -march=native -Os -fwrapv -Qunused-arguments -fPIC -fPIE -gdwarf-4 -Wall (Debian_Clang_11.0.1) |
opt8 | clang -mcpu=native -O3 -fwrapv -Qunused-arguments -fPIC -fPIE -gdwarf-4 -Wall (Debian_Clang_11.0.1) |
opt8 | gcc -march=native -mtune=native -O2 -fwrapv -fPIC -fPIE -gdwarf-4 -Wall (10.2.1_20210110) |
opt8 | gcc -march=native -mtune=native -O3 -fwrapv -fPIC -fPIE -gdwarf-4 -Wall (10.2.1_20210110) |
opt8 | gcc -march=native -mtune=native -O -fwrapv -fPIC -fPIE -gdwarf-4 -Wall (10.2.1_20210110) |
opt8 | gcc -march=native -mtune=native -Os -fwrapv -fPIC -fPIE -gdwarf-4 -Wall (10.2.1_20210110) |
Namespace violations
aead.o ascon_final T
aead.o ascon_initaead T
aead.o ascon_loadkey T
permutations.o P T
update.o ascon_update T
Number of similar (implementation,compiler) pairs: 9, namely:
Implementation | Compiler |
opt8_lowsize | clang -march=native -O2 -fwrapv -Qunused-arguments -fPIC -fPIE -gdwarf-4 -Wall (Debian_Clang_11.0.1) |
opt8_lowsize | clang -march=native -O3 -fwrapv -Qunused-arguments -fPIC -fPIE -gdwarf-4 -Wall (Debian_Clang_11.0.1) |
opt8_lowsize | clang -march=native -O -fwrapv -Qunused-arguments -fPIC -fPIE -gdwarf-4 -Wall (Debian_Clang_11.0.1) |
opt8_lowsize | clang -march=native -Os -fwrapv -Qunused-arguments -fPIC -fPIE -gdwarf-4 -Wall (Debian_Clang_11.0.1) |
opt8_lowsize | clang -mcpu=native -O3 -fwrapv -Qunused-arguments -fPIC -fPIE -gdwarf-4 -Wall (Debian_Clang_11.0.1) |
opt8_lowsize | gcc -march=native -mtune=native -O2 -fwrapv -fPIC -fPIE -gdwarf-4 -Wall (10.2.1_20210110) |
opt8_lowsize | gcc -march=native -mtune=native -O3 -fwrapv -fPIC -fPIE -gdwarf-4 -Wall (10.2.1_20210110) |
opt8_lowsize | gcc -march=native -mtune=native -O -fwrapv -fPIC -fPIE -gdwarf-4 -Wall (10.2.1_20210110) |
opt8_lowsize | gcc -march=native -mtune=native -Os -fwrapv -fPIC -fPIE -gdwarf-4 -Wall (10.2.1_20210110) |
Passed TIMECOP
TIMECOP iterations: 10
Number of similar (implementation,compiler) pairs: 99, namely:
Implementation | Compiler |
bi32 | clang -march=native -O2 -fwrapv -Qunused-arguments -fPIC -fPIE -gdwarf-4 -Wall (Debian_Clang_11.0.1) |
bi32 | clang -march=native -O3 -fwrapv -Qunused-arguments -fPIC -fPIE -gdwarf-4 -Wall (Debian_Clang_11.0.1) |
bi32 | clang -march=native -O -fwrapv -Qunused-arguments -fPIC -fPIE -gdwarf-4 -Wall (Debian_Clang_11.0.1) |
bi32 | clang -march=native -Os -fwrapv -Qunused-arguments -fPIC -fPIE -gdwarf-4 -Wall (Debian_Clang_11.0.1) |
bi32 | clang -mcpu=native -O3 -fwrapv -Qunused-arguments -fPIC -fPIE -gdwarf-4 -Wall (Debian_Clang_11.0.1) |
bi32 | gcc -march=native -mtune=native -O2 -fwrapv -fPIC -fPIE -gdwarf-4 -Wall (10.2.1_20210110) |
bi32 | gcc -march=native -mtune=native -O3 -fwrapv -fPIC -fPIE -gdwarf-4 -Wall (10.2.1_20210110) |
bi32 | gcc -march=native -mtune=native -O -fwrapv -fPIC -fPIE -gdwarf-4 -Wall (10.2.1_20210110) |
bi32 | gcc -march=native -mtune=native -Os -fwrapv -fPIC -fPIE -gdwarf-4 -Wall (10.2.1_20210110) |
bi32_lowreg | clang -march=native -O2 -fwrapv -Qunused-arguments -fPIC -fPIE -gdwarf-4 -Wall (Debian_Clang_11.0.1) |
bi32_lowreg | clang -march=native -O3 -fwrapv -Qunused-arguments -fPIC -fPIE -gdwarf-4 -Wall (Debian_Clang_11.0.1) |
bi32_lowreg | clang -march=native -O -fwrapv -Qunused-arguments -fPIC -fPIE -gdwarf-4 -Wall (Debian_Clang_11.0.1) |
bi32_lowreg | clang -march=native -Os -fwrapv -Qunused-arguments -fPIC -fPIE -gdwarf-4 -Wall (Debian_Clang_11.0.1) |
bi32_lowreg | clang -mcpu=native -O3 -fwrapv -Qunused-arguments -fPIC -fPIE -gdwarf-4 -Wall (Debian_Clang_11.0.1) |
bi32_lowreg | gcc -march=native -mtune=native -O2 -fwrapv -fPIC -fPIE -gdwarf-4 -Wall (10.2.1_20210110) |
bi32_lowreg | gcc -march=native -mtune=native -O3 -fwrapv -fPIC -fPIE -gdwarf-4 -Wall (10.2.1_20210110) |
bi32_lowreg | gcc -march=native -mtune=native -O -fwrapv -fPIC -fPIE -gdwarf-4 -Wall (10.2.1_20210110) |
bi32_lowreg | gcc -march=native -mtune=native -Os -fwrapv -fPIC -fPIE -gdwarf-4 -Wall (10.2.1_20210110) |
bi32_lowsize | clang -march=native -O2 -fwrapv -Qunused-arguments -fPIC -fPIE -gdwarf-4 -Wall (Debian_Clang_11.0.1) |
bi32_lowsize | clang -march=native -O3 -fwrapv -Qunused-arguments -fPIC -fPIE -gdwarf-4 -Wall (Debian_Clang_11.0.1) |
bi32_lowsize | clang -march=native -O -fwrapv -Qunused-arguments -fPIC -fPIE -gdwarf-4 -Wall (Debian_Clang_11.0.1) |
bi32_lowsize | clang -march=native -Os -fwrapv -Qunused-arguments -fPIC -fPIE -gdwarf-4 -Wall (Debian_Clang_11.0.1) |
bi32_lowsize | clang -mcpu=native -O3 -fwrapv -Qunused-arguments -fPIC -fPIE -gdwarf-4 -Wall (Debian_Clang_11.0.1) |
bi32_lowsize | gcc -march=native -mtune=native -O2 -fwrapv -fPIC -fPIE -gdwarf-4 -Wall (10.2.1_20210110) |
bi32_lowsize | gcc -march=native -mtune=native -O3 -fwrapv -fPIC -fPIE -gdwarf-4 -Wall (10.2.1_20210110) |
bi32_lowsize | gcc -march=native -mtune=native -O -fwrapv -fPIC -fPIE -gdwarf-4 -Wall (10.2.1_20210110) |
bi32_lowsize | gcc -march=native -mtune=native -Os -fwrapv -fPIC -fPIE -gdwarf-4 -Wall (10.2.1_20210110) |
bi8 | clang -march=native -O2 -fwrapv -Qunused-arguments -fPIC -fPIE -gdwarf-4 -Wall (Debian_Clang_11.0.1) |
bi8 | clang -march=native -O3 -fwrapv -Qunused-arguments -fPIC -fPIE -gdwarf-4 -Wall (Debian_Clang_11.0.1) |
bi8 | clang -march=native -O -fwrapv -Qunused-arguments -fPIC -fPIE -gdwarf-4 -Wall (Debian_Clang_11.0.1) |
bi8 | clang -march=native -Os -fwrapv -Qunused-arguments -fPIC -fPIE -gdwarf-4 -Wall (Debian_Clang_11.0.1) |
bi8 | clang -mcpu=native -O3 -fwrapv -Qunused-arguments -fPIC -fPIE -gdwarf-4 -Wall (Debian_Clang_11.0.1) |
bi8 | gcc -march=native -mtune=native -O2 -fwrapv -fPIC -fPIE -gdwarf-4 -Wall (10.2.1_20210110) |
bi8 | gcc -march=native -mtune=native -O3 -fwrapv -fPIC -fPIE -gdwarf-4 -Wall (10.2.1_20210110) |
bi8 | gcc -march=native -mtune=native -O -fwrapv -fPIC -fPIE -gdwarf-4 -Wall (10.2.1_20210110) |
bi8 | gcc -march=native -mtune=native -Os -fwrapv -fPIC -fPIE -gdwarf-4 -Wall (10.2.1_20210110) |
opt32 | clang -march=native -O2 -fwrapv -Qunused-arguments -fPIC -fPIE -gdwarf-4 -Wall (Debian_Clang_11.0.1) |
opt32 | clang -march=native -O3 -fwrapv -Qunused-arguments -fPIC -fPIE -gdwarf-4 -Wall (Debian_Clang_11.0.1) |
opt32 | clang -march=native -O -fwrapv -Qunused-arguments -fPIC -fPIE -gdwarf-4 -Wall (Debian_Clang_11.0.1) |
opt32 | clang -march=native -Os -fwrapv -Qunused-arguments -fPIC -fPIE -gdwarf-4 -Wall (Debian_Clang_11.0.1) |
opt32 | clang -mcpu=native -O3 -fwrapv -Qunused-arguments -fPIC -fPIE -gdwarf-4 -Wall (Debian_Clang_11.0.1) |
opt32 | gcc -march=native -mtune=native -O2 -fwrapv -fPIC -fPIE -gdwarf-4 -Wall (10.2.1_20210110) |
opt32 | gcc -march=native -mtune=native -O3 -fwrapv -fPIC -fPIE -gdwarf-4 -Wall (10.2.1_20210110) |
opt32 | gcc -march=native -mtune=native -O -fwrapv -fPIC -fPIE -gdwarf-4 -Wall (10.2.1_20210110) |
opt32 | gcc -march=native -mtune=native -Os -fwrapv -fPIC -fPIE -gdwarf-4 -Wall (10.2.1_20210110) |
opt32_lowsize | clang -march=native -O2 -fwrapv -Qunused-arguments -fPIC -fPIE -gdwarf-4 -Wall (Debian_Clang_11.0.1) |
opt32_lowsize | clang -march=native -O3 -fwrapv -Qunused-arguments -fPIC -fPIE -gdwarf-4 -Wall (Debian_Clang_11.0.1) |
opt32_lowsize | clang -march=native -O -fwrapv -Qunused-arguments -fPIC -fPIE -gdwarf-4 -Wall (Debian_Clang_11.0.1) |
opt32_lowsize | clang -march=native -Os -fwrapv -Qunused-arguments -fPIC -fPIE -gdwarf-4 -Wall (Debian_Clang_11.0.1) |
opt32_lowsize | clang -mcpu=native -O3 -fwrapv -Qunused-arguments -fPIC -fPIE -gdwarf-4 -Wall (Debian_Clang_11.0.1) |
opt32_lowsize | gcc -march=native -mtune=native -O2 -fwrapv -fPIC -fPIE -gdwarf-4 -Wall (10.2.1_20210110) |
opt32_lowsize | gcc -march=native -mtune=native -O3 -fwrapv -fPIC -fPIE -gdwarf-4 -Wall (10.2.1_20210110) |
opt32_lowsize | gcc -march=native -mtune=native -O -fwrapv -fPIC -fPIE -gdwarf-4 -Wall (10.2.1_20210110) |
opt32_lowsize | gcc -march=native -mtune=native -Os -fwrapv -fPIC -fPIE -gdwarf-4 -Wall (10.2.1_20210110) |
opt64 | clang -march=native -O2 -fwrapv -Qunused-arguments -fPIC -fPIE -gdwarf-4 -Wall (Debian_Clang_11.0.1) |
opt64 | clang -march=native -O3 -fwrapv -Qunused-arguments -fPIC -fPIE -gdwarf-4 -Wall (Debian_Clang_11.0.1) |
opt64 | clang -march=native -O -fwrapv -Qunused-arguments -fPIC -fPIE -gdwarf-4 -Wall (Debian_Clang_11.0.1) |
opt64 | clang -march=native -Os -fwrapv -Qunused-arguments -fPIC -fPIE -gdwarf-4 -Wall (Debian_Clang_11.0.1) |
opt64 | clang -mcpu=native -O3 -fwrapv -Qunused-arguments -fPIC -fPIE -gdwarf-4 -Wall (Debian_Clang_11.0.1) |
opt64 | gcc -march=native -mtune=native -O2 -fwrapv -fPIC -fPIE -gdwarf-4 -Wall (10.2.1_20210110) |
opt64 | gcc -march=native -mtune=native -O3 -fwrapv -fPIC -fPIE -gdwarf-4 -Wall (10.2.1_20210110) |
opt64 | gcc -march=native -mtune=native -O -fwrapv -fPIC -fPIE -gdwarf-4 -Wall (10.2.1_20210110) |
opt64 | gcc -march=native -mtune=native -Os -fwrapv -fPIC -fPIE -gdwarf-4 -Wall (10.2.1_20210110) |
opt64_lowsize | clang -march=native -O2 -fwrapv -Qunused-arguments -fPIC -fPIE -gdwarf-4 -Wall (Debian_Clang_11.0.1) |
opt64_lowsize | clang -march=native -O3 -fwrapv -Qunused-arguments -fPIC -fPIE -gdwarf-4 -Wall (Debian_Clang_11.0.1) |
opt64_lowsize | clang -march=native -O -fwrapv -Qunused-arguments -fPIC -fPIE -gdwarf-4 -Wall (Debian_Clang_11.0.1) |
opt64_lowsize | clang -march=native -Os -fwrapv -Qunused-arguments -fPIC -fPIE -gdwarf-4 -Wall (Debian_Clang_11.0.1) |
opt64_lowsize | clang -mcpu=native -O3 -fwrapv -Qunused-arguments -fPIC -fPIE -gdwarf-4 -Wall (Debian_Clang_11.0.1) |
opt64_lowsize | gcc -march=native -mtune=native -O2 -fwrapv -fPIC -fPIE -gdwarf-4 -Wall (10.2.1_20210110) |
opt64_lowsize | gcc -march=native -mtune=native -O3 -fwrapv -fPIC -fPIE -gdwarf-4 -Wall (10.2.1_20210110) |
opt64_lowsize | gcc -march=native -mtune=native -O -fwrapv -fPIC -fPIE -gdwarf-4 -Wall (10.2.1_20210110) |
opt64_lowsize | gcc -march=native -mtune=native -Os -fwrapv -fPIC -fPIE -gdwarf-4 -Wall (10.2.1_20210110) |
opt8 | clang -march=native -O2 -fwrapv -Qunused-arguments -fPIC -fPIE -gdwarf-4 -Wall (Debian_Clang_11.0.1) |
opt8 | clang -march=native -O3 -fwrapv -Qunused-arguments -fPIC -fPIE -gdwarf-4 -Wall (Debian_Clang_11.0.1) |
opt8 | clang -march=native -O -fwrapv -Qunused-arguments -fPIC -fPIE -gdwarf-4 -Wall (Debian_Clang_11.0.1) |
opt8 | clang -march=native -Os -fwrapv -Qunused-arguments -fPIC -fPIE -gdwarf-4 -Wall (Debian_Clang_11.0.1) |
opt8 | clang -mcpu=native -O3 -fwrapv -Qunused-arguments -fPIC -fPIE -gdwarf-4 -Wall (Debian_Clang_11.0.1) |
opt8 | gcc -march=native -mtune=native -O2 -fwrapv -fPIC -fPIE -gdwarf-4 -Wall (10.2.1_20210110) |
opt8 | gcc -march=native -mtune=native -O3 -fwrapv -fPIC -fPIE -gdwarf-4 -Wall (10.2.1_20210110) |
opt8 | gcc -march=native -mtune=native -O -fwrapv -fPIC -fPIE -gdwarf-4 -Wall (10.2.1_20210110) |
opt8 | gcc -march=native -mtune=native -Os -fwrapv -fPIC -fPIE -gdwarf-4 -Wall (10.2.1_20210110) |
opt8_lowsize | clang -march=native -O2 -fwrapv -Qunused-arguments -fPIC -fPIE -gdwarf-4 -Wall (Debian_Clang_11.0.1) |
opt8_lowsize | clang -march=native -O3 -fwrapv -Qunused-arguments -fPIC -fPIE -gdwarf-4 -Wall (Debian_Clang_11.0.1) |
opt8_lowsize | clang -march=native -O -fwrapv -Qunused-arguments -fPIC -fPIE -gdwarf-4 -Wall (Debian_Clang_11.0.1) |
opt8_lowsize | clang -march=native -Os -fwrapv -Qunused-arguments -fPIC -fPIE -gdwarf-4 -Wall (Debian_Clang_11.0.1) |
opt8_lowsize | clang -mcpu=native -O3 -fwrapv -Qunused-arguments -fPIC -fPIE -gdwarf-4 -Wall (Debian_Clang_11.0.1) |
opt8_lowsize | gcc -march=native -mtune=native -O2 -fwrapv -fPIC -fPIE -gdwarf-4 -Wall (10.2.1_20210110) |
opt8_lowsize | gcc -march=native -mtune=native -O3 -fwrapv -fPIC -fPIE -gdwarf-4 -Wall (10.2.1_20210110) |
opt8_lowsize | gcc -march=native -mtune=native -O -fwrapv -fPIC -fPIE -gdwarf-4 -Wall (10.2.1_20210110) |
opt8_lowsize | gcc -march=native -mtune=native -Os -fwrapv -fPIC -fPIE -gdwarf-4 -Wall (10.2.1_20210110) |
ref | clang -march=native -O2 -fwrapv -Qunused-arguments -fPIC -fPIE -gdwarf-4 -Wall (Debian_Clang_11.0.1) |
ref | clang -march=native -O3 -fwrapv -Qunused-arguments -fPIC -fPIE -gdwarf-4 -Wall (Debian_Clang_11.0.1) |
ref | clang -march=native -O -fwrapv -Qunused-arguments -fPIC -fPIE -gdwarf-4 -Wall (Debian_Clang_11.0.1) |
ref | clang -march=native -Os -fwrapv -Qunused-arguments -fPIC -fPIE -gdwarf-4 -Wall (Debian_Clang_11.0.1) |
ref | clang -mcpu=native -O3 -fwrapv -Qunused-arguments -fPIC -fPIE -gdwarf-4 -Wall (Debian_Clang_11.0.1) |
ref | gcc -march=native -mtune=native -O2 -fwrapv -fPIC -fPIE -gdwarf-4 -Wall (10.2.1_20210110) |
ref | gcc -march=native -mtune=native -O3 -fwrapv -fPIC -fPIE -gdwarf-4 -Wall (10.2.1_20210110) |
ref | gcc -march=native -mtune=native -O -fwrapv -fPIC -fPIE -gdwarf-4 -Wall (10.2.1_20210110) |
ref | gcc -march=native -mtune=native -Os -fwrapv -fPIC -fPIE -gdwarf-4 -Wall (10.2.1_20210110) |