Test results for amd64, hydra5, crypto_aead/omdsha256k256n104tau160v1

[Page version: 20250331 22:18:11]

Measurements for amd64, hydra5, crypto_aead Test results for amd64, hydra5, crypto_aead Test results for crypto_aead/omdsha256k256n104tau160v1
Computer: hydra5
Microarchitecture: amd64; K10 32nm (300f10)
Architecture: amd64
CPU ID: AuthenticAMD-00300f10-178bfbff
SUPERCOP version: 20250307
Operation: crypto_aead
Primitive: omdsha256k256n104tau160v1
TimeObject sizeTest sizeImplementationCompilerBenchmark dateSUPERCOP version
27460515576 0 039268 812 1088T:refgcc -march=native -mtune=native -O3 -fwrapv -fPIC -fPIE -gdwarf-4 -Wall2025031220250307
29501211696 0 033144 860 1024T:refclang -march=native -O2 -fwrapv -Qunused-arguments -fPIC -fPIE -gdwarf-4 -Wall2025031220250307
29637612151 0 034440 860 1024T:refclang -march=native -O3 -fwrapv -Qunused-arguments -fPIC -fPIE -gdwarf-4 -Wall2025031220250307
29657112215 0 034488 860 1024T:refclang -mcpu=native -O3 -fwrapv -Qunused-arguments -fPIC -fPIE -gdwarf-4 -Wall2025031220250307
3153334765 0 024090 852 1024T:refclang -march=native -Os -fwrapv -Qunused-arguments -fPIC -fPIE -gdwarf-4 -Wall2025031220250307
3339036492 0 027731 804 1088T:refgcc -march=native -mtune=native -O -fwrapv -fPIC -fPIE -gdwarf-4 -Wall2025031220250307
3450116028 0 026056 860 1024T:refclang -march=native -O -fwrapv -Qunused-arguments -fPIC -fPIE -gdwarf-4 -Wall2025031220250307
3452667915 0 030276 812 1088T:refgcc -march=native -mtune=native -O2 -fwrapv -fPIC -fPIE -gdwarf-4 -Wall2025031220250307
3462864477 0 023959 788 1056T:refgcc -march=native -mtune=native -Os -fwrapv -fPIC -fPIE -gdwarf-4 -Wall2025031220250307

Compiler output


try.c: /usr/bin/ld: libcrypto_aead_omdsha256k256n104tau160v1.a(omdsha256.o):.../supercop-data/hydra5/amd64/try/c/clang_-march=native_-O2_-fwrapv_-Qunused-arguments_-fPIC_-fPIE_-gdwarf-4_-Wall/timingleaks/crypto_aead/omdsha256k256n104tau160v1/avx1/work/./omdsha256.h:137: multiple definition of `Hash'; libcrypto_aead_omdsha256k256n104tau160v1.a(encrypt.o):.../supercop-data/hydra5/amd64/try/c/clang_-march=native_-O2_-fwrapv_-Qunused-arguments_-fPIC_-fPIE_-gdwarf-4_-Wall/timingleaks/crypto_aead/omdsha256k256n104tau160v1/avx1/work/./omdsha256.h:137: first defined here
try.c: clang: error: linker command failed with exit code 1 (use -v to see invocation)

Number of similar (implementation,compiler) pairs: 1, namely:
ImplementationCompiler
T:avx1clang -march=native -O2 -fwrapv -Qunused-arguments -fPIC -fPIE -gdwarf-4 -Wall (Ubuntu_Clang_14.0.0)

Compiler output


try.c: /usr/bin/ld: libcrypto_aead_omdsha256k256n104tau160v1.a(omdsha256.o):.../supercop-data/hydra5/amd64/try/c/clang_-march=native_-O3_-fwrapv_-Qunused-arguments_-fPIC_-fPIE_-gdwarf-4_-Wall/timingleaks/crypto_aead/omdsha256k256n104tau160v1/avx1/work/./omdsha256.h:137: multiple definition of `Hash'; libcrypto_aead_omdsha256k256n104tau160v1.a(encrypt.o):.../supercop-data/hydra5/amd64/try/c/clang_-march=native_-O3_-fwrapv_-Qunused-arguments_-fPIC_-fPIE_-gdwarf-4_-Wall/timingleaks/crypto_aead/omdsha256k256n104tau160v1/avx1/work/./omdsha256.h:137: first defined here
try.c: clang: error: linker command failed with exit code 1 (use -v to see invocation)

Number of similar (implementation,compiler) pairs: 1, namely:
ImplementationCompiler
T:avx1clang -march=native -O3 -fwrapv -Qunused-arguments -fPIC -fPIE -gdwarf-4 -Wall (Ubuntu_Clang_14.0.0)

Compiler output


try.c: /usr/bin/ld: libcrypto_aead_omdsha256k256n104tau160v1.a(omdsha256.o):.../supercop-data/hydra5/amd64/try/c/clang_-march=native_-O_-fwrapv_-Qunused-arguments_-fPIC_-fPIE_-gdwarf-4_-Wall/timingleaks/crypto_aead/omdsha256k256n104tau160v1/avx1/work/./omdsha256.h:137: multiple definition of `Hash'; libcrypto_aead_omdsha256k256n104tau160v1.a(encrypt.o):.../supercop-data/hydra5/amd64/try/c/clang_-march=native_-O_-fwrapv_-Qunused-arguments_-fPIC_-fPIE_-gdwarf-4_-Wall/timingleaks/crypto_aead/omdsha256k256n104tau160v1/avx1/work/./omdsha256.h:137: first defined here
try.c: clang: error: linker command failed with exit code 1 (use -v to see invocation)

Number of similar (implementation,compiler) pairs: 1, namely:
ImplementationCompiler
T:avx1clang -march=native -O -fwrapv -Qunused-arguments -fPIC -fPIE -gdwarf-4 -Wall (Ubuntu_Clang_14.0.0)

Compiler output


try.c: /usr/bin/ld: libcrypto_aead_omdsha256k256n104tau160v1.a(omdsha256.o):.../supercop-data/hydra5/amd64/try/c/clang_-march=native_-Os_-fwrapv_-Qunused-arguments_-fPIC_-fPIE_-gdwarf-4_-Wall/timingleaks/crypto_aead/omdsha256k256n104tau160v1/avx1/work/./omdsha256.h:137: multiple definition of `Hash'; libcrypto_aead_omdsha256k256n104tau160v1.a(encrypt.o):.../supercop-data/hydra5/amd64/try/c/clang_-march=native_-Os_-fwrapv_-Qunused-arguments_-fPIC_-fPIE_-gdwarf-4_-Wall/timingleaks/crypto_aead/omdsha256k256n104tau160v1/avx1/work/./omdsha256.h:137: first defined here
try.c: clang: error: linker command failed with exit code 1 (use -v to see invocation)

Number of similar (implementation,compiler) pairs: 1, namely:
ImplementationCompiler
T:avx1clang -march=native -Os -fwrapv -Qunused-arguments -fPIC -fPIE -gdwarf-4 -Wall (Ubuntu_Clang_14.0.0)

Compiler output


try.c: /usr/bin/ld: libcrypto_aead_omdsha256k256n104tau160v1.a(omdsha256.o):.../supercop-data/hydra5/amd64/try/c/clang_-mcpu=native_-O3_-fwrapv_-Qunused-arguments_-fPIC_-fPIE_-gdwarf-4_-Wall/timingleaks/crypto_aead/omdsha256k256n104tau160v1/avx1/work/./omdsha256.h:137: multiple definition of `Hash'; libcrypto_aead_omdsha256k256n104tau160v1.a(encrypt.o):.../supercop-data/hydra5/amd64/try/c/clang_-mcpu=native_-O3_-fwrapv_-Qunused-arguments_-fPIC_-fPIE_-gdwarf-4_-Wall/timingleaks/crypto_aead/omdsha256k256n104tau160v1/avx1/work/./omdsha256.h:137: first defined here
try.c: clang: error: linker command failed with exit code 1 (use -v to see invocation)

Number of similar (implementation,compiler) pairs: 1, namely:
ImplementationCompiler
T:avx1clang -mcpu=native -O3 -fwrapv -Qunused-arguments -fPIC -fPIE -gdwarf-4 -Wall (Ubuntu_Clang_14.0.0)

Compiler output


encrypt.c: /tmp/ccHCzboN.s: Assembler messages:
encrypt.c: /tmp/ccHCzboN.s:922: Warning: dwarf line number information for .data ignored
encrypt.c: /tmp/ccHCzboN.s:924: Warning: dwarf line number information for .data ignored
encrypt.c: /tmp/ccHCzboN.s:926: Warning: dwarf line number information for .data ignored
encrypt.c: /tmp/ccHCzboN.s:927: Warning: dwarf line number information for .data ignored
encrypt.c: /tmp/ccHCzboN.s:928: Warning: dwarf line number information for .data ignored
encrypt.c: /tmp/ccHCzboN.s:939: Warning: dwarf line number information for .data ignored
encrypt.c: /tmp/ccHCzboN.s:946: Warning: dwarf line number information for .data ignored
encrypt.c: /tmp/ccHCzboN.s:949: Warning: dwarf line number information for .data ignored
encrypt.c: /tmp/ccHCzboN.s:950: Warning: dwarf line number information for .data ignored
encrypt.c: /tmp/ccHCzboN.s:957: Warning: dwarf line number information for .data ignored
encrypt.c: /tmp/ccHCzboN.s:958: Warning: dwarf line number information for .data ignored
encrypt.c: /tmp/ccHCzboN.s:961: Warning: dwarf line number information for .data ignored
encrypt.c: /tmp/ccHCzboN.s:963: Warning: dwarf line number information for .data ignored
encrypt.c: /tmp/ccHCzboN.s:966: Warning: dwarf line number information for .data ignored
encrypt.c: /tmp/ccHCzboN.s:974: Warning: dwarf line number information for .data ignored
encrypt.c: /tmp/ccHCzboN.s:985: Warning: dwarf line number information for .data ignored
encrypt.c: /tmp/ccHCzboN.s:987: Warning: dwarf line number information for .data ignored
encrypt.c: /tmp/ccHCzboN.s:989: Warning: dwarf line number information for .data ignored
encrypt.c: /tmp/ccHCzboN.s:990: Warning: dwarf line number information for .data ignored
encrypt.c: /tmp/ccHCzboN.s:991: Warning: dwarf line number information for .data ignored
encrypt.c: /tmp/ccHCzboN.s:1002: Warning: dwarf line number information for .data ignored
encrypt.c: /tmp/ccHCzboN.s:1005: Warning: dwarf line number information for .data ignored
encrypt.c: /tmp/ccHCzboN.s:1008: Warning: dwarf line number information for .data ignored
encrypt.c: /tmp/ccHCzboN.s:1011: Warning: dwarf line number information for .data ignored
encrypt.c: ...

Number of similar (implementation,compiler) pairs: 1, namely:
ImplementationCompiler
T:avx1gcc -march=native -mtune=native -O2 -fwrapv -fPIC -fPIE -gdwarf-4 -Wall (11.4.0)

Compiler output


encrypt.c: /tmp/ccNynbtK.s: Assembler messages:
encrypt.c: /tmp/ccNynbtK.s:922: Warning: dwarf line number information for .data ignored
encrypt.c: /tmp/ccNynbtK.s:924: Warning: dwarf line number information for .data ignored
encrypt.c: /tmp/ccNynbtK.s:926: Warning: dwarf line number information for .data ignored
encrypt.c: /tmp/ccNynbtK.s:927: Warning: dwarf line number information for .data ignored
encrypt.c: /tmp/ccNynbtK.s:928: Warning: dwarf line number information for .data ignored
encrypt.c: /tmp/ccNynbtK.s:939: Warning: dwarf line number information for .data ignored
encrypt.c: /tmp/ccNynbtK.s:946: Warning: dwarf line number information for .data ignored
encrypt.c: /tmp/ccNynbtK.s:949: Warning: dwarf line number information for .data ignored
encrypt.c: /tmp/ccNynbtK.s:950: Warning: dwarf line number information for .data ignored
encrypt.c: /tmp/ccNynbtK.s:957: Warning: dwarf line number information for .data ignored
encrypt.c: /tmp/ccNynbtK.s:958: Warning: dwarf line number information for .data ignored
encrypt.c: /tmp/ccNynbtK.s:961: Warning: dwarf line number information for .data ignored
encrypt.c: /tmp/ccNynbtK.s:963: Warning: dwarf line number information for .data ignored
encrypt.c: /tmp/ccNynbtK.s:966: Warning: dwarf line number information for .data ignored
encrypt.c: /tmp/ccNynbtK.s:974: Warning: dwarf line number information for .data ignored
encrypt.c: /tmp/ccNynbtK.s:985: Warning: dwarf line number information for .data ignored
encrypt.c: /tmp/ccNynbtK.s:987: Warning: dwarf line number information for .data ignored
encrypt.c: /tmp/ccNynbtK.s:989: Warning: dwarf line number information for .data ignored
encrypt.c: /tmp/ccNynbtK.s:990: Warning: dwarf line number information for .data ignored
encrypt.c: /tmp/ccNynbtK.s:991: Warning: dwarf line number information for .data ignored
encrypt.c: /tmp/ccNynbtK.s:1002: Warning: dwarf line number information for .data ignored
encrypt.c: /tmp/ccNynbtK.s:1005: Warning: dwarf line number information for .data ignored
encrypt.c: /tmp/ccNynbtK.s:1008: Warning: dwarf line number information for .data ignored
encrypt.c: /tmp/ccNynbtK.s:1011: Warning: dwarf line number information for .data ignored
encrypt.c: ...

Number of similar (implementation,compiler) pairs: 1, namely:
ImplementationCompiler
T:avx1gcc -march=native -mtune=native -O3 -fwrapv -fPIC -fPIE -gdwarf-4 -Wall (11.4.0)

Compiler output


encrypt.c: /tmp/ccD0Ur3J.s: Assembler messages:
encrypt.c: /tmp/ccD0Ur3J.s:921: Warning: dwarf line number information for .data ignored
encrypt.c: /tmp/ccD0Ur3J.s:923: Warning: dwarf line number information for .data ignored
encrypt.c: /tmp/ccD0Ur3J.s:935: Warning: dwarf line number information for .data ignored
encrypt.c: /tmp/ccD0Ur3J.s:936: Warning: dwarf line number information for .data ignored
encrypt.c: /tmp/ccD0Ur3J.s:937: Warning: dwarf line number information for .data ignored
encrypt.c: /tmp/ccD0Ur3J.s:944: Warning: dwarf line number information for .data ignored
encrypt.c: /tmp/ccD0Ur3J.s:947: Warning: dwarf line number information for .data ignored
encrypt.c: /tmp/ccD0Ur3J.s:948: Warning: dwarf line number information for .data ignored
encrypt.c: /tmp/ccD0Ur3J.s:953: Warning: dwarf line number information for .data ignored
encrypt.c: /tmp/ccD0Ur3J.s:954: Warning: dwarf line number information for .data ignored
encrypt.c: /tmp/ccD0Ur3J.s:957: Warning: dwarf line number information for .data ignored
encrypt.c: /tmp/ccD0Ur3J.s:959: Warning: dwarf line number information for .data ignored
encrypt.c: /tmp/ccD0Ur3J.s:962: Warning: dwarf line number information for .data ignored
encrypt.c: /tmp/ccD0Ur3J.s:970: Warning: dwarf line number information for .data ignored
encrypt.c: /tmp/ccD0Ur3J.s:980: Warning: dwarf line number information for .data ignored
encrypt.c: /tmp/ccD0Ur3J.s:982: Warning: dwarf line number information for .data ignored
encrypt.c: /tmp/ccD0Ur3J.s:995: Warning: dwarf line number information for .data ignored
encrypt.c: /tmp/ccD0Ur3J.s:999: Warning: dwarf line number information for .data ignored
encrypt.c: /tmp/ccD0Ur3J.s:1000: Warning: dwarf line number information for .data ignored
encrypt.c: /tmp/ccD0Ur3J.s:1001: Warning: dwarf line number information for .data ignored
encrypt.c: /tmp/ccD0Ur3J.s:1008: Warning: dwarf line number information for .data ignored
encrypt.c: /tmp/ccD0Ur3J.s:1011: Warning: dwarf line number information for .data ignored
encrypt.c: /tmp/ccD0Ur3J.s:1014: Warning: dwarf line number information for .data ignored
encrypt.c: /tmp/ccD0Ur3J.s:1017: Warning: dwarf line number information for .data ignored
encrypt.c: ...

Number of similar (implementation,compiler) pairs: 1, namely:
ImplementationCompiler
T:avx1gcc -march=native -mtune=native -O -fwrapv -fPIC -fPIE -gdwarf-4 -Wall (11.4.0)

Compiler output


encrypt.c: /tmp/ccKddXw0.s: Assembler messages:
encrypt.c: /tmp/ccKddXw0.s:921: Warning: dwarf line number information for .data ignored
encrypt.c: /tmp/ccKddXw0.s:923: Warning: dwarf line number information for .data ignored
encrypt.c: /tmp/ccKddXw0.s:925: Warning: dwarf line number information for .data ignored
encrypt.c: /tmp/ccKddXw0.s:926: Warning: dwarf line number information for .data ignored
encrypt.c: /tmp/ccKddXw0.s:927: Warning: dwarf line number information for .data ignored
encrypt.c: /tmp/ccKddXw0.s:937: Warning: dwarf line number information for .data ignored
encrypt.c: /tmp/ccKddXw0.s:940: Warning: dwarf line number information for .data ignored
encrypt.c: /tmp/ccKddXw0.s:942: Warning: dwarf line number information for .data ignored
encrypt.c: /tmp/ccKddXw0.s:947: Warning: dwarf line number information for .data ignored
encrypt.c: /tmp/ccKddXw0.s:950: Warning: dwarf line number information for .data ignored
encrypt.c: /tmp/ccKddXw0.s:951: Warning: dwarf line number information for .data ignored
encrypt.c: /tmp/ccKddXw0.s:958: Warning: dwarf line number information for .data ignored
encrypt.c: /tmp/ccKddXw0.s:959: Warning: dwarf line number information for .data ignored
encrypt.c: /tmp/ccKddXw0.s:962: Warning: dwarf line number information for .data ignored
encrypt.c: /tmp/ccKddXw0.s:964: Warning: dwarf line number information for .data ignored
encrypt.c: /tmp/ccKddXw0.s:967: Warning: dwarf line number information for .data ignored
encrypt.c: /tmp/ccKddXw0.s:975: Warning: dwarf line number information for .data ignored
encrypt.c: /tmp/ccKddXw0.s:985: Warning: dwarf line number information for .data ignored
encrypt.c: /tmp/ccKddXw0.s:987: Warning: dwarf line number information for .data ignored
encrypt.c: /tmp/ccKddXw0.s:989: Warning: dwarf line number information for .data ignored
encrypt.c: /tmp/ccKddXw0.s:990: Warning: dwarf line number information for .data ignored
encrypt.c: /tmp/ccKddXw0.s:991: Warning: dwarf line number information for .data ignored
encrypt.c: /tmp/ccKddXw0.s:1001: Warning: dwarf line number information for .data ignored
encrypt.c: /tmp/ccKddXw0.s:1003: Warning: dwarf line number information for .data ignored
encrypt.c: ...

Number of similar (implementation,compiler) pairs: 1, namely:
ImplementationCompiler
T:avx1gcc -march=native -mtune=native -Os -fwrapv -fPIC -fPIE -gdwarf-4 -Wall (11.4.0)

Compiler output


try.c: /usr/bin/ld: libcrypto_aead_omdsha256k256n104tau160v1.a(omdsha256.o):.../supercop-data/hydra5/amd64/try/c/clang_-march=native_-O2_-fwrapv_-Qunused-arguments_-fPIC_-fPIE_-gdwarf-4_-Wall/timingleaks/crypto_aead/omdsha256k256n104tau160v1/sse4/work/./omdsha256.h:137: multiple definition of `Hash'; libcrypto_aead_omdsha256k256n104tau160v1.a(encrypt.o):.../supercop-data/hydra5/amd64/try/c/clang_-march=native_-O2_-fwrapv_-Qunused-arguments_-fPIC_-fPIE_-gdwarf-4_-Wall/timingleaks/crypto_aead/omdsha256k256n104tau160v1/sse4/work/./omdsha256.h:137: first defined here
try.c: clang: error: linker command failed with exit code 1 (use -v to see invocation)

Number of similar (implementation,compiler) pairs: 1, namely:
ImplementationCompiler
T:sse4clang -march=native -O2 -fwrapv -Qunused-arguments -fPIC -fPIE -gdwarf-4 -Wall (Ubuntu_Clang_14.0.0)

Compiler output


try.c: /usr/bin/ld: libcrypto_aead_omdsha256k256n104tau160v1.a(omdsha256.o):.../supercop-data/hydra5/amd64/try/c/clang_-march=native_-O3_-fwrapv_-Qunused-arguments_-fPIC_-fPIE_-gdwarf-4_-Wall/timingleaks/crypto_aead/omdsha256k256n104tau160v1/sse4/work/./omdsha256.h:137: multiple definition of `Hash'; libcrypto_aead_omdsha256k256n104tau160v1.a(encrypt.o):.../supercop-data/hydra5/amd64/try/c/clang_-march=native_-O3_-fwrapv_-Qunused-arguments_-fPIC_-fPIE_-gdwarf-4_-Wall/timingleaks/crypto_aead/omdsha256k256n104tau160v1/sse4/work/./omdsha256.h:137: first defined here
try.c: clang: error: linker command failed with exit code 1 (use -v to see invocation)

Number of similar (implementation,compiler) pairs: 1, namely:
ImplementationCompiler
T:sse4clang -march=native -O3 -fwrapv -Qunused-arguments -fPIC -fPIE -gdwarf-4 -Wall (Ubuntu_Clang_14.0.0)

Compiler output


try.c: /usr/bin/ld: libcrypto_aead_omdsha256k256n104tau160v1.a(omdsha256.o):.../supercop-data/hydra5/amd64/try/c/clang_-march=native_-O_-fwrapv_-Qunused-arguments_-fPIC_-fPIE_-gdwarf-4_-Wall/timingleaks/crypto_aead/omdsha256k256n104tau160v1/sse4/work/./omdsha256.h:137: multiple definition of `Hash'; libcrypto_aead_omdsha256k256n104tau160v1.a(encrypt.o):.../supercop-data/hydra5/amd64/try/c/clang_-march=native_-O_-fwrapv_-Qunused-arguments_-fPIC_-fPIE_-gdwarf-4_-Wall/timingleaks/crypto_aead/omdsha256k256n104tau160v1/sse4/work/./omdsha256.h:137: first defined here
try.c: clang: error: linker command failed with exit code 1 (use -v to see invocation)

Number of similar (implementation,compiler) pairs: 1, namely:
ImplementationCompiler
T:sse4clang -march=native -O -fwrapv -Qunused-arguments -fPIC -fPIE -gdwarf-4 -Wall (Ubuntu_Clang_14.0.0)

Compiler output


try.c: /usr/bin/ld: libcrypto_aead_omdsha256k256n104tau160v1.a(omdsha256.o):.../supercop-data/hydra5/amd64/try/c/clang_-march=native_-Os_-fwrapv_-Qunused-arguments_-fPIC_-fPIE_-gdwarf-4_-Wall/timingleaks/crypto_aead/omdsha256k256n104tau160v1/sse4/work/./omdsha256.h:137: multiple definition of `Hash'; libcrypto_aead_omdsha256k256n104tau160v1.a(encrypt.o):.../supercop-data/hydra5/amd64/try/c/clang_-march=native_-Os_-fwrapv_-Qunused-arguments_-fPIC_-fPIE_-gdwarf-4_-Wall/timingleaks/crypto_aead/omdsha256k256n104tau160v1/sse4/work/./omdsha256.h:137: first defined here
try.c: clang: error: linker command failed with exit code 1 (use -v to see invocation)

Number of similar (implementation,compiler) pairs: 1, namely:
ImplementationCompiler
T:sse4clang -march=native -Os -fwrapv -Qunused-arguments -fPIC -fPIE -gdwarf-4 -Wall (Ubuntu_Clang_14.0.0)

Compiler output


try.c: /usr/bin/ld: libcrypto_aead_omdsha256k256n104tau160v1.a(omdsha256.o):.../supercop-data/hydra5/amd64/try/c/clang_-mcpu=native_-O3_-fwrapv_-Qunused-arguments_-fPIC_-fPIE_-gdwarf-4_-Wall/timingleaks/crypto_aead/omdsha256k256n104tau160v1/sse4/work/./omdsha256.h:137: multiple definition of `Hash'; libcrypto_aead_omdsha256k256n104tau160v1.a(encrypt.o):.../supercop-data/hydra5/amd64/try/c/clang_-mcpu=native_-O3_-fwrapv_-Qunused-arguments_-fPIC_-fPIE_-gdwarf-4_-Wall/timingleaks/crypto_aead/omdsha256k256n104tau160v1/sse4/work/./omdsha256.h:137: first defined here
try.c: clang: error: linker command failed with exit code 1 (use -v to see invocation)

Number of similar (implementation,compiler) pairs: 1, namely:
ImplementationCompiler
T:sse4clang -mcpu=native -O3 -fwrapv -Qunused-arguments -fPIC -fPIE -gdwarf-4 -Wall (Ubuntu_Clang_14.0.0)

Compiler output


encrypt.c: /tmp/ccylXFfE.s: Assembler messages:
encrypt.c: /tmp/ccylXFfE.s:961: Warning: dwarf line number information for .data ignored
encrypt.c: /tmp/ccylXFfE.s:963: Warning: dwarf line number information for .data ignored
encrypt.c: /tmp/ccylXFfE.s:965: Warning: dwarf line number information for .data ignored
encrypt.c: /tmp/ccylXFfE.s:966: Warning: dwarf line number information for .data ignored
encrypt.c: /tmp/ccylXFfE.s:967: Warning: dwarf line number information for .data ignored
encrypt.c: /tmp/ccylXFfE.s:978: Warning: dwarf line number information for .data ignored
encrypt.c: /tmp/ccylXFfE.s:985: Warning: dwarf line number information for .data ignored
encrypt.c: /tmp/ccylXFfE.s:988: Warning: dwarf line number information for .data ignored
encrypt.c: /tmp/ccylXFfE.s:989: Warning: dwarf line number information for .data ignored
encrypt.c: /tmp/ccylXFfE.s:996: Warning: dwarf line number information for .data ignored
encrypt.c: /tmp/ccylXFfE.s:997: Warning: dwarf line number information for .data ignored
encrypt.c: /tmp/ccylXFfE.s:1000: Warning: dwarf line number information for .data ignored
encrypt.c: /tmp/ccylXFfE.s:1002: Warning: dwarf line number information for .data ignored
encrypt.c: /tmp/ccylXFfE.s:1005: Warning: dwarf line number information for .data ignored
encrypt.c: /tmp/ccylXFfE.s:1013: Warning: dwarf line number information for .data ignored
encrypt.c: /tmp/ccylXFfE.s:1024: Warning: dwarf line number information for .data ignored
encrypt.c: /tmp/ccylXFfE.s:1026: Warning: dwarf line number information for .data ignored
encrypt.c: /tmp/ccylXFfE.s:1028: Warning: dwarf line number information for .data ignored
encrypt.c: /tmp/ccylXFfE.s:1029: Warning: dwarf line number information for .data ignored
encrypt.c: /tmp/ccylXFfE.s:1030: Warning: dwarf line number information for .data ignored
encrypt.c: /tmp/ccylXFfE.s:1041: Warning: dwarf line number information for .data ignored
encrypt.c: /tmp/ccylXFfE.s:1044: Warning: dwarf line number information for .data ignored
encrypt.c: /tmp/ccylXFfE.s:1047: Warning: dwarf line number information for .data ignored
encrypt.c: /tmp/ccylXFfE.s:1050: Warning: dwarf line number information for .data ignored
encrypt.c: ...

Number of similar (implementation,compiler) pairs: 1, namely:
ImplementationCompiler
T:sse4gcc -march=native -mtune=native -O2 -fwrapv -fPIC -fPIE -gdwarf-4 -Wall (11.4.0)

Compiler output


encrypt.c: /tmp/ccfJ4ewb.s: Assembler messages:
encrypt.c: /tmp/ccfJ4ewb.s:961: Warning: dwarf line number information for .data ignored
encrypt.c: /tmp/ccfJ4ewb.s:963: Warning: dwarf line number information for .data ignored
encrypt.c: /tmp/ccfJ4ewb.s:965: Warning: dwarf line number information for .data ignored
encrypt.c: /tmp/ccfJ4ewb.s:966: Warning: dwarf line number information for .data ignored
encrypt.c: /tmp/ccfJ4ewb.s:967: Warning: dwarf line number information for .data ignored
encrypt.c: /tmp/ccfJ4ewb.s:978: Warning: dwarf line number information for .data ignored
encrypt.c: /tmp/ccfJ4ewb.s:985: Warning: dwarf line number information for .data ignored
encrypt.c: /tmp/ccfJ4ewb.s:988: Warning: dwarf line number information for .data ignored
encrypt.c: /tmp/ccfJ4ewb.s:989: Warning: dwarf line number information for .data ignored
encrypt.c: /tmp/ccfJ4ewb.s:996: Warning: dwarf line number information for .data ignored
encrypt.c: /tmp/ccfJ4ewb.s:997: Warning: dwarf line number information for .data ignored
encrypt.c: /tmp/ccfJ4ewb.s:1000: Warning: dwarf line number information for .data ignored
encrypt.c: /tmp/ccfJ4ewb.s:1002: Warning: dwarf line number information for .data ignored
encrypt.c: /tmp/ccfJ4ewb.s:1005: Warning: dwarf line number information for .data ignored
encrypt.c: /tmp/ccfJ4ewb.s:1013: Warning: dwarf line number information for .data ignored
encrypt.c: /tmp/ccfJ4ewb.s:1024: Warning: dwarf line number information for .data ignored
encrypt.c: /tmp/ccfJ4ewb.s:1026: Warning: dwarf line number information for .data ignored
encrypt.c: /tmp/ccfJ4ewb.s:1028: Warning: dwarf line number information for .data ignored
encrypt.c: /tmp/ccfJ4ewb.s:1029: Warning: dwarf line number information for .data ignored
encrypt.c: /tmp/ccfJ4ewb.s:1030: Warning: dwarf line number information for .data ignored
encrypt.c: /tmp/ccfJ4ewb.s:1041: Warning: dwarf line number information for .data ignored
encrypt.c: /tmp/ccfJ4ewb.s:1044: Warning: dwarf line number information for .data ignored
encrypt.c: /tmp/ccfJ4ewb.s:1047: Warning: dwarf line number information for .data ignored
encrypt.c: /tmp/ccfJ4ewb.s:1050: Warning: dwarf line number information for .data ignored
encrypt.c: ...

Number of similar (implementation,compiler) pairs: 1, namely:
ImplementationCompiler
T:sse4gcc -march=native -mtune=native -O3 -fwrapv -fPIC -fPIE -gdwarf-4 -Wall (11.4.0)

Compiler output


encrypt.c: /tmp/ccnw1kVx.s: Assembler messages:
encrypt.c: /tmp/ccnw1kVx.s:960: Warning: dwarf line number information for .data ignored
encrypt.c: /tmp/ccnw1kVx.s:962: Warning: dwarf line number information for .data ignored
encrypt.c: /tmp/ccnw1kVx.s:974: Warning: dwarf line number information for .data ignored
encrypt.c: /tmp/ccnw1kVx.s:975: Warning: dwarf line number information for .data ignored
encrypt.c: /tmp/ccnw1kVx.s:976: Warning: dwarf line number information for .data ignored
encrypt.c: /tmp/ccnw1kVx.s:983: Warning: dwarf line number information for .data ignored
encrypt.c: /tmp/ccnw1kVx.s:986: Warning: dwarf line number information for .data ignored
encrypt.c: /tmp/ccnw1kVx.s:987: Warning: dwarf line number information for .data ignored
encrypt.c: /tmp/ccnw1kVx.s:992: Warning: dwarf line number information for .data ignored
encrypt.c: /tmp/ccnw1kVx.s:993: Warning: dwarf line number information for .data ignored
encrypt.c: /tmp/ccnw1kVx.s:996: Warning: dwarf line number information for .data ignored
encrypt.c: /tmp/ccnw1kVx.s:998: Warning: dwarf line number information for .data ignored
encrypt.c: /tmp/ccnw1kVx.s:1001: Warning: dwarf line number information for .data ignored
encrypt.c: /tmp/ccnw1kVx.s:1009: Warning: dwarf line number information for .data ignored
encrypt.c: /tmp/ccnw1kVx.s:1019: Warning: dwarf line number information for .data ignored
encrypt.c: /tmp/ccnw1kVx.s:1021: Warning: dwarf line number information for .data ignored
encrypt.c: /tmp/ccnw1kVx.s:1034: Warning: dwarf line number information for .data ignored
encrypt.c: /tmp/ccnw1kVx.s:1038: Warning: dwarf line number information for .data ignored
encrypt.c: /tmp/ccnw1kVx.s:1039: Warning: dwarf line number information for .data ignored
encrypt.c: /tmp/ccnw1kVx.s:1040: Warning: dwarf line number information for .data ignored
encrypt.c: /tmp/ccnw1kVx.s:1047: Warning: dwarf line number information for .data ignored
encrypt.c: /tmp/ccnw1kVx.s:1050: Warning: dwarf line number information for .data ignored
encrypt.c: /tmp/ccnw1kVx.s:1053: Warning: dwarf line number information for .data ignored
encrypt.c: /tmp/ccnw1kVx.s:1056: Warning: dwarf line number information for .data ignored
encrypt.c: ...

Number of similar (implementation,compiler) pairs: 1, namely:
ImplementationCompiler
T:sse4gcc -march=native -mtune=native -O -fwrapv -fPIC -fPIE -gdwarf-4 -Wall (11.4.0)

Compiler output


encrypt.c: /tmp/ccODGILT.s: Assembler messages:
encrypt.c: /tmp/ccODGILT.s:960: Warning: dwarf line number information for .data ignored
encrypt.c: /tmp/ccODGILT.s:962: Warning: dwarf line number information for .data ignored
encrypt.c: /tmp/ccODGILT.s:964: Warning: dwarf line number information for .data ignored
encrypt.c: /tmp/ccODGILT.s:965: Warning: dwarf line number information for .data ignored
encrypt.c: /tmp/ccODGILT.s:966: Warning: dwarf line number information for .data ignored
encrypt.c: /tmp/ccODGILT.s:976: Warning: dwarf line number information for .data ignored
encrypt.c: /tmp/ccODGILT.s:979: Warning: dwarf line number information for .data ignored
encrypt.c: /tmp/ccODGILT.s:981: Warning: dwarf line number information for .data ignored
encrypt.c: /tmp/ccODGILT.s:986: Warning: dwarf line number information for .data ignored
encrypt.c: /tmp/ccODGILT.s:989: Warning: dwarf line number information for .data ignored
encrypt.c: /tmp/ccODGILT.s:990: Warning: dwarf line number information for .data ignored
encrypt.c: /tmp/ccODGILT.s:997: Warning: dwarf line number information for .data ignored
encrypt.c: /tmp/ccODGILT.s:998: Warning: dwarf line number information for .data ignored
encrypt.c: /tmp/ccODGILT.s:1001: Warning: dwarf line number information for .data ignored
encrypt.c: /tmp/ccODGILT.s:1003: Warning: dwarf line number information for .data ignored
encrypt.c: /tmp/ccODGILT.s:1006: Warning: dwarf line number information for .data ignored
encrypt.c: /tmp/ccODGILT.s:1014: Warning: dwarf line number information for .data ignored
encrypt.c: /tmp/ccODGILT.s:1024: Warning: dwarf line number information for .data ignored
encrypt.c: /tmp/ccODGILT.s:1026: Warning: dwarf line number information for .data ignored
encrypt.c: /tmp/ccODGILT.s:1028: Warning: dwarf line number information for .data ignored
encrypt.c: /tmp/ccODGILT.s:1029: Warning: dwarf line number information for .data ignored
encrypt.c: /tmp/ccODGILT.s:1030: Warning: dwarf line number information for .data ignored
encrypt.c: /tmp/ccODGILT.s:1040: Warning: dwarf line number information for .data ignored
encrypt.c: /tmp/ccODGILT.s:1042: Warning: dwarf line number information for .data ignored
encrypt.c: ...

Number of similar (implementation,compiler) pairs: 1, namely:
ImplementationCompiler
T:sse4gcc -march=native -mtune=native -Os -fwrapv -fPIC -fPIE -gdwarf-4 -Wall (11.4.0)

Namespace violations


omdsha256.o calc_L_i T
omdsha256.o double_block T
omdsha256.o final_masking_associated_data T
omdsha256.o final_masking_message T
omdsha256.o hash T
omdsha256.o increment_masking_associated_data T
omdsha256.o increment_masking_message T
omdsha256.o key_func T
omdsha256.o l2b T
omdsha256.o ntz T
omdsha256.o omdsha256_process T
omdsha256.o triple_block T
omdsha256.o xor_block T
sha256.o sha256_comp T

Number of similar (implementation,compiler) pairs: 9, namely:
ImplementationCompiler
T:refclang -march=native -O2 -fwrapv -Qunused-arguments -fPIC -fPIE -gdwarf-4 -Wall (Ubuntu_Clang_14.0.0)
T:refclang -march=native -O3 -fwrapv -Qunused-arguments -fPIC -fPIE -gdwarf-4 -Wall (Ubuntu_Clang_14.0.0)
T:refclang -march=native -O -fwrapv -Qunused-arguments -fPIC -fPIE -gdwarf-4 -Wall (Ubuntu_Clang_14.0.0)
T:refclang -march=native -Os -fwrapv -Qunused-arguments -fPIC -fPIE -gdwarf-4 -Wall (Ubuntu_Clang_14.0.0)
T:refclang -mcpu=native -O3 -fwrapv -Qunused-arguments -fPIC -fPIE -gdwarf-4 -Wall (Ubuntu_Clang_14.0.0)
T:refgcc -march=native -mtune=native -O2 -fwrapv -fPIC -fPIE -gdwarf-4 -Wall (11.4.0)
T:refgcc -march=native -mtune=native -O3 -fwrapv -fPIC -fPIE -gdwarf-4 -Wall (11.4.0)
T:refgcc -march=native -mtune=native -O -fwrapv -fPIC -fPIE -gdwarf-4 -Wall (11.4.0)
T:refgcc -march=native -mtune=native -Os -fwrapv -fPIC -fPIE -gdwarf-4 -Wall (11.4.0)