Test results for amd64, hydra5, crypto_aead/omdsha256k128n96tau64v1

[Page version: 20250331 22:18:11]

Measurements for amd64, hydra5, crypto_aead Test results for amd64, hydra5, crypto_aead Test results for crypto_aead/omdsha256k128n96tau64v1
Computer: hydra5
Microarchitecture: amd64; K10 32nm (300f10)
Architecture: amd64
CPU ID: AuthenticAMD-00300f10-178bfbff
SUPERCOP version: 20250307
Operation: crypto_aead
Primitive: omdsha256k128n96tau64v1
TimeObject sizeTest sizeImplementationCompilerBenchmark dateSUPERCOP version
27448515384 0 038948 812 1088T:refgcc -march=native -mtune=native -O3 -fwrapv -fPIC -fPIE -gdwarf-4 -Wall2025031220250307
29610911628 0 033048 860 1024T:refclang -march=native -O2 -fwrapv -Qunused-arguments -fPIC -fPIE -gdwarf-4 -Wall2025031220250307
29657512097 0 034360 860 1024T:refclang -mcpu=native -O3 -fwrapv -Qunused-arguments -fPIC -fPIE -gdwarf-4 -Wall2025031220250307
29666412033 0 034312 860 1024T:refclang -march=native -O3 -fwrapv -Qunused-arguments -fPIC -fPIE -gdwarf-4 -Wall2025031220250307
3048404681 0 023962 852 1024T:refclang -march=native -Os -fwrapv -Qunused-arguments -fPIC -fPIE -gdwarf-4 -Wall2025031220250307
3319366412 0 027539 804 1088T:refgcc -march=native -mtune=native -O -fwrapv -fPIC -fPIE -gdwarf-4 -Wall2025031220250307
3378177875 0 030116 812 1088T:refgcc -march=native -mtune=native -O2 -fwrapv -fPIC -fPIE -gdwarf-4 -Wall2025031220250307
3387945984 0 025992 860 1024T:refclang -march=native -O -fwrapv -Qunused-arguments -fPIC -fPIE -gdwarf-4 -Wall2025031220250307
3535564494 0 023991 788 1056T:refgcc -march=native -mtune=native -Os -fwrapv -fPIC -fPIE -gdwarf-4 -Wall2025031220250307

Compiler output


try.c: /usr/bin/ld: libcrypto_aead_omdsha256k128n96tau64v1.a(omdsha256.o):.../supercop-data/hydra5/amd64/try/c/clang_-march=native_-O2_-fwrapv_-Qunused-arguments_-fPIC_-fPIE_-gdwarf-4_-Wall/timingleaks/crypto_aead/omdsha256k128n96tau64v1/avx1/work/./omdsha256.h:137: multiple definition of `Hash'; libcrypto_aead_omdsha256k128n96tau64v1.a(encrypt.o):.../supercop-data/hydra5/amd64/try/c/clang_-march=native_-O2_-fwrapv_-Qunused-arguments_-fPIC_-fPIE_-gdwarf-4_-Wall/timingleaks/crypto_aead/omdsha256k128n96tau64v1/avx1/work/./omdsha256.h:137: first defined here
try.c: clang: error: linker command failed with exit code 1 (use -v to see invocation)

Number of similar (implementation,compiler) pairs: 1, namely:
ImplementationCompiler
T:avx1clang -march=native -O2 -fwrapv -Qunused-arguments -fPIC -fPIE -gdwarf-4 -Wall (Ubuntu_Clang_14.0.0)

Compiler output


try.c: /usr/bin/ld: libcrypto_aead_omdsha256k128n96tau64v1.a(omdsha256.o):.../supercop-data/hydra5/amd64/try/c/clang_-march=native_-O3_-fwrapv_-Qunused-arguments_-fPIC_-fPIE_-gdwarf-4_-Wall/timingleaks/crypto_aead/omdsha256k128n96tau64v1/avx1/work/./omdsha256.h:137: multiple definition of `Hash'; libcrypto_aead_omdsha256k128n96tau64v1.a(encrypt.o):.../supercop-data/hydra5/amd64/try/c/clang_-march=native_-O3_-fwrapv_-Qunused-arguments_-fPIC_-fPIE_-gdwarf-4_-Wall/timingleaks/crypto_aead/omdsha256k128n96tau64v1/avx1/work/./omdsha256.h:137: first defined here
try.c: clang: error: linker command failed with exit code 1 (use -v to see invocation)

Number of similar (implementation,compiler) pairs: 1, namely:
ImplementationCompiler
T:avx1clang -march=native -O3 -fwrapv -Qunused-arguments -fPIC -fPIE -gdwarf-4 -Wall (Ubuntu_Clang_14.0.0)

Compiler output


try.c: /usr/bin/ld: libcrypto_aead_omdsha256k128n96tau64v1.a(omdsha256.o):.../supercop-data/hydra5/amd64/try/c/clang_-march=native_-O_-fwrapv_-Qunused-arguments_-fPIC_-fPIE_-gdwarf-4_-Wall/timingleaks/crypto_aead/omdsha256k128n96tau64v1/avx1/work/./omdsha256.h:137: multiple definition of `Hash'; libcrypto_aead_omdsha256k128n96tau64v1.a(encrypt.o):.../supercop-data/hydra5/amd64/try/c/clang_-march=native_-O_-fwrapv_-Qunused-arguments_-fPIC_-fPIE_-gdwarf-4_-Wall/timingleaks/crypto_aead/omdsha256k128n96tau64v1/avx1/work/./omdsha256.h:137: first defined here
try.c: clang: error: linker command failed with exit code 1 (use -v to see invocation)

Number of similar (implementation,compiler) pairs: 1, namely:
ImplementationCompiler
T:avx1clang -march=native -O -fwrapv -Qunused-arguments -fPIC -fPIE -gdwarf-4 -Wall (Ubuntu_Clang_14.0.0)

Compiler output


try.c: /usr/bin/ld: libcrypto_aead_omdsha256k128n96tau64v1.a(omdsha256.o):.../supercop-data/hydra5/amd64/try/c/clang_-march=native_-Os_-fwrapv_-Qunused-arguments_-fPIC_-fPIE_-gdwarf-4_-Wall/timingleaks/crypto_aead/omdsha256k128n96tau64v1/avx1/work/./omdsha256.h:137: multiple definition of `Hash'; libcrypto_aead_omdsha256k128n96tau64v1.a(encrypt.o):.../supercop-data/hydra5/amd64/try/c/clang_-march=native_-Os_-fwrapv_-Qunused-arguments_-fPIC_-fPIE_-gdwarf-4_-Wall/timingleaks/crypto_aead/omdsha256k128n96tau64v1/avx1/work/./omdsha256.h:137: first defined here
try.c: clang: error: linker command failed with exit code 1 (use -v to see invocation)

Number of similar (implementation,compiler) pairs: 1, namely:
ImplementationCompiler
T:avx1clang -march=native -Os -fwrapv -Qunused-arguments -fPIC -fPIE -gdwarf-4 -Wall (Ubuntu_Clang_14.0.0)

Compiler output


try.c: /usr/bin/ld: libcrypto_aead_omdsha256k128n96tau64v1.a(omdsha256.o):.../supercop-data/hydra5/amd64/try/c/clang_-mcpu=native_-O3_-fwrapv_-Qunused-arguments_-fPIC_-fPIE_-gdwarf-4_-Wall/timingleaks/crypto_aead/omdsha256k128n96tau64v1/avx1/work/./omdsha256.h:137: multiple definition of `Hash'; libcrypto_aead_omdsha256k128n96tau64v1.a(encrypt.o):.../supercop-data/hydra5/amd64/try/c/clang_-mcpu=native_-O3_-fwrapv_-Qunused-arguments_-fPIC_-fPIE_-gdwarf-4_-Wall/timingleaks/crypto_aead/omdsha256k128n96tau64v1/avx1/work/./omdsha256.h:137: first defined here
try.c: clang: error: linker command failed with exit code 1 (use -v to see invocation)

Number of similar (implementation,compiler) pairs: 1, namely:
ImplementationCompiler
T:avx1clang -mcpu=native -O3 -fwrapv -Qunused-arguments -fPIC -fPIE -gdwarf-4 -Wall (Ubuntu_Clang_14.0.0)

Compiler output


encrypt.c: /tmp/cciRY2Pf.s: Assembler messages:
encrypt.c: /tmp/cciRY2Pf.s:922: Warning: dwarf line number information for .data ignored
encrypt.c: /tmp/cciRY2Pf.s:924: Warning: dwarf line number information for .data ignored
encrypt.c: /tmp/cciRY2Pf.s:926: Warning: dwarf line number information for .data ignored
encrypt.c: /tmp/cciRY2Pf.s:927: Warning: dwarf line number information for .data ignored
encrypt.c: /tmp/cciRY2Pf.s:928: Warning: dwarf line number information for .data ignored
encrypt.c: /tmp/cciRY2Pf.s:939: Warning: dwarf line number information for .data ignored
encrypt.c: /tmp/cciRY2Pf.s:946: Warning: dwarf line number information for .data ignored
encrypt.c: /tmp/cciRY2Pf.s:949: Warning: dwarf line number information for .data ignored
encrypt.c: /tmp/cciRY2Pf.s:950: Warning: dwarf line number information for .data ignored
encrypt.c: /tmp/cciRY2Pf.s:957: Warning: dwarf line number information for .data ignored
encrypt.c: /tmp/cciRY2Pf.s:958: Warning: dwarf line number information for .data ignored
encrypt.c: /tmp/cciRY2Pf.s:961: Warning: dwarf line number information for .data ignored
encrypt.c: /tmp/cciRY2Pf.s:963: Warning: dwarf line number information for .data ignored
encrypt.c: /tmp/cciRY2Pf.s:966: Warning: dwarf line number information for .data ignored
encrypt.c: /tmp/cciRY2Pf.s:974: Warning: dwarf line number information for .data ignored
encrypt.c: /tmp/cciRY2Pf.s:985: Warning: dwarf line number information for .data ignored
encrypt.c: /tmp/cciRY2Pf.s:987: Warning: dwarf line number information for .data ignored
encrypt.c: /tmp/cciRY2Pf.s:989: Warning: dwarf line number information for .data ignored
encrypt.c: /tmp/cciRY2Pf.s:990: Warning: dwarf line number information for .data ignored
encrypt.c: /tmp/cciRY2Pf.s:991: Warning: dwarf line number information for .data ignored
encrypt.c: /tmp/cciRY2Pf.s:1002: Warning: dwarf line number information for .data ignored
encrypt.c: /tmp/cciRY2Pf.s:1005: Warning: dwarf line number information for .data ignored
encrypt.c: /tmp/cciRY2Pf.s:1008: Warning: dwarf line number information for .data ignored
encrypt.c: /tmp/cciRY2Pf.s:1011: Warning: dwarf line number information for .data ignored
encrypt.c: ...

Number of similar (implementation,compiler) pairs: 1, namely:
ImplementationCompiler
T:avx1gcc -march=native -mtune=native -O2 -fwrapv -fPIC -fPIE -gdwarf-4 -Wall (11.4.0)

Compiler output


encrypt.c: /tmp/ccSYxHXt.s: Assembler messages:
encrypt.c: /tmp/ccSYxHXt.s:922: Warning: dwarf line number information for .data ignored
encrypt.c: /tmp/ccSYxHXt.s:924: Warning: dwarf line number information for .data ignored
encrypt.c: /tmp/ccSYxHXt.s:926: Warning: dwarf line number information for .data ignored
encrypt.c: /tmp/ccSYxHXt.s:927: Warning: dwarf line number information for .data ignored
encrypt.c: /tmp/ccSYxHXt.s:928: Warning: dwarf line number information for .data ignored
encrypt.c: /tmp/ccSYxHXt.s:939: Warning: dwarf line number information for .data ignored
encrypt.c: /tmp/ccSYxHXt.s:946: Warning: dwarf line number information for .data ignored
encrypt.c: /tmp/ccSYxHXt.s:949: Warning: dwarf line number information for .data ignored
encrypt.c: /tmp/ccSYxHXt.s:950: Warning: dwarf line number information for .data ignored
encrypt.c: /tmp/ccSYxHXt.s:957: Warning: dwarf line number information for .data ignored
encrypt.c: /tmp/ccSYxHXt.s:958: Warning: dwarf line number information for .data ignored
encrypt.c: /tmp/ccSYxHXt.s:961: Warning: dwarf line number information for .data ignored
encrypt.c: /tmp/ccSYxHXt.s:963: Warning: dwarf line number information for .data ignored
encrypt.c: /tmp/ccSYxHXt.s:966: Warning: dwarf line number information for .data ignored
encrypt.c: /tmp/ccSYxHXt.s:974: Warning: dwarf line number information for .data ignored
encrypt.c: /tmp/ccSYxHXt.s:985: Warning: dwarf line number information for .data ignored
encrypt.c: /tmp/ccSYxHXt.s:987: Warning: dwarf line number information for .data ignored
encrypt.c: /tmp/ccSYxHXt.s:989: Warning: dwarf line number information for .data ignored
encrypt.c: /tmp/ccSYxHXt.s:990: Warning: dwarf line number information for .data ignored
encrypt.c: /tmp/ccSYxHXt.s:991: Warning: dwarf line number information for .data ignored
encrypt.c: /tmp/ccSYxHXt.s:1002: Warning: dwarf line number information for .data ignored
encrypt.c: /tmp/ccSYxHXt.s:1005: Warning: dwarf line number information for .data ignored
encrypt.c: /tmp/ccSYxHXt.s:1008: Warning: dwarf line number information for .data ignored
encrypt.c: /tmp/ccSYxHXt.s:1011: Warning: dwarf line number information for .data ignored
encrypt.c: ...

Number of similar (implementation,compiler) pairs: 1, namely:
ImplementationCompiler
T:avx1gcc -march=native -mtune=native -O3 -fwrapv -fPIC -fPIE -gdwarf-4 -Wall (11.4.0)

Compiler output


encrypt.c: /tmp/ccc6sIOl.s: Assembler messages:
encrypt.c: /tmp/ccc6sIOl.s:921: Warning: dwarf line number information for .data ignored
encrypt.c: /tmp/ccc6sIOl.s:923: Warning: dwarf line number information for .data ignored
encrypt.c: /tmp/ccc6sIOl.s:935: Warning: dwarf line number information for .data ignored
encrypt.c: /tmp/ccc6sIOl.s:936: Warning: dwarf line number information for .data ignored
encrypt.c: /tmp/ccc6sIOl.s:937: Warning: dwarf line number information for .data ignored
encrypt.c: /tmp/ccc6sIOl.s:944: Warning: dwarf line number information for .data ignored
encrypt.c: /tmp/ccc6sIOl.s:947: Warning: dwarf line number information for .data ignored
encrypt.c: /tmp/ccc6sIOl.s:948: Warning: dwarf line number information for .data ignored
encrypt.c: /tmp/ccc6sIOl.s:953: Warning: dwarf line number information for .data ignored
encrypt.c: /tmp/ccc6sIOl.s:954: Warning: dwarf line number information for .data ignored
encrypt.c: /tmp/ccc6sIOl.s:957: Warning: dwarf line number information for .data ignored
encrypt.c: /tmp/ccc6sIOl.s:959: Warning: dwarf line number information for .data ignored
encrypt.c: /tmp/ccc6sIOl.s:962: Warning: dwarf line number information for .data ignored
encrypt.c: /tmp/ccc6sIOl.s:970: Warning: dwarf line number information for .data ignored
encrypt.c: /tmp/ccc6sIOl.s:980: Warning: dwarf line number information for .data ignored
encrypt.c: /tmp/ccc6sIOl.s:982: Warning: dwarf line number information for .data ignored
encrypt.c: /tmp/ccc6sIOl.s:995: Warning: dwarf line number information for .data ignored
encrypt.c: /tmp/ccc6sIOl.s:999: Warning: dwarf line number information for .data ignored
encrypt.c: /tmp/ccc6sIOl.s:1000: Warning: dwarf line number information for .data ignored
encrypt.c: /tmp/ccc6sIOl.s:1001: Warning: dwarf line number information for .data ignored
encrypt.c: /tmp/ccc6sIOl.s:1008: Warning: dwarf line number information for .data ignored
encrypt.c: /tmp/ccc6sIOl.s:1011: Warning: dwarf line number information for .data ignored
encrypt.c: /tmp/ccc6sIOl.s:1014: Warning: dwarf line number information for .data ignored
encrypt.c: /tmp/ccc6sIOl.s:1017: Warning: dwarf line number information for .data ignored
encrypt.c: ...

Number of similar (implementation,compiler) pairs: 1, namely:
ImplementationCompiler
T:avx1gcc -march=native -mtune=native -O -fwrapv -fPIC -fPIE -gdwarf-4 -Wall (11.4.0)

Compiler output


encrypt.c: /tmp/ccfaiqbk.s: Assembler messages:
encrypt.c: /tmp/ccfaiqbk.s:921: Warning: dwarf line number information for .data ignored
encrypt.c: /tmp/ccfaiqbk.s:923: Warning: dwarf line number information for .data ignored
encrypt.c: /tmp/ccfaiqbk.s:925: Warning: dwarf line number information for .data ignored
encrypt.c: /tmp/ccfaiqbk.s:926: Warning: dwarf line number information for .data ignored
encrypt.c: /tmp/ccfaiqbk.s:927: Warning: dwarf line number information for .data ignored
encrypt.c: /tmp/ccfaiqbk.s:937: Warning: dwarf line number information for .data ignored
encrypt.c: /tmp/ccfaiqbk.s:940: Warning: dwarf line number information for .data ignored
encrypt.c: /tmp/ccfaiqbk.s:942: Warning: dwarf line number information for .data ignored
encrypt.c: /tmp/ccfaiqbk.s:947: Warning: dwarf line number information for .data ignored
encrypt.c: /tmp/ccfaiqbk.s:950: Warning: dwarf line number information for .data ignored
encrypt.c: /tmp/ccfaiqbk.s:951: Warning: dwarf line number information for .data ignored
encrypt.c: /tmp/ccfaiqbk.s:958: Warning: dwarf line number information for .data ignored
encrypt.c: /tmp/ccfaiqbk.s:959: Warning: dwarf line number information for .data ignored
encrypt.c: /tmp/ccfaiqbk.s:962: Warning: dwarf line number information for .data ignored
encrypt.c: /tmp/ccfaiqbk.s:964: Warning: dwarf line number information for .data ignored
encrypt.c: /tmp/ccfaiqbk.s:967: Warning: dwarf line number information for .data ignored
encrypt.c: /tmp/ccfaiqbk.s:975: Warning: dwarf line number information for .data ignored
encrypt.c: /tmp/ccfaiqbk.s:985: Warning: dwarf line number information for .data ignored
encrypt.c: /tmp/ccfaiqbk.s:987: Warning: dwarf line number information for .data ignored
encrypt.c: /tmp/ccfaiqbk.s:989: Warning: dwarf line number information for .data ignored
encrypt.c: /tmp/ccfaiqbk.s:990: Warning: dwarf line number information for .data ignored
encrypt.c: /tmp/ccfaiqbk.s:991: Warning: dwarf line number information for .data ignored
encrypt.c: /tmp/ccfaiqbk.s:1001: Warning: dwarf line number information for .data ignored
encrypt.c: /tmp/ccfaiqbk.s:1003: Warning: dwarf line number information for .data ignored
encrypt.c: ...

Number of similar (implementation,compiler) pairs: 1, namely:
ImplementationCompiler
T:avx1gcc -march=native -mtune=native -Os -fwrapv -fPIC -fPIE -gdwarf-4 -Wall (11.4.0)

Compiler output


try.c: /usr/bin/ld: libcrypto_aead_omdsha256k128n96tau64v1.a(omdsha256.o):.../supercop-data/hydra5/amd64/try/c/clang_-march=native_-O2_-fwrapv_-Qunused-arguments_-fPIC_-fPIE_-gdwarf-4_-Wall/timingleaks/crypto_aead/omdsha256k128n96tau64v1/sse4/work/./omdsha256.h:137: multiple definition of `Hash'; libcrypto_aead_omdsha256k128n96tau64v1.a(encrypt.o):.../supercop-data/hydra5/amd64/try/c/clang_-march=native_-O2_-fwrapv_-Qunused-arguments_-fPIC_-fPIE_-gdwarf-4_-Wall/timingleaks/crypto_aead/omdsha256k128n96tau64v1/sse4/work/./omdsha256.h:137: first defined here
try.c: clang: error: linker command failed with exit code 1 (use -v to see invocation)

Number of similar (implementation,compiler) pairs: 1, namely:
ImplementationCompiler
T:sse4clang -march=native -O2 -fwrapv -Qunused-arguments -fPIC -fPIE -gdwarf-4 -Wall (Ubuntu_Clang_14.0.0)

Compiler output


try.c: /usr/bin/ld: libcrypto_aead_omdsha256k128n96tau64v1.a(omdsha256.o):.../supercop-data/hydra5/amd64/try/c/clang_-march=native_-O3_-fwrapv_-Qunused-arguments_-fPIC_-fPIE_-gdwarf-4_-Wall/timingleaks/crypto_aead/omdsha256k128n96tau64v1/sse4/work/./omdsha256.h:137: multiple definition of `Hash'; libcrypto_aead_omdsha256k128n96tau64v1.a(encrypt.o):.../supercop-data/hydra5/amd64/try/c/clang_-march=native_-O3_-fwrapv_-Qunused-arguments_-fPIC_-fPIE_-gdwarf-4_-Wall/timingleaks/crypto_aead/omdsha256k128n96tau64v1/sse4/work/./omdsha256.h:137: first defined here
try.c: clang: error: linker command failed with exit code 1 (use -v to see invocation)

Number of similar (implementation,compiler) pairs: 1, namely:
ImplementationCompiler
T:sse4clang -march=native -O3 -fwrapv -Qunused-arguments -fPIC -fPIE -gdwarf-4 -Wall (Ubuntu_Clang_14.0.0)

Compiler output


try.c: /usr/bin/ld: libcrypto_aead_omdsha256k128n96tau64v1.a(omdsha256.o):.../supercop-data/hydra5/amd64/try/c/clang_-march=native_-O_-fwrapv_-Qunused-arguments_-fPIC_-fPIE_-gdwarf-4_-Wall/timingleaks/crypto_aead/omdsha256k128n96tau64v1/sse4/work/./omdsha256.h:137: multiple definition of `Hash'; libcrypto_aead_omdsha256k128n96tau64v1.a(encrypt.o):.../supercop-data/hydra5/amd64/try/c/clang_-march=native_-O_-fwrapv_-Qunused-arguments_-fPIC_-fPIE_-gdwarf-4_-Wall/timingleaks/crypto_aead/omdsha256k128n96tau64v1/sse4/work/./omdsha256.h:137: first defined here
try.c: clang: error: linker command failed with exit code 1 (use -v to see invocation)

Number of similar (implementation,compiler) pairs: 1, namely:
ImplementationCompiler
T:sse4clang -march=native -O -fwrapv -Qunused-arguments -fPIC -fPIE -gdwarf-4 -Wall (Ubuntu_Clang_14.0.0)

Compiler output


try.c: /usr/bin/ld: libcrypto_aead_omdsha256k128n96tau64v1.a(omdsha256.o):.../supercop-data/hydra5/amd64/try/c/clang_-march=native_-Os_-fwrapv_-Qunused-arguments_-fPIC_-fPIE_-gdwarf-4_-Wall/timingleaks/crypto_aead/omdsha256k128n96tau64v1/sse4/work/./omdsha256.h:137: multiple definition of `Hash'; libcrypto_aead_omdsha256k128n96tau64v1.a(encrypt.o):.../supercop-data/hydra5/amd64/try/c/clang_-march=native_-Os_-fwrapv_-Qunused-arguments_-fPIC_-fPIE_-gdwarf-4_-Wall/timingleaks/crypto_aead/omdsha256k128n96tau64v1/sse4/work/./omdsha256.h:137: first defined here
try.c: clang: error: linker command failed with exit code 1 (use -v to see invocation)

Number of similar (implementation,compiler) pairs: 1, namely:
ImplementationCompiler
T:sse4clang -march=native -Os -fwrapv -Qunused-arguments -fPIC -fPIE -gdwarf-4 -Wall (Ubuntu_Clang_14.0.0)

Compiler output


try.c: /usr/bin/ld: libcrypto_aead_omdsha256k128n96tau64v1.a(omdsha256.o):.../supercop-data/hydra5/amd64/try/c/clang_-mcpu=native_-O3_-fwrapv_-Qunused-arguments_-fPIC_-fPIE_-gdwarf-4_-Wall/timingleaks/crypto_aead/omdsha256k128n96tau64v1/sse4/work/./omdsha256.h:137: multiple definition of `Hash'; libcrypto_aead_omdsha256k128n96tau64v1.a(encrypt.o):.../supercop-data/hydra5/amd64/try/c/clang_-mcpu=native_-O3_-fwrapv_-Qunused-arguments_-fPIC_-fPIE_-gdwarf-4_-Wall/timingleaks/crypto_aead/omdsha256k128n96tau64v1/sse4/work/./omdsha256.h:137: first defined here
try.c: clang: error: linker command failed with exit code 1 (use -v to see invocation)

Number of similar (implementation,compiler) pairs: 1, namely:
ImplementationCompiler
T:sse4clang -mcpu=native -O3 -fwrapv -Qunused-arguments -fPIC -fPIE -gdwarf-4 -Wall (Ubuntu_Clang_14.0.0)

Compiler output


encrypt.c: /tmp/cctDWZwd.s: Assembler messages:
encrypt.c: /tmp/cctDWZwd.s:961: Warning: dwarf line number information for .data ignored
encrypt.c: /tmp/cctDWZwd.s:963: Warning: dwarf line number information for .data ignored
encrypt.c: /tmp/cctDWZwd.s:965: Warning: dwarf line number information for .data ignored
encrypt.c: /tmp/cctDWZwd.s:966: Warning: dwarf line number information for .data ignored
encrypt.c: /tmp/cctDWZwd.s:967: Warning: dwarf line number information for .data ignored
encrypt.c: /tmp/cctDWZwd.s:978: Warning: dwarf line number information for .data ignored
encrypt.c: /tmp/cctDWZwd.s:985: Warning: dwarf line number information for .data ignored
encrypt.c: /tmp/cctDWZwd.s:988: Warning: dwarf line number information for .data ignored
encrypt.c: /tmp/cctDWZwd.s:989: Warning: dwarf line number information for .data ignored
encrypt.c: /tmp/cctDWZwd.s:996: Warning: dwarf line number information for .data ignored
encrypt.c: /tmp/cctDWZwd.s:997: Warning: dwarf line number information for .data ignored
encrypt.c: /tmp/cctDWZwd.s:1000: Warning: dwarf line number information for .data ignored
encrypt.c: /tmp/cctDWZwd.s:1002: Warning: dwarf line number information for .data ignored
encrypt.c: /tmp/cctDWZwd.s:1005: Warning: dwarf line number information for .data ignored
encrypt.c: /tmp/cctDWZwd.s:1013: Warning: dwarf line number information for .data ignored
encrypt.c: /tmp/cctDWZwd.s:1024: Warning: dwarf line number information for .data ignored
encrypt.c: /tmp/cctDWZwd.s:1026: Warning: dwarf line number information for .data ignored
encrypt.c: /tmp/cctDWZwd.s:1028: Warning: dwarf line number information for .data ignored
encrypt.c: /tmp/cctDWZwd.s:1029: Warning: dwarf line number information for .data ignored
encrypt.c: /tmp/cctDWZwd.s:1030: Warning: dwarf line number information for .data ignored
encrypt.c: /tmp/cctDWZwd.s:1041: Warning: dwarf line number information for .data ignored
encrypt.c: /tmp/cctDWZwd.s:1044: Warning: dwarf line number information for .data ignored
encrypt.c: /tmp/cctDWZwd.s:1047: Warning: dwarf line number information for .data ignored
encrypt.c: /tmp/cctDWZwd.s:1050: Warning: dwarf line number information for .data ignored
encrypt.c: ...

Number of similar (implementation,compiler) pairs: 1, namely:
ImplementationCompiler
T:sse4gcc -march=native -mtune=native -O2 -fwrapv -fPIC -fPIE -gdwarf-4 -Wall (11.4.0)

Compiler output


encrypt.c: /tmp/ccjHXJRD.s: Assembler messages:
encrypt.c: /tmp/ccjHXJRD.s:961: Warning: dwarf line number information for .data ignored
encrypt.c: /tmp/ccjHXJRD.s:963: Warning: dwarf line number information for .data ignored
encrypt.c: /tmp/ccjHXJRD.s:965: Warning: dwarf line number information for .data ignored
encrypt.c: /tmp/ccjHXJRD.s:966: Warning: dwarf line number information for .data ignored
encrypt.c: /tmp/ccjHXJRD.s:967: Warning: dwarf line number information for .data ignored
encrypt.c: /tmp/ccjHXJRD.s:978: Warning: dwarf line number information for .data ignored
encrypt.c: /tmp/ccjHXJRD.s:985: Warning: dwarf line number information for .data ignored
encrypt.c: /tmp/ccjHXJRD.s:988: Warning: dwarf line number information for .data ignored
encrypt.c: /tmp/ccjHXJRD.s:989: Warning: dwarf line number information for .data ignored
encrypt.c: /tmp/ccjHXJRD.s:996: Warning: dwarf line number information for .data ignored
encrypt.c: /tmp/ccjHXJRD.s:997: Warning: dwarf line number information for .data ignored
encrypt.c: /tmp/ccjHXJRD.s:1000: Warning: dwarf line number information for .data ignored
encrypt.c: /tmp/ccjHXJRD.s:1002: Warning: dwarf line number information for .data ignored
encrypt.c: /tmp/ccjHXJRD.s:1005: Warning: dwarf line number information for .data ignored
encrypt.c: /tmp/ccjHXJRD.s:1013: Warning: dwarf line number information for .data ignored
encrypt.c: /tmp/ccjHXJRD.s:1024: Warning: dwarf line number information for .data ignored
encrypt.c: /tmp/ccjHXJRD.s:1026: Warning: dwarf line number information for .data ignored
encrypt.c: /tmp/ccjHXJRD.s:1028: Warning: dwarf line number information for .data ignored
encrypt.c: /tmp/ccjHXJRD.s:1029: Warning: dwarf line number information for .data ignored
encrypt.c: /tmp/ccjHXJRD.s:1030: Warning: dwarf line number information for .data ignored
encrypt.c: /tmp/ccjHXJRD.s:1041: Warning: dwarf line number information for .data ignored
encrypt.c: /tmp/ccjHXJRD.s:1044: Warning: dwarf line number information for .data ignored
encrypt.c: /tmp/ccjHXJRD.s:1047: Warning: dwarf line number information for .data ignored
encrypt.c: /tmp/ccjHXJRD.s:1050: Warning: dwarf line number information for .data ignored
encrypt.c: ...

Number of similar (implementation,compiler) pairs: 1, namely:
ImplementationCompiler
T:sse4gcc -march=native -mtune=native -O3 -fwrapv -fPIC -fPIE -gdwarf-4 -Wall (11.4.0)

Compiler output


encrypt.c: /tmp/ccKgXHEh.s: Assembler messages:
encrypt.c: /tmp/ccKgXHEh.s:960: Warning: dwarf line number information for .data ignored
encrypt.c: /tmp/ccKgXHEh.s:962: Warning: dwarf line number information for .data ignored
encrypt.c: /tmp/ccKgXHEh.s:974: Warning: dwarf line number information for .data ignored
encrypt.c: /tmp/ccKgXHEh.s:975: Warning: dwarf line number information for .data ignored
encrypt.c: /tmp/ccKgXHEh.s:976: Warning: dwarf line number information for .data ignored
encrypt.c: /tmp/ccKgXHEh.s:983: Warning: dwarf line number information for .data ignored
encrypt.c: /tmp/ccKgXHEh.s:986: Warning: dwarf line number information for .data ignored
encrypt.c: /tmp/ccKgXHEh.s:987: Warning: dwarf line number information for .data ignored
encrypt.c: /tmp/ccKgXHEh.s:992: Warning: dwarf line number information for .data ignored
encrypt.c: /tmp/ccKgXHEh.s:993: Warning: dwarf line number information for .data ignored
encrypt.c: /tmp/ccKgXHEh.s:996: Warning: dwarf line number information for .data ignored
encrypt.c: /tmp/ccKgXHEh.s:998: Warning: dwarf line number information for .data ignored
encrypt.c: /tmp/ccKgXHEh.s:1001: Warning: dwarf line number information for .data ignored
encrypt.c: /tmp/ccKgXHEh.s:1009: Warning: dwarf line number information for .data ignored
encrypt.c: /tmp/ccKgXHEh.s:1019: Warning: dwarf line number information for .data ignored
encrypt.c: /tmp/ccKgXHEh.s:1021: Warning: dwarf line number information for .data ignored
encrypt.c: /tmp/ccKgXHEh.s:1034: Warning: dwarf line number information for .data ignored
encrypt.c: /tmp/ccKgXHEh.s:1038: Warning: dwarf line number information for .data ignored
encrypt.c: /tmp/ccKgXHEh.s:1039: Warning: dwarf line number information for .data ignored
encrypt.c: /tmp/ccKgXHEh.s:1040: Warning: dwarf line number information for .data ignored
encrypt.c: /tmp/ccKgXHEh.s:1047: Warning: dwarf line number information for .data ignored
encrypt.c: /tmp/ccKgXHEh.s:1050: Warning: dwarf line number information for .data ignored
encrypt.c: /tmp/ccKgXHEh.s:1053: Warning: dwarf line number information for .data ignored
encrypt.c: /tmp/ccKgXHEh.s:1056: Warning: dwarf line number information for .data ignored
encrypt.c: ...

Number of similar (implementation,compiler) pairs: 1, namely:
ImplementationCompiler
T:sse4gcc -march=native -mtune=native -O -fwrapv -fPIC -fPIE -gdwarf-4 -Wall (11.4.0)

Compiler output


encrypt.c: /tmp/cc0gFbVu.s: Assembler messages:
encrypt.c: /tmp/cc0gFbVu.s:960: Warning: dwarf line number information for .data ignored
encrypt.c: /tmp/cc0gFbVu.s:962: Warning: dwarf line number information for .data ignored
encrypt.c: /tmp/cc0gFbVu.s:964: Warning: dwarf line number information for .data ignored
encrypt.c: /tmp/cc0gFbVu.s:965: Warning: dwarf line number information for .data ignored
encrypt.c: /tmp/cc0gFbVu.s:966: Warning: dwarf line number information for .data ignored
encrypt.c: /tmp/cc0gFbVu.s:976: Warning: dwarf line number information for .data ignored
encrypt.c: /tmp/cc0gFbVu.s:979: Warning: dwarf line number information for .data ignored
encrypt.c: /tmp/cc0gFbVu.s:981: Warning: dwarf line number information for .data ignored
encrypt.c: /tmp/cc0gFbVu.s:986: Warning: dwarf line number information for .data ignored
encrypt.c: /tmp/cc0gFbVu.s:989: Warning: dwarf line number information for .data ignored
encrypt.c: /tmp/cc0gFbVu.s:990: Warning: dwarf line number information for .data ignored
encrypt.c: /tmp/cc0gFbVu.s:997: Warning: dwarf line number information for .data ignored
encrypt.c: /tmp/cc0gFbVu.s:998: Warning: dwarf line number information for .data ignored
encrypt.c: /tmp/cc0gFbVu.s:1001: Warning: dwarf line number information for .data ignored
encrypt.c: /tmp/cc0gFbVu.s:1003: Warning: dwarf line number information for .data ignored
encrypt.c: /tmp/cc0gFbVu.s:1006: Warning: dwarf line number information for .data ignored
encrypt.c: /tmp/cc0gFbVu.s:1014: Warning: dwarf line number information for .data ignored
encrypt.c: /tmp/cc0gFbVu.s:1024: Warning: dwarf line number information for .data ignored
encrypt.c: /tmp/cc0gFbVu.s:1026: Warning: dwarf line number information for .data ignored
encrypt.c: /tmp/cc0gFbVu.s:1028: Warning: dwarf line number information for .data ignored
encrypt.c: /tmp/cc0gFbVu.s:1029: Warning: dwarf line number information for .data ignored
encrypt.c: /tmp/cc0gFbVu.s:1030: Warning: dwarf line number information for .data ignored
encrypt.c: /tmp/cc0gFbVu.s:1040: Warning: dwarf line number information for .data ignored
encrypt.c: /tmp/cc0gFbVu.s:1042: Warning: dwarf line number information for .data ignored
encrypt.c: ...

Number of similar (implementation,compiler) pairs: 1, namely:
ImplementationCompiler
T:sse4gcc -march=native -mtune=native -Os -fwrapv -fPIC -fPIE -gdwarf-4 -Wall (11.4.0)

Namespace violations


omdsha256.o calc_L_i T
omdsha256.o double_block T
omdsha256.o final_masking_associated_data T
omdsha256.o final_masking_message T
omdsha256.o hash T
omdsha256.o increment_masking_associated_data T
omdsha256.o increment_masking_message T
omdsha256.o key_func T
omdsha256.o l2b T
omdsha256.o ntz T
omdsha256.o omdsha256_process T
omdsha256.o triple_block T
omdsha256.o xor_block T
sha256.o sha256_comp T

Number of similar (implementation,compiler) pairs: 9, namely:
ImplementationCompiler
T:refclang -march=native -O2 -fwrapv -Qunused-arguments -fPIC -fPIE -gdwarf-4 -Wall (Ubuntu_Clang_14.0.0)
T:refclang -march=native -O3 -fwrapv -Qunused-arguments -fPIC -fPIE -gdwarf-4 -Wall (Ubuntu_Clang_14.0.0)
T:refclang -march=native -O -fwrapv -Qunused-arguments -fPIC -fPIE -gdwarf-4 -Wall (Ubuntu_Clang_14.0.0)
T:refclang -march=native -Os -fwrapv -Qunused-arguments -fPIC -fPIE -gdwarf-4 -Wall (Ubuntu_Clang_14.0.0)
T:refclang -mcpu=native -O3 -fwrapv -Qunused-arguments -fPIC -fPIE -gdwarf-4 -Wall (Ubuntu_Clang_14.0.0)
T:refgcc -march=native -mtune=native -O2 -fwrapv -fPIC -fPIE -gdwarf-4 -Wall (11.4.0)
T:refgcc -march=native -mtune=native -O3 -fwrapv -fPIC -fPIE -gdwarf-4 -Wall (11.4.0)
T:refgcc -march=native -mtune=native -O -fwrapv -fPIC -fPIE -gdwarf-4 -Wall (11.4.0)
T:refgcc -march=native -mtune=native -Os -fwrapv -fPIC -fPIE -gdwarf-4 -Wall (11.4.0)