Test results for amd64, hydra5, crypto_aead/ascon80pqv12
[Page version: 20250331 22:18:11]
Measurements for amd64, hydra5, crypto_aead
Test results for amd64, hydra5, crypto_aead
Test results for crypto_aead/ascon80pqv12
Computer: hydra5
Microarchitecture: amd64; K10 32nm (300f10)
Architecture: amd64
CPU ID: AuthenticAMD-00300f10-178bfbff
SUPERCOP version: 20250307
Operation: crypto_aead
Primitive: ascon80pqv12
Time | Object size | Test size | Implementation | Compiler | Benchmark date | SUPERCOP version |
86019 | 14949 0 0 | 28936 860 1024 | opt64 | clang -march=native -O -fwrapv -Qunused-arguments -fPIC -fPIE -gdwarf-4 -Wall | 20250311 | 20250307 |
87308 | 15000 0 0 | 28186 852 1024 | opt64 | clang -march=native -Os -fwrapv -Qunused-arguments -fPIC -fPIE -gdwarf-4 -Wall | 20250311 | 20250307 |
87371 | 15063 0 0 | 31424 860 1024 | opt64 | clang -mcpu=native -O3 -fwrapv -Qunused-arguments -fPIC -fPIE -gdwarf-4 -Wall | 20250311 | 20250307 |
87378 | 15063 0 0 | 31424 860 1024 | opt64 | clang -march=native -O3 -fwrapv -Qunused-arguments -fPIC -fPIE -gdwarf-4 -Wall | 20250311 | 20250307 |
87379 | 15041 0 0 | 30504 860 1024 | opt64 | clang -march=native -O2 -fwrapv -Qunused-arguments -fPIC -fPIE -gdwarf-4 -Wall | 20250311 | 20250307 |
89660 | 16495 0 0 | 33405 804 1088 | opt64 | gcc -march=native -mtune=native -O3 -fwrapv -fPIC -fPIE -gdwarf-4 -Wall | 20250311 | 20250307 |
89849 | 16503 0 0 | 32069 804 1088 | opt64 | gcc -march=native -mtune=native -O2 -fwrapv -fPIC -fPIE -gdwarf-4 -Wall | 20250311 | 20250307 |
90694 | 16163 0 0 | 29608 780 1056 | opt64 | gcc -march=native -mtune=native -Os -fwrapv -fPIC -fPIE -gdwarf-4 -Wall | 20250311 | 20250307 |
98304 | 6459 0 0 | 22848 860 1024 | ref | clang -mcpu=native -O3 -fwrapv -Qunused-arguments -fPIC -fPIE -gdwarf-4 -Wall | 20250311 | 20250307 |
98316 | 6411 0 0 | 21896 860 1024 | ref | clang -march=native -O2 -fwrapv -Qunused-arguments -fPIC -fPIE -gdwarf-4 -Wall | 20250311 | 20250307 |
98366 | 6459 0 0 | 22848 860 1024 | ref | clang -march=native -O3 -fwrapv -Qunused-arguments -fPIC -fPIE -gdwarf-4 -Wall | 20250311 | 20250307 |
99436 | 18720 0 0 | 35645 804 1088 | ref | gcc -march=native -mtune=native -O3 -fwrapv -fPIC -fPIE -gdwarf-4 -Wall | 20250311 | 20250307 |
101354 | 18680 0 0 | 33340 796 1088 | opt64 | gcc -march=native -mtune=native -O -fwrapv -fPIC -fPIE -gdwarf-4 -Wall | 20250311 | 20250307 |
102100 | 3769 0 0 | 20740 812 1088 | opt64_lowsize | gcc -march=native -mtune=native -O3 -fwrapv -fPIC -fPIE -gdwarf-4 -Wall | 20250311 | 20250307 |
103398 | 1709 0 0 | 18048 860 1024 | opt64_lowsize | clang -mcpu=native -O3 -fwrapv -Qunused-arguments -fPIC -fPIE -gdwarf-4 -Wall | 20250311 | 20250307 |
103431 | 1709 0 0 | 18048 860 1024 | opt64_lowsize | clang -march=native -O3 -fwrapv -Qunused-arguments -fPIC -fPIE -gdwarf-4 -Wall | 20250311 | 20250307 |
103581 | 2078 0 0 | 17716 812 1088 | opt64_lowsize | gcc -march=native -mtune=native -O2 -fwrapv -fPIC -fPIE -gdwarf-4 -Wall | 20250311 | 20250307 |
104278 | 1571 0 0 | 17032 860 1024 | opt64_lowsize | clang -march=native -O2 -fwrapv -Qunused-arguments -fPIC -fPIE -gdwarf-4 -Wall | 20250311 | 20250307 |
105344 | 1487 0 0 | 15456 860 1024 | opt64_lowsize | clang -march=native -O -fwrapv -Qunused-arguments -fPIC -fPIE -gdwarf-4 -Wall | 20250311 | 20250307 |
106769 | 1525 0 0 | 14682 852 1024 | opt64_lowsize | clang -march=native -Os -fwrapv -Qunused-arguments -fPIC -fPIE -gdwarf-4 -Wall | 20250311 | 20250307 |
108928 | 1881 0 0 | 15311 788 1056 | opt64_lowsize | gcc -march=native -mtune=native -Os -fwrapv -fPIC -fPIE -gdwarf-4 -Wall | 20250311 | 20250307 |
116642 | 19926 0 0 | 33384 780 1056 | opt32 | gcc -march=native -mtune=native -Os -fwrapv -fPIC -fPIE -gdwarf-4 -Wall | 20250311 | 20250307 |
116872 | 19629 0 0 | 32826 852 1024 | opt32 | clang -march=native -Os -fwrapv -Qunused-arguments -fPIC -fPIE -gdwarf-4 -Wall | 20250311 | 20250307 |
117228 | 19674 0 0 | 35144 860 1024 | opt32 | clang -march=native -O2 -fwrapv -Qunused-arguments -fPIC -fPIE -gdwarf-4 -Wall | 20250311 | 20250307 |
117228 | 19674 0 0 | 36032 860 1024 | opt32 | clang -mcpu=native -O3 -fwrapv -Qunused-arguments -fPIC -fPIE -gdwarf-4 -Wall | 20250311 | 20250307 |
117229 | 19674 0 0 | 36032 860 1024 | opt32 | clang -march=native -O3 -fwrapv -Qunused-arguments -fPIC -fPIE -gdwarf-4 -Wall | 20250311 | 20250307 |
118322 | 19692 0 0 | 33672 860 1024 | opt32 | clang -march=native -O -fwrapv -Qunused-arguments -fPIC -fPIE -gdwarf-4 -Wall | 20250311 | 20250307 |
119514 | 20431 0 0 | 37341 804 1088 | opt32 | gcc -march=native -mtune=native -O3 -fwrapv -fPIC -fPIE -gdwarf-4 -Wall | 20250311 | 20250307 |
119894 | 20423 0 0 | 35973 804 1088 | opt32 | gcc -march=native -mtune=native -O2 -fwrapv -fPIC -fPIE -gdwarf-4 -Wall | 20250311 | 20250307 |
120339 | 5682 0 0 | 19688 860 1024 | ref | clang -march=native -O -fwrapv -Qunused-arguments -fPIC -fPIE -gdwarf-4 -Wall | 20250311 | 20250307 |
121176 | 3190 0 0 | 17891 804 1088 | opt64_lowsize | gcc -march=native -mtune=native -O -fwrapv -fPIC -fPIE -gdwarf-4 -Wall | 20250311 | 20250307 |
121354 | 6586 0 0 | 19722 852 1024 | ref | clang -march=native -Os -fwrapv -Qunused-arguments -fPIC -fPIE -gdwarf-4 -Wall | 20250311 | 20250307 |
121590 | 11055 0 0 | 26669 804 1088 | ref | gcc -march=native -mtune=native -O2 -fwrapv -fPIC -fPIE -gdwarf-4 -Wall | 20250311 | 20250307 |
125506 | 10839 0 0 | 25572 796 1088 | ref | gcc -march=native -mtune=native -O -fwrapv -fPIC -fPIE -gdwarf-4 -Wall | 20250311 | 20250307 |
135252 | 1749 0 0 | 18104 860 1024 | opt32_lowsize | clang -mcpu=native -O3 -fwrapv -Qunused-arguments -fPIC -fPIE -gdwarf-4 -Wall | 20250311 | 20250307 |
135255 | 1749 0 0 | 18104 860 1024 | opt32_lowsize | clang -march=native -O3 -fwrapv -Qunused-arguments -fPIC -fPIE -gdwarf-4 -Wall | 20250311 | 20250307 |
135266 | 1611 0 0 | 17056 860 1024 | opt32_lowsize | clang -march=native -O2 -fwrapv -Qunused-arguments -fPIC -fPIE -gdwarf-4 -Wall | 20250311 | 20250307 |
135331 | 1527 0 0 | 15480 860 1024 | opt32_lowsize | clang -march=native -O -fwrapv -Qunused-arguments -fPIC -fPIE -gdwarf-4 -Wall | 20250311 | 20250307 |
136020 | 23262 0 0 | 37948 796 1088 | opt32 | gcc -march=native -mtune=native -O -fwrapv -fPIC -fPIE -gdwarf-4 -Wall | 20250311 | 20250307 |
136654 | 1563 0 0 | 14706 852 1024 | opt32_lowsize | clang -march=native -Os -fwrapv -Qunused-arguments -fPIC -fPIE -gdwarf-4 -Wall | 20250311 | 20250307 |
138942 | 3839 0 0 | 20812 812 1088 | opt32_lowsize | gcc -march=native -mtune=native -O3 -fwrapv -fPIC -fPIE -gdwarf-4 -Wall | 20250311 | 20250307 |
140480 | 2148 0 0 | 17788 812 1088 | opt32_lowsize | gcc -march=native -mtune=native -O2 -fwrapv -fPIC -fPIE -gdwarf-4 -Wall | 20250311 | 20250307 |
141271 | 1965 0 0 | 15391 788 1056 | opt32_lowsize | gcc -march=native -mtune=native -Os -fwrapv -fPIC -fPIE -gdwarf-4 -Wall | 20250311 | 20250307 |
150970 | 3258 0 0 | 17931 804 1088 | opt32_lowsize | gcc -march=native -mtune=native -O -fwrapv -fPIC -fPIE -gdwarf-4 -Wall | 20250311 | 20250307 |
186930 | 2319 0 0 | 15848 780 1056 | ref | gcc -march=native -mtune=native -Os -fwrapv -fPIC -fPIE -gdwarf-4 -Wall | 20250311 | 20250307 |
216898 | 15079 0 0 | 31877 804 1088 | bi32 | gcc -march=native -mtune=native -O3 -fwrapv -fPIC -fPIE -gdwarf-4 -Wall | 20250311 | 20250307 |
217257 | 14527 0 0 | 29997 804 1088 | bi32 | gcc -march=native -mtune=native -O2 -fwrapv -fPIC -fPIE -gdwarf-4 -Wall | 20250311 | 20250307 |
219774 | 13162 0 0 | 27128 860 1024 | bi32 | clang -march=native -O -fwrapv -Qunused-arguments -fPIC -fPIE -gdwarf-4 -Wall | 20250311 | 20250307 |
220234 | 13282 0 0 | 29648 860 1024 | bi32 | clang -march=native -O3 -fwrapv -Qunused-arguments -fPIC -fPIE -gdwarf-4 -Wall | 20250311 | 20250307 |
220272 | 13282 0 0 | 29648 860 1024 | bi32 | clang -mcpu=native -O3 -fwrapv -Qunused-arguments -fPIC -fPIE -gdwarf-4 -Wall | 20250311 | 20250307 |
220295 | 13282 0 0 | 28760 860 1024 | bi32 | clang -march=native -O2 -fwrapv -Qunused-arguments -fPIC -fPIE -gdwarf-4 -Wall | 20250311 | 20250307 |
220423 | 14396 0 0 | 27760 780 1056 | bi32 | gcc -march=native -mtune=native -Os -fwrapv -fPIC -fPIE -gdwarf-4 -Wall | 20250311 | 20250307 |
222412 | 13400 0 0 | 26570 852 1024 | bi32 | clang -march=native -Os -fwrapv -Qunused-arguments -fPIC -fPIE -gdwarf-4 -Wall | 20250311 | 20250307 |
232507 | 16594 0 0 | 31172 796 1088 | bi32 | gcc -march=native -mtune=native -O -fwrapv -fPIC -fPIE -gdwarf-4 -Wall | 20250311 | 20250307 |
239987 | 9408 0 0 | 24997 804 1088 | bi32_lowreg | gcc -march=native -mtune=native -O2 -fwrapv -fPIC -fPIE -gdwarf-4 -Wall | 20250311 | 20250307 |
240031 | 9456 0 0 | 26365 804 1088 | bi32_lowreg | gcc -march=native -mtune=native -O3 -fwrapv -fPIC -fPIE -gdwarf-4 -Wall | 20250311 | 20250307 |
245742 | 8550 0 0 | 21802 852 1024 | bi32_lowreg | clang -march=native -Os -fwrapv -Qunused-arguments -fPIC -fPIE -gdwarf-4 -Wall | 20250311 | 20250307 |
246335 | 8596 0 0 | 24128 860 1024 | bi32_lowreg | clang -march=native -O2 -fwrapv -Qunused-arguments -fPIC -fPIE -gdwarf-4 -Wall | 20250311 | 20250307 |
246338 | 8596 0 0 | 25016 860 1024 | bi32_lowreg | clang -mcpu=native -O3 -fwrapv -Qunused-arguments -fPIC -fPIE -gdwarf-4 -Wall | 20250311 | 20250307 |
246414 | 8596 0 0 | 25016 860 1024 | bi32_lowreg | clang -march=native -O3 -fwrapv -Qunused-arguments -fPIC -fPIE -gdwarf-4 -Wall | 20250311 | 20250307 |
257163 | 2756 0 0 | 16143 788 1056 | bi32_lowsize | gcc -march=native -mtune=native -Os -fwrapv -fPIC -fPIE -gdwarf-4 -Wall | 20250311 | 20250307 |
257806 | 2647 0 0 | 18992 860 1024 | bi32_lowsize | clang -march=native -O3 -fwrapv -Qunused-arguments -fPIC -fPIE -gdwarf-4 -Wall | 20250311 | 20250307 |
257806 | 2647 0 0 | 18992 860 1024 | bi32_lowsize | clang -mcpu=native -O3 -fwrapv -Qunused-arguments -fPIC -fPIE -gdwarf-4 -Wall | 20250311 | 20250307 |
258271 | 9168 0 0 | 22616 780 1056 | bi32_lowreg | gcc -march=native -mtune=native -Os -fwrapv -fPIC -fPIE -gdwarf-4 -Wall | 20250311 | 20250307 |
259345 | 4982 0 0 | 21916 812 1088 | bi32_lowsize | gcc -march=native -mtune=native -O3 -fwrapv -fPIC -fPIE -gdwarf-4 -Wall | 20250311 | 20250307 |
260373 | 2963 0 0 | 18572 812 1088 | bi32_lowsize | gcc -march=native -mtune=native -O2 -fwrapv -fPIC -fPIE -gdwarf-4 -Wall | 20250311 | 20250307 |
260601 | 8328 0 0 | 22392 860 1024 | bi32_lowreg | clang -march=native -O -fwrapv -Qunused-arguments -fPIC -fPIE -gdwarf-4 -Wall | 20250311 | 20250307 |
260632 | 2483 0 0 | 17944 860 1024 | bi32_lowsize | clang -march=native -O2 -fwrapv -Qunused-arguments -fPIC -fPIE -gdwarf-4 -Wall | 20250311 | 20250307 |
261684 | 2453 0 0 | 15602 852 1024 | bi32_lowsize | clang -march=native -Os -fwrapv -Qunused-arguments -fPIC -fPIE -gdwarf-4 -Wall | 20250311 | 20250307 |
271623 | 10573 0 0 | 25284 796 1088 | bi32_lowreg | gcc -march=native -mtune=native -O -fwrapv -fPIC -fPIE -gdwarf-4 -Wall | 20250311 | 20250307 |
278728 | 3134 0 0 | 17755 804 1088 | bi32_lowsize | gcc -march=native -mtune=native -O -fwrapv -fPIC -fPIE -gdwarf-4 -Wall | 20250311 | 20250307 |
283061 | 2373 0 0 | 16328 860 1024 | bi32_lowsize | clang -march=native -O -fwrapv -Qunused-arguments -fPIC -fPIE -gdwarf-4 -Wall | 20250311 | 20250307 |
782006 | 6072 0 0 | 21560 860 1024 | opt8_lowsize | clang -march=native -O2 -fwrapv -Qunused-arguments -fPIC -fPIE -gdwarf-4 -Wall | 20250311 | 20250307 |
789396 | 5958 0 0 | 21480 860 1024 | opt8 | clang -march=native -O2 -fwrapv -Qunused-arguments -fPIC -fPIE -gdwarf-4 -Wall | 20250311 | 20250307 |
836819 | 9677 0 0 | 23288 860 1024 | bi8 | clang -march=native -O -fwrapv -Qunused-arguments -fPIC -fPIE -gdwarf-4 -Wall | 20250311 | 20250307 |
842442 | 9957 0 0 | 25952 860 1024 | bi8 | clang -march=native -O3 -fwrapv -Qunused-arguments -fPIC -fPIE -gdwarf-4 -Wall | 20250311 | 20250307 |
843228 | 9957 0 0 | 25952 860 1024 | bi8 | clang -mcpu=native -O3 -fwrapv -Qunused-arguments -fPIC -fPIE -gdwarf-4 -Wall | 20250311 | 20250307 |
845537 | 9957 0 0 | 25064 860 1024 | bi8 | clang -march=native -O2 -fwrapv -Qunused-arguments -fPIC -fPIE -gdwarf-4 -Wall | 20250311 | 20250307 |
848139 | 9937 0 0 | 22746 852 1024 | bi8 | clang -march=native -Os -fwrapv -Qunused-arguments -fPIC -fPIE -gdwarf-4 -Wall | 20250311 | 20250307 |
848463 | 3493 0 0 | 16690 852 1024 | opt8_lowsize | clang -march=native -Os -fwrapv -Qunused-arguments -fPIC -fPIE -gdwarf-4 -Wall | 20250311 | 20250307 |
849885 | 3554 0 0 | 16786 852 1024 | opt8 | clang -march=native -Os -fwrapv -Qunused-arguments -fPIC -fPIE -gdwarf-4 -Wall | 20250311 | 20250307 |
1131461 | 6785 0 0 | 23184 860 1024 | opt8_lowsize | clang -march=native -O3 -fwrapv -Qunused-arguments -fPIC -fPIE -gdwarf-4 -Wall | 20250311 | 20250307 |
1131632 | 6778 0 0 | 23152 860 1024 | opt8_lowsize | clang -mcpu=native -O3 -fwrapv -Qunused-arguments -fPIC -fPIE -gdwarf-4 -Wall | 20250311 | 20250307 |
1132703 | 6668 0 0 | 23072 860 1024 | opt8 | clang -mcpu=native -O3 -fwrapv -Qunused-arguments -fPIC -fPIE -gdwarf-4 -Wall | 20250311 | 20250307 |
1132803 | 6671 0 0 | 23072 860 1024 | opt8 | clang -march=native -O3 -fwrapv -Qunused-arguments -fPIC -fPIE -gdwarf-4 -Wall | 20250311 | 20250307 |
1165776 | 13442 0 0 | 27676 796 1088 | bi8 | gcc -march=native -mtune=native -O -fwrapv -fPIC -fPIE -gdwarf-4 -Wall | 20250311 | 20250307 |
1166667 | 12932 0 0 | 25928 780 1056 | bi8 | gcc -march=native -mtune=native -Os -fwrapv -fPIC -fPIE -gdwarf-4 -Wall | 20250311 | 20250307 |
1172505 | 11445 0 0 | 27869 804 1088 | bi8 | gcc -march=native -mtune=native -O3 -fwrapv -fPIC -fPIE -gdwarf-4 -Wall | 20250311 | 20250307 |
1172565 | 11549 0 0 | 26661 804 1088 | bi8 | gcc -march=native -mtune=native -O2 -fwrapv -fPIC -fPIE -gdwarf-4 -Wall | 20250311 | 20250307 |
1261295 | 4482 0 0 | 18496 860 1024 | opt8 | clang -march=native -O -fwrapv -Qunused-arguments -fPIC -fPIE -gdwarf-4 -Wall | 20250311 | 20250307 |
1267658 | 3752 0 0 | 17760 860 1024 | opt8_lowsize | clang -march=native -O -fwrapv -Qunused-arguments -fPIC -fPIE -gdwarf-4 -Wall | 20250311 | 20250307 |
1968963 | 7020 0 0 | 23989 804 1088 | opt8 | gcc -march=native -mtune=native -O3 -fwrapv -fPIC -fPIE -gdwarf-4 -Wall | 20250311 | 20250307 |
1973213 | 6949 0 0 | 23901 804 1088 | opt8_lowsize | gcc -march=native -mtune=native -O3 -fwrapv -fPIC -fPIE -gdwarf-4 -Wall | 20250311 | 20250307 |
2046702 | 5007 0 0 | 18480 780 1056 | opt8 | gcc -march=native -mtune=native -Os -fwrapv -fPIC -fPIE -gdwarf-4 -Wall | 20250311 | 20250307 |
2057981 | 5497 0 0 | 21117 804 1088 | opt8 | gcc -march=native -mtune=native -O2 -fwrapv -fPIC -fPIE -gdwarf-4 -Wall | 20250311 | 20250307 |
2063013 | 5512 0 0 | 20212 796 1088 | opt8 | gcc -march=native -mtune=native -O -fwrapv -fPIC -fPIE -gdwarf-4 -Wall | 20250311 | 20250307 |
2065971 | 5271 0 0 | 20893 804 1088 | opt8_lowsize | gcc -march=native -mtune=native -O2 -fwrapv -fPIC -fPIE -gdwarf-4 -Wall | 20250311 | 20250307 |
2074041 | 5385 0 0 | 20052 796 1088 | opt8_lowsize | gcc -march=native -mtune=native -O -fwrapv -fPIC -fPIE -gdwarf-4 -Wall | 20250311 | 20250307 |
2079022 | 4875 0 0 | 18280 780 1056 | opt8_lowsize | gcc -march=native -mtune=native -Os -fwrapv -fPIC -fPIE -gdwarf-4 -Wall | 20250311 | 20250307 |
Compiler output
ascon.S: ascon.S:1:10: fatal error: 'xtensa/coreasm.h' file not found
ascon.S: #include <xtensa/coreasm.h>
ascon.S: ^~~~~~~~~~~~~~~~~~
ascon.S: 1 error generated.
Number of similar (implementation,compiler) pairs: 5, namely:
Implementation | Compiler |
T:asm_esp32 | clang -march=native -O2 -fwrapv -Qunused-arguments -fPIC -fPIE -gdwarf-4 -Wall (Ubuntu_Clang_14.0.0) |
T:asm_esp32 | clang -march=native -O3 -fwrapv -Qunused-arguments -fPIC -fPIE -gdwarf-4 -Wall (Ubuntu_Clang_14.0.0) |
T:asm_esp32 | clang -march=native -O -fwrapv -Qunused-arguments -fPIC -fPIE -gdwarf-4 -Wall (Ubuntu_Clang_14.0.0) |
T:asm_esp32 | clang -march=native -Os -fwrapv -Qunused-arguments -fPIC -fPIE -gdwarf-4 -Wall (Ubuntu_Clang_14.0.0) |
T:asm_esp32 | clang -mcpu=native -O3 -fwrapv -Qunused-arguments -fPIC -fPIE -gdwarf-4 -Wall (Ubuntu_Clang_14.0.0) |
Compiler output
ascon.S: ascon.S:1:10: fatal error: xtensa/coreasm.h: No such file or directory
ascon.S: 1 | #include <xtensa/coreasm.h>
ascon.S: | ^~~~~~~~~~~~~~~~~~
ascon.S: compilation terminated.
Number of similar (implementation,compiler) pairs: 4, namely:
Implementation | Compiler |
T:asm_esp32 | gcc -march=native -mtune=native -O2 -fwrapv -fPIC -fPIE -gdwarf-4 -Wall (11.4.0) |
T:asm_esp32 | gcc -march=native -mtune=native -O3 -fwrapv -fPIC -fPIE -gdwarf-4 -Wall (11.4.0) |
T:asm_esp32 | gcc -march=native -mtune=native -O -fwrapv -fPIC -fPIE -gdwarf-4 -Wall (11.4.0) |
T:asm_esp32 | gcc -march=native -mtune=native -Os -fwrapv -fPIC -fPIE -gdwarf-4 -Wall (11.4.0) |
Compiler output
permutations.S: permutations.S:29:10: fatal error: 'avr/io.h' file not found
permutations.S: #include "avr/io.h"
permutations.S: ^~~~~~~~~~
permutations.S: 1 error generated.
Number of similar (implementation,compiler) pairs: 10, namely:
Implementation | Compiler |
avr | clang -march=native -O2 -fwrapv -Qunused-arguments -fPIC -fPIE -gdwarf-4 -Wall (Ubuntu_Clang_14.0.0) |
avr | clang -march=native -O3 -fwrapv -Qunused-arguments -fPIC -fPIE -gdwarf-4 -Wall (Ubuntu_Clang_14.0.0) |
avr | clang -march=native -O -fwrapv -Qunused-arguments -fPIC -fPIE -gdwarf-4 -Wall (Ubuntu_Clang_14.0.0) |
avr | clang -march=native -Os -fwrapv -Qunused-arguments -fPIC -fPIE -gdwarf-4 -Wall (Ubuntu_Clang_14.0.0) |
avr | clang -mcpu=native -O3 -fwrapv -Qunused-arguments -fPIC -fPIE -gdwarf-4 -Wall (Ubuntu_Clang_14.0.0) |
avr_lowsize | clang -march=native -O2 -fwrapv -Qunused-arguments -fPIC -fPIE -gdwarf-4 -Wall (Ubuntu_Clang_14.0.0) |
avr_lowsize | clang -march=native -O3 -fwrapv -Qunused-arguments -fPIC -fPIE -gdwarf-4 -Wall (Ubuntu_Clang_14.0.0) |
avr_lowsize | clang -march=native -O -fwrapv -Qunused-arguments -fPIC -fPIE -gdwarf-4 -Wall (Ubuntu_Clang_14.0.0) |
avr_lowsize | clang -march=native -Os -fwrapv -Qunused-arguments -fPIC -fPIE -gdwarf-4 -Wall (Ubuntu_Clang_14.0.0) |
avr_lowsize | clang -mcpu=native -O3 -fwrapv -Qunused-arguments -fPIC -fPIE -gdwarf-4 -Wall (Ubuntu_Clang_14.0.0) |
Compiler output
aead.c: In file included from round.h:8,
aead.c: from permutations.h:11,
aead.c: from aead.c:5:
aead.c: word.h:61:11: warning: 'crypto_int64_bitmod_01' is static but used in inline function 'NOTZERO' which is not static
aead.c: 61 | return (crypto_int64_bitmod_01(((int)(result & 0xff) - 1),8)) - 1;
aead.c: | ^~~~~~~~~~~~~~~~~~~~~~
permutations.S: permutations.S:29:10: fatal error: avr/io.h: No such file or directory
permutations.S: 29 | #include "avr/io.h"
permutations.S: | ^~~~~~~~~~
permutations.S: compilation terminated.
Number of similar (implementation,compiler) pairs: 4, namely:
Implementation | Compiler |
avr | gcc -march=native -mtune=native -O2 -fwrapv -fPIC -fPIE -gdwarf-4 -Wall (11.4.0) |
avr | gcc -march=native -mtune=native -O3 -fwrapv -fPIC -fPIE -gdwarf-4 -Wall (11.4.0) |
avr | gcc -march=native -mtune=native -O -fwrapv -fPIC -fPIE -gdwarf-4 -Wall (11.4.0) |
avr | gcc -march=native -mtune=native -Os -fwrapv -fPIC -fPIE -gdwarf-4 -Wall (11.4.0) |
Compiler output
aead.c: In file included from round.h:8,
aead.c: from permutations.h:11,
aead.c: from aead.c:5:
aead.c: word.h:61:11: warning: 'crypto_int64_bitmod_01' is static but used in inline function 'NOTZERO' which is not static
aead.c: 61 | return (crypto_int64_bitmod_01(((int)(result & 0xff) - 1),8)) - 1;
aead.c: | ^~~~~~~~~~~~~~~~~~~~~~
update.c: In file included from round.h:8,
update.c: from permutations.h:11,
update.c: from update.c:3:
update.c: word.h:61:11: warning: 'crypto_int64_bitmod_01' is static but used in inline function 'NOTZERO' which is not static
update.c: 61 | return (crypto_int64_bitmod_01(((int)(result & 0xff) - 1),8)) - 1;
update.c: | ^~~~~~~~~~~~~~~~~~~~~~
permutations.S: permutations.S:29:10: fatal error: avr/io.h: No such file or directory
permutations.S: 29 | #include "avr/io.h"
permutations.S: | ^~~~~~~~~~
permutations.S: compilation terminated.
Number of similar (implementation,compiler) pairs: 4, namely:
Implementation | Compiler |
avr_lowsize | gcc -march=native -mtune=native -O2 -fwrapv -fPIC -fPIE -gdwarf-4 -Wall (11.4.0) |
avr_lowsize | gcc -march=native -mtune=native -O3 -fwrapv -fPIC -fPIE -gdwarf-4 -Wall (11.4.0) |
avr_lowsize | gcc -march=native -mtune=native -O -fwrapv -fPIC -fPIE -gdwarf-4 -Wall (11.4.0) |
avr_lowsize | gcc -march=native -mtune=native -Os -fwrapv -fPIC -fPIE -gdwarf-4 -Wall (11.4.0) |
Compiler output
aead.c: In file included from round.h:8,
aead.c: from permutations.h:11,
aead.c: from aead.c:4:
aead.c: word.h:55:11: warning: 'crypto_int64_bitmod_01' is static but used in inline function 'NOTZERO' which is not static
aead.c: 55 | return (crypto_int64_bitmod_01(((int)(result & 0xff) - 1),8)) - 1;
aead.c: | ^~~~~~~~~~~~~~~~~~~~~~
permutations.c: In file included from round.h:8,
permutations.c: from permutations.h:11,
permutations.c: from permutations.c:1:
permutations.c: word.h:55:11: warning: 'crypto_int64_bitmod_01' is static but used in inline function 'NOTZERO' which is not static
permutations.c: 55 | return (crypto_int64_bitmod_01(((int)(result & 0xff) - 1),8)) - 1;
permutations.c: | ^~~~~~~~~~~~~~~~~~~~~~
Number of similar (implementation,compiler) pairs: 12, namely:
Implementation | Compiler |
bi32 | gcc -march=native -mtune=native -O2 -fwrapv -fPIC -fPIE -gdwarf-4 -Wall (11.4.0) |
bi32 | gcc -march=native -mtune=native -O3 -fwrapv -fPIC -fPIE -gdwarf-4 -Wall (11.4.0) |
bi32 | gcc -march=native -mtune=native -O -fwrapv -fPIC -fPIE -gdwarf-4 -Wall (11.4.0) |
bi32 | gcc -march=native -mtune=native -Os -fwrapv -fPIC -fPIE -gdwarf-4 -Wall (11.4.0) |
bi32_lowreg | gcc -march=native -mtune=native -O2 -fwrapv -fPIC -fPIE -gdwarf-4 -Wall (11.4.0) |
bi32_lowreg | gcc -march=native -mtune=native -O3 -fwrapv -fPIC -fPIE -gdwarf-4 -Wall (11.4.0) |
bi32_lowreg | gcc -march=native -mtune=native -O -fwrapv -fPIC -fPIE -gdwarf-4 -Wall (11.4.0) |
bi32_lowreg | gcc -march=native -mtune=native -Os -fwrapv -fPIC -fPIE -gdwarf-4 -Wall (11.4.0) |
bi8 | gcc -march=native -mtune=native -O2 -fwrapv -fPIC -fPIE -gdwarf-4 -Wall (11.4.0) |
bi8 | gcc -march=native -mtune=native -O3 -fwrapv -fPIC -fPIE -gdwarf-4 -Wall (11.4.0) |
bi8 | gcc -march=native -mtune=native -O -fwrapv -fPIC -fPIE -gdwarf-4 -Wall (11.4.0) |
bi8 | gcc -march=native -mtune=native -Os -fwrapv -fPIC -fPIE -gdwarf-4 -Wall (11.4.0) |
Compiler output
update.c: update.c:21:13: warning: unused variable 'rate' [-Wunused-variable]
update.c: const int rate = ASCON_AEAD_RATE;
update.c: ^
update.c: 1 warning generated.
Number of similar (implementation,compiler) pairs: 15, namely:
Implementation | Compiler |
bi32_lowsize | clang -march=native -O2 -fwrapv -Qunused-arguments -fPIC -fPIE -gdwarf-4 -Wall (Ubuntu_Clang_14.0.0) |
bi32_lowsize | clang -march=native -O3 -fwrapv -Qunused-arguments -fPIC -fPIE -gdwarf-4 -Wall (Ubuntu_Clang_14.0.0) |
bi32_lowsize | clang -march=native -O -fwrapv -Qunused-arguments -fPIC -fPIE -gdwarf-4 -Wall (Ubuntu_Clang_14.0.0) |
bi32_lowsize | clang -march=native -Os -fwrapv -Qunused-arguments -fPIC -fPIE -gdwarf-4 -Wall (Ubuntu_Clang_14.0.0) |
bi32_lowsize | clang -mcpu=native -O3 -fwrapv -Qunused-arguments -fPIC -fPIE -gdwarf-4 -Wall (Ubuntu_Clang_14.0.0) |
opt32_lowsize | clang -march=native -O2 -fwrapv -Qunused-arguments -fPIC -fPIE -gdwarf-4 -Wall (Ubuntu_Clang_14.0.0) |
opt32_lowsize | clang -march=native -O3 -fwrapv -Qunused-arguments -fPIC -fPIE -gdwarf-4 -Wall (Ubuntu_Clang_14.0.0) |
opt32_lowsize | clang -march=native -O -fwrapv -Qunused-arguments -fPIC -fPIE -gdwarf-4 -Wall (Ubuntu_Clang_14.0.0) |
opt32_lowsize | clang -march=native -Os -fwrapv -Qunused-arguments -fPIC -fPIE -gdwarf-4 -Wall (Ubuntu_Clang_14.0.0) |
opt32_lowsize | clang -mcpu=native -O3 -fwrapv -Qunused-arguments -fPIC -fPIE -gdwarf-4 -Wall (Ubuntu_Clang_14.0.0) |
opt64_lowsize | clang -march=native -O2 -fwrapv -Qunused-arguments -fPIC -fPIE -gdwarf-4 -Wall (Ubuntu_Clang_14.0.0) |
opt64_lowsize | clang -march=native -O3 -fwrapv -Qunused-arguments -fPIC -fPIE -gdwarf-4 -Wall (Ubuntu_Clang_14.0.0) |
opt64_lowsize | clang -march=native -O -fwrapv -Qunused-arguments -fPIC -fPIE -gdwarf-4 -Wall (Ubuntu_Clang_14.0.0) |
opt64_lowsize | clang -march=native -Os -fwrapv -Qunused-arguments -fPIC -fPIE -gdwarf-4 -Wall (Ubuntu_Clang_14.0.0) |
opt64_lowsize | clang -mcpu=native -O3 -fwrapv -Qunused-arguments -fPIC -fPIE -gdwarf-4 -Wall (Ubuntu_Clang_14.0.0) |
Compiler output
aead.c: In file included from round.h:8,
aead.c: from permutations.h:11,
aead.c: from aead.c:3:
aead.c: word.h:55:11: warning: 'crypto_int64_bitmod_01' is static but used in inline function 'NOTZERO' which is not static
aead.c: 55 | return (crypto_int64_bitmod_01(((int)(result & 0xff) - 1),8)) - 1;
aead.c: | ^~~~~~~~~~~~~~~~~~~~~~
crypto_aead.c: In file included from round.h:8,
crypto_aead.c: from permutations.h:11,
crypto_aead.c: from crypto_aead.c:8:
crypto_aead.c: word.h:55:11: warning: 'crypto_int64_bitmod_01' is static but used in inline function 'NOTZERO' which is not static
crypto_aead.c: 55 | return (crypto_int64_bitmod_01(((int)(result & 0xff) - 1),8)) - 1;
crypto_aead.c: | ^~~~~~~~~~~~~~~~~~~~~~
permutations.c: In file included from round.h:8,
permutations.c: from permutations.h:11,
permutations.c: from permutations.c:1:
permutations.c: word.h:55:11: warning: 'crypto_int64_bitmod_01' is static but used in inline function 'NOTZERO' which is not static
permutations.c: 55 | return (crypto_int64_bitmod_01(((int)(result & 0xff) - 1),8)) - 1;
permutations.c: | ^~~~~~~~~~~~~~~~~~~~~~
update.c: update.c: In function 'ascon_update':
update.c: update.c:21:13: warning: unused variable 'rate' [-Wunused-variable]
update.c: 21 | const int rate = ASCON_AEAD_RATE;
update.c: | ^~~~
update.c: In file included from round.h:8,
update.c: from permutations.h:11,
update.c: from update.c:3:
update.c: update.c: At top level:
update.c: word.h:55:11: warning: 'crypto_int64_bitmod_01' is static but used in inline function 'NOTZERO' which is not static
update.c: 55 | return (crypto_int64_bitmod_01(((int)(result & 0xff) - 1),8)) - 1;
update.c: | ^~~~~~~~~~~~~~~~~~~~~~
Number of similar (implementation,compiler) pairs: 4, namely:
Implementation | Compiler |
bi32_lowsize | gcc -march=native -mtune=native -O2 -fwrapv -fPIC -fPIE -gdwarf-4 -Wall (11.4.0) |
bi32_lowsize | gcc -march=native -mtune=native -O3 -fwrapv -fPIC -fPIE -gdwarf-4 -Wall (11.4.0) |
bi32_lowsize | gcc -march=native -mtune=native -O -fwrapv -fPIC -fPIE -gdwarf-4 -Wall (11.4.0) |
bi32_lowsize | gcc -march=native -mtune=native -Os -fwrapv -fPIC -fPIE -gdwarf-4 -Wall (11.4.0) |
Compiler output
try.c: /usr/bin/ld: /tmp/try-small-b15a4a.o: in function `doit':
try.c: .../supercop-data/hydra5/amd64/try/c/clang_-march=native_-O2_-fwrapv_-Qunused-arguments_-fPIC_-fPIE_-gdwarf-4_-Wall/timingleaks/crypto_aead/ascon80pqv12/esp32/work/./try.c:133: undefined reference to `crypto_aead_ascon80pqv12_esp32_timingleaks_encrypt'
try.c: /usr/bin/ld: .../supercop-data/hydra5/amd64/try/c/clang_-march=native_-O2_-fwrapv_-Qunused-arguments_-fPIC_-fPIE_-gdwarf-4_-Wall/timingleaks/crypto_aead/ascon80pqv12/esp32/work/./try.c:135: undefined reference to `crypto_aead_ascon80pqv12_esp32_timingleaks_decrypt'
try.c: /usr/bin/ld: /tmp/try-small-b15a4a.o: in function `test':
try.c: .../supercop-data/hydra5/amd64/try/c/clang_-march=native_-O2_-fwrapv_-Qunused-arguments_-fPIC_-fPIE_-gdwarf-4_-Wall/timingleaks/crypto_aead/ascon80pqv12/esp32/work/./try.c:159: undefined reference to `crypto_aead_ascon80pqv12_esp32_timingleaks_encrypt'
try.c: /usr/bin/ld: .../supercop-data/hydra5/amd64/try/c/clang_-march=native_-O2_-fwrapv_-Qunused-arguments_-fPIC_-fPIE_-gdwarf-4_-Wall/timingleaks/crypto_aead/ascon80pqv12/esp32/work/./try.c:189: undefined reference to `crypto_aead_ascon80pqv12_esp32_timingleaks_encrypt'
try.c: /usr/bin/ld: .../supercop-data/hydra5/amd64/try/c/clang_-march=native_-O2_-fwrapv_-Qunused-arguments_-fPIC_-fPIE_-gdwarf-4_-Wall/timingleaks/crypto_aead/ascon80pqv12/esp32/work/./try.c:300: undefined reference to `crypto_aead_ascon80pqv12_esp32_timingleaks_decrypt'
try.c: /usr/bin/ld: .../supercop-data/hydra5/amd64/try/c/clang_-march=native_-O2_-fwrapv_-Qunused-arguments_-fPIC_-fPIE_-gdwarf-4_-Wall/timingleaks/crypto_aead/ascon80pqv12/esp32/work/./try.c:331: undefined reference to `crypto_aead_ascon80pqv12_esp32_timingleaks_decrypt'
try.c: /usr/bin/ld: .../supercop-data/hydra5/amd64/try/c/clang_-march=native_-O2_-fwrapv_-Qunused-arguments_-fPIC_-fPIE_-gdwarf-4_-Wall/timingleaks/crypto_aead/ascon80pqv12/esp32/work/./try.c:476: undefined reference to `crypto_aead_ascon80pqv12_esp32_timingleaks_decrypt'
try.c: /usr/bin/ld: .../supercop-data/hydra5/amd64/try/c/clang_-march=native_-O2_-fwrapv_-Qunused-arguments_-fPIC_-fPIE_-gdwarf-4_-Wall/timingleaks/crypto_aead/ascon80pqv12/esp32/work/./try.c:480: undefined reference to `crypto_aead_ascon80pqv12_esp32_timingleaks_decrypt'
try.c: /usr/bin/ld: .../supercop-data/hydra5/amd64/try/c/clang_-march=native_-O2_-fwrapv_-Qunused-arguments_-fPIC_-fPIE_-gdwarf-4_-Wall/timingleaks/crypto_aead/ascon80pqv12/esp32/work/./try.c:484: undefined reference to `crypto_aead_ascon80pqv12_esp32_timingleaks_decrypt'
try.c: clang: error: linker command failed with exit code 1 (use -v to see invocation)
Number of similar (implementation,compiler) pairs: 1, namely:
Implementation | Compiler |
T:esp32 | clang -march=native -O2 -fwrapv -Qunused-arguments -fPIC -fPIE -gdwarf-4 -Wall (Ubuntu_Clang_14.0.0) |
Compiler output
try.c: /usr/bin/ld: /tmp/try-small-159adf.o: in function `doit':
try.c: .../supercop-data/hydra5/amd64/try/c/clang_-march=native_-O3_-fwrapv_-Qunused-arguments_-fPIC_-fPIE_-gdwarf-4_-Wall/timingleaks/crypto_aead/ascon80pqv12/esp32/work/./try.c:133: undefined reference to `crypto_aead_ascon80pqv12_esp32_timingleaks_encrypt'
try.c: /usr/bin/ld: .../supercop-data/hydra5/amd64/try/c/clang_-march=native_-O3_-fwrapv_-Qunused-arguments_-fPIC_-fPIE_-gdwarf-4_-Wall/timingleaks/crypto_aead/ascon80pqv12/esp32/work/./try.c:135: undefined reference to `crypto_aead_ascon80pqv12_esp32_timingleaks_decrypt'
try.c: /usr/bin/ld: /tmp/try-small-159adf.o: in function `test':
try.c: .../supercop-data/hydra5/amd64/try/c/clang_-march=native_-O3_-fwrapv_-Qunused-arguments_-fPIC_-fPIE_-gdwarf-4_-Wall/timingleaks/crypto_aead/ascon80pqv12/esp32/work/./try.c:159: undefined reference to `crypto_aead_ascon80pqv12_esp32_timingleaks_encrypt'
try.c: /usr/bin/ld: .../supercop-data/hydra5/amd64/try/c/clang_-march=native_-O3_-fwrapv_-Qunused-arguments_-fPIC_-fPIE_-gdwarf-4_-Wall/timingleaks/crypto_aead/ascon80pqv12/esp32/work/./try.c:189: undefined reference to `crypto_aead_ascon80pqv12_esp32_timingleaks_encrypt'
try.c: /usr/bin/ld: .../supercop-data/hydra5/amd64/try/c/clang_-march=native_-O3_-fwrapv_-Qunused-arguments_-fPIC_-fPIE_-gdwarf-4_-Wall/timingleaks/crypto_aead/ascon80pqv12/esp32/work/./try.c:300: undefined reference to `crypto_aead_ascon80pqv12_esp32_timingleaks_decrypt'
try.c: /usr/bin/ld: .../supercop-data/hydra5/amd64/try/c/clang_-march=native_-O3_-fwrapv_-Qunused-arguments_-fPIC_-fPIE_-gdwarf-4_-Wall/timingleaks/crypto_aead/ascon80pqv12/esp32/work/./try.c:331: undefined reference to `crypto_aead_ascon80pqv12_esp32_timingleaks_decrypt'
try.c: /usr/bin/ld: .../supercop-data/hydra5/amd64/try/c/clang_-march=native_-O3_-fwrapv_-Qunused-arguments_-fPIC_-fPIE_-gdwarf-4_-Wall/timingleaks/crypto_aead/ascon80pqv12/esp32/work/./try.c:476: undefined reference to `crypto_aead_ascon80pqv12_esp32_timingleaks_decrypt'
try.c: /usr/bin/ld: .../supercop-data/hydra5/amd64/try/c/clang_-march=native_-O3_-fwrapv_-Qunused-arguments_-fPIC_-fPIE_-gdwarf-4_-Wall/timingleaks/crypto_aead/ascon80pqv12/esp32/work/./try.c:480: undefined reference to `crypto_aead_ascon80pqv12_esp32_timingleaks_decrypt'
try.c: /usr/bin/ld: .../supercop-data/hydra5/amd64/try/c/clang_-march=native_-O3_-fwrapv_-Qunused-arguments_-fPIC_-fPIE_-gdwarf-4_-Wall/timingleaks/crypto_aead/ascon80pqv12/esp32/work/./try.c:484: undefined reference to `crypto_aead_ascon80pqv12_esp32_timingleaks_decrypt'
try.c: clang: error: linker command failed with exit code 1 (use -v to see invocation)
Number of similar (implementation,compiler) pairs: 1, namely:
Implementation | Compiler |
T:esp32 | clang -march=native -O3 -fwrapv -Qunused-arguments -fPIC -fPIE -gdwarf-4 -Wall (Ubuntu_Clang_14.0.0) |
Compiler output
try.c: /usr/bin/ld: /tmp/try-small-e38c8a.o: in function `doit':
try.c: .../supercop-data/hydra5/amd64/try/c/clang_-march=native_-O_-fwrapv_-Qunused-arguments_-fPIC_-fPIE_-gdwarf-4_-Wall/timingleaks/crypto_aead/ascon80pqv12/esp32/work/./try.c:133: undefined reference to `crypto_aead_ascon80pqv12_esp32_timingleaks_encrypt'
try.c: /usr/bin/ld: .../supercop-data/hydra5/amd64/try/c/clang_-march=native_-O_-fwrapv_-Qunused-arguments_-fPIC_-fPIE_-gdwarf-4_-Wall/timingleaks/crypto_aead/ascon80pqv12/esp32/work/./try.c:135: undefined reference to `crypto_aead_ascon80pqv12_esp32_timingleaks_decrypt'
try.c: /usr/bin/ld: /tmp/try-small-e38c8a.o: in function `test':
try.c: .../supercop-data/hydra5/amd64/try/c/clang_-march=native_-O_-fwrapv_-Qunused-arguments_-fPIC_-fPIE_-gdwarf-4_-Wall/timingleaks/crypto_aead/ascon80pqv12/esp32/work/./try.c:159: undefined reference to `crypto_aead_ascon80pqv12_esp32_timingleaks_encrypt'
try.c: /usr/bin/ld: .../supercop-data/hydra5/amd64/try/c/clang_-march=native_-O_-fwrapv_-Qunused-arguments_-fPIC_-fPIE_-gdwarf-4_-Wall/timingleaks/crypto_aead/ascon80pqv12/esp32/work/./try.c:189: undefined reference to `crypto_aead_ascon80pqv12_esp32_timingleaks_encrypt'
try.c: /usr/bin/ld: .../supercop-data/hydra5/amd64/try/c/clang_-march=native_-O_-fwrapv_-Qunused-arguments_-fPIC_-fPIE_-gdwarf-4_-Wall/timingleaks/crypto_aead/ascon80pqv12/esp32/work/./try.c:300: undefined reference to `crypto_aead_ascon80pqv12_esp32_timingleaks_decrypt'
try.c: /usr/bin/ld: .../supercop-data/hydra5/amd64/try/c/clang_-march=native_-O_-fwrapv_-Qunused-arguments_-fPIC_-fPIE_-gdwarf-4_-Wall/timingleaks/crypto_aead/ascon80pqv12/esp32/work/./try.c:331: undefined reference to `crypto_aead_ascon80pqv12_esp32_timingleaks_decrypt'
try.c: /usr/bin/ld: .../supercop-data/hydra5/amd64/try/c/clang_-march=native_-O_-fwrapv_-Qunused-arguments_-fPIC_-fPIE_-gdwarf-4_-Wall/timingleaks/crypto_aead/ascon80pqv12/esp32/work/./try.c:476: undefined reference to `crypto_aead_ascon80pqv12_esp32_timingleaks_decrypt'
try.c: /usr/bin/ld: .../supercop-data/hydra5/amd64/try/c/clang_-march=native_-O_-fwrapv_-Qunused-arguments_-fPIC_-fPIE_-gdwarf-4_-Wall/timingleaks/crypto_aead/ascon80pqv12/esp32/work/./try.c:480: undefined reference to `crypto_aead_ascon80pqv12_esp32_timingleaks_decrypt'
try.c: /usr/bin/ld: .../supercop-data/hydra5/amd64/try/c/clang_-march=native_-O_-fwrapv_-Qunused-arguments_-fPIC_-fPIE_-gdwarf-4_-Wall/timingleaks/crypto_aead/ascon80pqv12/esp32/work/./try.c:484: undefined reference to `crypto_aead_ascon80pqv12_esp32_timingleaks_decrypt'
try.c: clang: error: linker command failed with exit code 1 (use -v to see invocation)
Number of similar (implementation,compiler) pairs: 1, namely:
Implementation | Compiler |
T:esp32 | clang -march=native -O -fwrapv -Qunused-arguments -fPIC -fPIE -gdwarf-4 -Wall (Ubuntu_Clang_14.0.0) |
Compiler output
try.c: /usr/bin/ld: /tmp/try-small-45a969.o: in function `doit':
try.c: .../supercop-data/hydra5/amd64/try/c/clang_-march=native_-Os_-fwrapv_-Qunused-arguments_-fPIC_-fPIE_-gdwarf-4_-Wall/timingleaks/crypto_aead/ascon80pqv12/esp32/work/./try.c:133: undefined reference to `crypto_aead_ascon80pqv12_esp32_timingleaks_encrypt'
try.c: /usr/bin/ld: .../supercop-data/hydra5/amd64/try/c/clang_-march=native_-Os_-fwrapv_-Qunused-arguments_-fPIC_-fPIE_-gdwarf-4_-Wall/timingleaks/crypto_aead/ascon80pqv12/esp32/work/./try.c:135: undefined reference to `crypto_aead_ascon80pqv12_esp32_timingleaks_decrypt'
try.c: /usr/bin/ld: /tmp/try-small-45a969.o: in function `test':
try.c: .../supercop-data/hydra5/amd64/try/c/clang_-march=native_-Os_-fwrapv_-Qunused-arguments_-fPIC_-fPIE_-gdwarf-4_-Wall/timingleaks/crypto_aead/ascon80pqv12/esp32/work/./try.c:159: undefined reference to `crypto_aead_ascon80pqv12_esp32_timingleaks_encrypt'
try.c: /usr/bin/ld: .../supercop-data/hydra5/amd64/try/c/clang_-march=native_-Os_-fwrapv_-Qunused-arguments_-fPIC_-fPIE_-gdwarf-4_-Wall/timingleaks/crypto_aead/ascon80pqv12/esp32/work/./try.c:189: undefined reference to `crypto_aead_ascon80pqv12_esp32_timingleaks_encrypt'
try.c: /usr/bin/ld: .../supercop-data/hydra5/amd64/try/c/clang_-march=native_-Os_-fwrapv_-Qunused-arguments_-fPIC_-fPIE_-gdwarf-4_-Wall/timingleaks/crypto_aead/ascon80pqv12/esp32/work/./try.c:300: undefined reference to `crypto_aead_ascon80pqv12_esp32_timingleaks_decrypt'
try.c: /usr/bin/ld: .../supercop-data/hydra5/amd64/try/c/clang_-march=native_-Os_-fwrapv_-Qunused-arguments_-fPIC_-fPIE_-gdwarf-4_-Wall/timingleaks/crypto_aead/ascon80pqv12/esp32/work/./try.c:331: undefined reference to `crypto_aead_ascon80pqv12_esp32_timingleaks_decrypt'
try.c: /usr/bin/ld: .../supercop-data/hydra5/amd64/try/c/clang_-march=native_-Os_-fwrapv_-Qunused-arguments_-fPIC_-fPIE_-gdwarf-4_-Wall/timingleaks/crypto_aead/ascon80pqv12/esp32/work/./try.c:476: undefined reference to `crypto_aead_ascon80pqv12_esp32_timingleaks_decrypt'
try.c: /usr/bin/ld: .../supercop-data/hydra5/amd64/try/c/clang_-march=native_-Os_-fwrapv_-Qunused-arguments_-fPIC_-fPIE_-gdwarf-4_-Wall/timingleaks/crypto_aead/ascon80pqv12/esp32/work/./try.c:480: undefined reference to `crypto_aead_ascon80pqv12_esp32_timingleaks_decrypt'
try.c: /usr/bin/ld: .../supercop-data/hydra5/amd64/try/c/clang_-march=native_-Os_-fwrapv_-Qunused-arguments_-fPIC_-fPIE_-gdwarf-4_-Wall/timingleaks/crypto_aead/ascon80pqv12/esp32/work/./try.c:484: undefined reference to `crypto_aead_ascon80pqv12_esp32_timingleaks_decrypt'
try.c: clang: error: linker command failed with exit code 1 (use -v to see invocation)
Number of similar (implementation,compiler) pairs: 1, namely:
Implementation | Compiler |
T:esp32 | clang -march=native -Os -fwrapv -Qunused-arguments -fPIC -fPIE -gdwarf-4 -Wall (Ubuntu_Clang_14.0.0) |
Compiler output
try.c: /usr/bin/ld: /tmp/try-small-a17b2a.o: in function `doit':
try.c: .../supercop-data/hydra5/amd64/try/c/clang_-mcpu=native_-O3_-fwrapv_-Qunused-arguments_-fPIC_-fPIE_-gdwarf-4_-Wall/timingleaks/crypto_aead/ascon80pqv12/esp32/work/./try.c:133: undefined reference to `crypto_aead_ascon80pqv12_esp32_timingleaks_encrypt'
try.c: /usr/bin/ld: .../supercop-data/hydra5/amd64/try/c/clang_-mcpu=native_-O3_-fwrapv_-Qunused-arguments_-fPIC_-fPIE_-gdwarf-4_-Wall/timingleaks/crypto_aead/ascon80pqv12/esp32/work/./try.c:135: undefined reference to `crypto_aead_ascon80pqv12_esp32_timingleaks_decrypt'
try.c: /usr/bin/ld: /tmp/try-small-a17b2a.o: in function `test':
try.c: .../supercop-data/hydra5/amd64/try/c/clang_-mcpu=native_-O3_-fwrapv_-Qunused-arguments_-fPIC_-fPIE_-gdwarf-4_-Wall/timingleaks/crypto_aead/ascon80pqv12/esp32/work/./try.c:159: undefined reference to `crypto_aead_ascon80pqv12_esp32_timingleaks_encrypt'
try.c: /usr/bin/ld: .../supercop-data/hydra5/amd64/try/c/clang_-mcpu=native_-O3_-fwrapv_-Qunused-arguments_-fPIC_-fPIE_-gdwarf-4_-Wall/timingleaks/crypto_aead/ascon80pqv12/esp32/work/./try.c:189: undefined reference to `crypto_aead_ascon80pqv12_esp32_timingleaks_encrypt'
try.c: /usr/bin/ld: .../supercop-data/hydra5/amd64/try/c/clang_-mcpu=native_-O3_-fwrapv_-Qunused-arguments_-fPIC_-fPIE_-gdwarf-4_-Wall/timingleaks/crypto_aead/ascon80pqv12/esp32/work/./try.c:300: undefined reference to `crypto_aead_ascon80pqv12_esp32_timingleaks_decrypt'
try.c: /usr/bin/ld: .../supercop-data/hydra5/amd64/try/c/clang_-mcpu=native_-O3_-fwrapv_-Qunused-arguments_-fPIC_-fPIE_-gdwarf-4_-Wall/timingleaks/crypto_aead/ascon80pqv12/esp32/work/./try.c:331: undefined reference to `crypto_aead_ascon80pqv12_esp32_timingleaks_decrypt'
try.c: /usr/bin/ld: .../supercop-data/hydra5/amd64/try/c/clang_-mcpu=native_-O3_-fwrapv_-Qunused-arguments_-fPIC_-fPIE_-gdwarf-4_-Wall/timingleaks/crypto_aead/ascon80pqv12/esp32/work/./try.c:476: undefined reference to `crypto_aead_ascon80pqv12_esp32_timingleaks_decrypt'
try.c: /usr/bin/ld: .../supercop-data/hydra5/amd64/try/c/clang_-mcpu=native_-O3_-fwrapv_-Qunused-arguments_-fPIC_-fPIE_-gdwarf-4_-Wall/timingleaks/crypto_aead/ascon80pqv12/esp32/work/./try.c:480: undefined reference to `crypto_aead_ascon80pqv12_esp32_timingleaks_decrypt'
try.c: /usr/bin/ld: .../supercop-data/hydra5/amd64/try/c/clang_-mcpu=native_-O3_-fwrapv_-Qunused-arguments_-fPIC_-fPIE_-gdwarf-4_-Wall/timingleaks/crypto_aead/ascon80pqv12/esp32/work/./try.c:484: undefined reference to `crypto_aead_ascon80pqv12_esp32_timingleaks_decrypt'
try.c: clang: error: linker command failed with exit code 1 (use -v to see invocation)
Number of similar (implementation,compiler) pairs: 1, namely:
Implementation | Compiler |
T:esp32 | clang -mcpu=native -O3 -fwrapv -Qunused-arguments -fPIC -fPIE -gdwarf-4 -Wall (Ubuntu_Clang_14.0.0) |
Compiler output
try.c: /usr/bin/ld: /tmp/ccSiLNUq.o: in function `doit':
try.c: .../supercop-data/hydra5/amd64/try/c/gcc_-march=native_-mtune=native_-O2_-fwrapv_-fPIC_-fPIE_-gdwarf-4_-Wall/timingleaks/crypto_aead/ascon80pqv12/esp32/work/try.c:133: undefined reference to `crypto_aead_ascon80pqv12_esp32_timingleaks_encrypt'
try.c: /usr/bin/ld: .../supercop-data/hydra5/amd64/try/c/gcc_-march=native_-mtune=native_-O2_-fwrapv_-fPIC_-fPIE_-gdwarf-4_-Wall/timingleaks/crypto_aead/ascon80pqv12/esp32/work/try.c:135: undefined reference to `crypto_aead_ascon80pqv12_esp32_timingleaks_decrypt'
try.c: /usr/bin/ld: /tmp/ccSiLNUq.o: in function `test':
try.c: .../supercop-data/hydra5/amd64/try/c/gcc_-march=native_-mtune=native_-O2_-fwrapv_-fPIC_-fPIE_-gdwarf-4_-Wall/timingleaks/crypto_aead/ascon80pqv12/esp32/work/try.c:189: undefined reference to `crypto_aead_ascon80pqv12_esp32_timingleaks_encrypt'
try.c: /usr/bin/ld: .../supercop-data/hydra5/amd64/try/c/gcc_-march=native_-mtune=native_-O2_-fwrapv_-fPIC_-fPIE_-gdwarf-4_-Wall/timingleaks/crypto_aead/ascon80pqv12/esp32/work/try.c:300: undefined reference to `crypto_aead_ascon80pqv12_esp32_timingleaks_decrypt'
try.c: /usr/bin/ld: .../supercop-data/hydra5/amd64/try/c/gcc_-march=native_-mtune=native_-O2_-fwrapv_-fPIC_-fPIE_-gdwarf-4_-Wall/timingleaks/crypto_aead/ascon80pqv12/esp32/work/try.c:331: undefined reference to `crypto_aead_ascon80pqv12_esp32_timingleaks_decrypt'
try.c: /usr/bin/ld: .../supercop-data/hydra5/amd64/try/c/gcc_-march=native_-mtune=native_-O2_-fwrapv_-fPIC_-fPIE_-gdwarf-4_-Wall/timingleaks/crypto_aead/ascon80pqv12/esp32/work/try.c:476: undefined reference to `crypto_aead_ascon80pqv12_esp32_timingleaks_decrypt'
try.c: /usr/bin/ld: .../supercop-data/hydra5/amd64/try/c/gcc_-march=native_-mtune=native_-O2_-fwrapv_-fPIC_-fPIE_-gdwarf-4_-Wall/timingleaks/crypto_aead/ascon80pqv12/esp32/work/try.c:480: undefined reference to `crypto_aead_ascon80pqv12_esp32_timingleaks_decrypt'
try.c: /usr/bin/ld: .../supercop-data/hydra5/amd64/try/c/gcc_-march=native_-mtune=native_-O2_-fwrapv_-fPIC_-fPIE_-gdwarf-4_-Wall/timingleaks/crypto_aead/ascon80pqv12/esp32/work/try.c:484: undefined reference to `crypto_aead_ascon80pqv12_esp32_timingleaks_decrypt'
try.c: /usr/bin/ld: .../supercop-data/hydra5/amd64/try/c/gcc_-march=native_-mtune=native_-O2_-fwrapv_-fPIC_-fPIE_-gdwarf-4_-Wall/timingleaks/crypto_aead/ascon80pqv12/esp32/work/try.c:159: undefined reference to `crypto_aead_ascon80pqv12_esp32_timingleaks_encrypt'
try.c: collect2: error: ld returned 1 exit status
Number of similar (implementation,compiler) pairs: 1, namely:
Implementation | Compiler |
T:esp32 | gcc -march=native -mtune=native -O2 -fwrapv -fPIC -fPIE -gdwarf-4 -Wall (11.4.0) |
Compiler output
try.c: /usr/bin/ld: /tmp/cc5IvpbH.o: in function `doit':
try.c: .../supercop-data/hydra5/amd64/try/c/gcc_-march=native_-mtune=native_-O3_-fwrapv_-fPIC_-fPIE_-gdwarf-4_-Wall/timingleaks/crypto_aead/ascon80pqv12/esp32/work/try.c:133: undefined reference to `crypto_aead_ascon80pqv12_esp32_timingleaks_encrypt'
try.c: /usr/bin/ld: .../supercop-data/hydra5/amd64/try/c/gcc_-march=native_-mtune=native_-O3_-fwrapv_-fPIC_-fPIE_-gdwarf-4_-Wall/timingleaks/crypto_aead/ascon80pqv12/esp32/work/try.c:135: undefined reference to `crypto_aead_ascon80pqv12_esp32_timingleaks_decrypt'
try.c: /usr/bin/ld: /tmp/cc5IvpbH.o: in function `test':
try.c: .../supercop-data/hydra5/amd64/try/c/gcc_-march=native_-mtune=native_-O3_-fwrapv_-fPIC_-fPIE_-gdwarf-4_-Wall/timingleaks/crypto_aead/ascon80pqv12/esp32/work/try.c:189: undefined reference to `crypto_aead_ascon80pqv12_esp32_timingleaks_encrypt'
try.c: /usr/bin/ld: .../supercop-data/hydra5/amd64/try/c/gcc_-march=native_-mtune=native_-O3_-fwrapv_-fPIC_-fPIE_-gdwarf-4_-Wall/timingleaks/crypto_aead/ascon80pqv12/esp32/work/try.c:300: undefined reference to `crypto_aead_ascon80pqv12_esp32_timingleaks_decrypt'
try.c: /usr/bin/ld: .../supercop-data/hydra5/amd64/try/c/gcc_-march=native_-mtune=native_-O3_-fwrapv_-fPIC_-fPIE_-gdwarf-4_-Wall/timingleaks/crypto_aead/ascon80pqv12/esp32/work/try.c:331: undefined reference to `crypto_aead_ascon80pqv12_esp32_timingleaks_decrypt'
try.c: /usr/bin/ld: .../supercop-data/hydra5/amd64/try/c/gcc_-march=native_-mtune=native_-O3_-fwrapv_-fPIC_-fPIE_-gdwarf-4_-Wall/timingleaks/crypto_aead/ascon80pqv12/esp32/work/try.c:476: undefined reference to `crypto_aead_ascon80pqv12_esp32_timingleaks_decrypt'
try.c: /usr/bin/ld: .../supercop-data/hydra5/amd64/try/c/gcc_-march=native_-mtune=native_-O3_-fwrapv_-fPIC_-fPIE_-gdwarf-4_-Wall/timingleaks/crypto_aead/ascon80pqv12/esp32/work/try.c:480: undefined reference to `crypto_aead_ascon80pqv12_esp32_timingleaks_decrypt'
try.c: /usr/bin/ld: .../supercop-data/hydra5/amd64/try/c/gcc_-march=native_-mtune=native_-O3_-fwrapv_-fPIC_-fPIE_-gdwarf-4_-Wall/timingleaks/crypto_aead/ascon80pqv12/esp32/work/try.c:484: undefined reference to `crypto_aead_ascon80pqv12_esp32_timingleaks_decrypt'
try.c: /usr/bin/ld: .../supercop-data/hydra5/amd64/try/c/gcc_-march=native_-mtune=native_-O3_-fwrapv_-fPIC_-fPIE_-gdwarf-4_-Wall/timingleaks/crypto_aead/ascon80pqv12/esp32/work/try.c:159: undefined reference to `crypto_aead_ascon80pqv12_esp32_timingleaks_encrypt'
try.c: collect2: error: ld returned 1 exit status
Number of similar (implementation,compiler) pairs: 1, namely:
Implementation | Compiler |
T:esp32 | gcc -march=native -mtune=native -O3 -fwrapv -fPIC -fPIE -gdwarf-4 -Wall (11.4.0) |
Compiler output
try.c: /usr/bin/ld: /tmp/ccL1EwZ8.o: in function `doit':
try.c: .../supercop-data/hydra5/amd64/try/c/gcc_-march=native_-mtune=native_-O_-fwrapv_-fPIC_-fPIE_-gdwarf-4_-Wall/timingleaks/crypto_aead/ascon80pqv12/esp32/work/try.c:133: undefined reference to `crypto_aead_ascon80pqv12_esp32_timingleaks_encrypt'
try.c: /usr/bin/ld: .../supercop-data/hydra5/amd64/try/c/gcc_-march=native_-mtune=native_-O_-fwrapv_-fPIC_-fPIE_-gdwarf-4_-Wall/timingleaks/crypto_aead/ascon80pqv12/esp32/work/try.c:135: undefined reference to `crypto_aead_ascon80pqv12_esp32_timingleaks_decrypt'
try.c: /usr/bin/ld: /tmp/ccL1EwZ8.o: in function `test':
try.c: .../supercop-data/hydra5/amd64/try/c/gcc_-march=native_-mtune=native_-O_-fwrapv_-fPIC_-fPIE_-gdwarf-4_-Wall/timingleaks/crypto_aead/ascon80pqv12/esp32/work/try.c:159: undefined reference to `crypto_aead_ascon80pqv12_esp32_timingleaks_encrypt'
try.c: /usr/bin/ld: .../supercop-data/hydra5/amd64/try/c/gcc_-march=native_-mtune=native_-O_-fwrapv_-fPIC_-fPIE_-gdwarf-4_-Wall/timingleaks/crypto_aead/ascon80pqv12/esp32/work/try.c:189: undefined reference to `crypto_aead_ascon80pqv12_esp32_timingleaks_encrypt'
try.c: /usr/bin/ld: .../supercop-data/hydra5/amd64/try/c/gcc_-march=native_-mtune=native_-O_-fwrapv_-fPIC_-fPIE_-gdwarf-4_-Wall/timingleaks/crypto_aead/ascon80pqv12/esp32/work/try.c:300: undefined reference to `crypto_aead_ascon80pqv12_esp32_timingleaks_decrypt'
try.c: /usr/bin/ld: .../supercop-data/hydra5/amd64/try/c/gcc_-march=native_-mtune=native_-O_-fwrapv_-fPIC_-fPIE_-gdwarf-4_-Wall/timingleaks/crypto_aead/ascon80pqv12/esp32/work/try.c:331: undefined reference to `crypto_aead_ascon80pqv12_esp32_timingleaks_decrypt'
try.c: /usr/bin/ld: .../supercop-data/hydra5/amd64/try/c/gcc_-march=native_-mtune=native_-O_-fwrapv_-fPIC_-fPIE_-gdwarf-4_-Wall/timingleaks/crypto_aead/ascon80pqv12/esp32/work/try.c:476: undefined reference to `crypto_aead_ascon80pqv12_esp32_timingleaks_decrypt'
try.c: /usr/bin/ld: .../supercop-data/hydra5/amd64/try/c/gcc_-march=native_-mtune=native_-O_-fwrapv_-fPIC_-fPIE_-gdwarf-4_-Wall/timingleaks/crypto_aead/ascon80pqv12/esp32/work/try.c:480: undefined reference to `crypto_aead_ascon80pqv12_esp32_timingleaks_decrypt'
try.c: /usr/bin/ld: .../supercop-data/hydra5/amd64/try/c/gcc_-march=native_-mtune=native_-O_-fwrapv_-fPIC_-fPIE_-gdwarf-4_-Wall/timingleaks/crypto_aead/ascon80pqv12/esp32/work/try.c:484: undefined reference to `crypto_aead_ascon80pqv12_esp32_timingleaks_decrypt'
try.c: collect2: error: ld returned 1 exit status
Number of similar (implementation,compiler) pairs: 1, namely:
Implementation | Compiler |
T:esp32 | gcc -march=native -mtune=native -O -fwrapv -fPIC -fPIE -gdwarf-4 -Wall (11.4.0) |
Compiler output
try.c: /usr/bin/ld: /tmp/cco58sHK.o: in function `doit':
try.c: .../supercop-data/hydra5/amd64/try/c/gcc_-march=native_-mtune=native_-Os_-fwrapv_-fPIC_-fPIE_-gdwarf-4_-Wall/timingleaks/crypto_aead/ascon80pqv12/esp32/work/try.c:133: undefined reference to `crypto_aead_ascon80pqv12_esp32_timingleaks_encrypt'
try.c: /usr/bin/ld: .../supercop-data/hydra5/amd64/try/c/gcc_-march=native_-mtune=native_-Os_-fwrapv_-fPIC_-fPIE_-gdwarf-4_-Wall/timingleaks/crypto_aead/ascon80pqv12/esp32/work/try.c:135: undefined reference to `crypto_aead_ascon80pqv12_esp32_timingleaks_decrypt'
try.c: /usr/bin/ld: /tmp/cco58sHK.o: in function `test':
try.c: .../supercop-data/hydra5/amd64/try/c/gcc_-march=native_-mtune=native_-Os_-fwrapv_-fPIC_-fPIE_-gdwarf-4_-Wall/timingleaks/crypto_aead/ascon80pqv12/esp32/work/try.c:159: undefined reference to `crypto_aead_ascon80pqv12_esp32_timingleaks_encrypt'
try.c: /usr/bin/ld: .../supercop-data/hydra5/amd64/try/c/gcc_-march=native_-mtune=native_-Os_-fwrapv_-fPIC_-fPIE_-gdwarf-4_-Wall/timingleaks/crypto_aead/ascon80pqv12/esp32/work/try.c:189: undefined reference to `crypto_aead_ascon80pqv12_esp32_timingleaks_encrypt'
try.c: /usr/bin/ld: .../supercop-data/hydra5/amd64/try/c/gcc_-march=native_-mtune=native_-Os_-fwrapv_-fPIC_-fPIE_-gdwarf-4_-Wall/timingleaks/crypto_aead/ascon80pqv12/esp32/work/try.c:300: undefined reference to `crypto_aead_ascon80pqv12_esp32_timingleaks_decrypt'
try.c: /usr/bin/ld: .../supercop-data/hydra5/amd64/try/c/gcc_-march=native_-mtune=native_-Os_-fwrapv_-fPIC_-fPIE_-gdwarf-4_-Wall/timingleaks/crypto_aead/ascon80pqv12/esp32/work/try.c:331: undefined reference to `crypto_aead_ascon80pqv12_esp32_timingleaks_decrypt'
try.c: /usr/bin/ld: .../supercop-data/hydra5/amd64/try/c/gcc_-march=native_-mtune=native_-Os_-fwrapv_-fPIC_-fPIE_-gdwarf-4_-Wall/timingleaks/crypto_aead/ascon80pqv12/esp32/work/try.c:476: undefined reference to `crypto_aead_ascon80pqv12_esp32_timingleaks_decrypt'
try.c: /usr/bin/ld: .../supercop-data/hydra5/amd64/try/c/gcc_-march=native_-mtune=native_-Os_-fwrapv_-fPIC_-fPIE_-gdwarf-4_-Wall/timingleaks/crypto_aead/ascon80pqv12/esp32/work/try.c:480: undefined reference to `crypto_aead_ascon80pqv12_esp32_timingleaks_decrypt'
try.c: /usr/bin/ld: .../supercop-data/hydra5/amd64/try/c/gcc_-march=native_-mtune=native_-Os_-fwrapv_-fPIC_-fPIE_-gdwarf-4_-Wall/timingleaks/crypto_aead/ascon80pqv12/esp32/work/try.c:484: undefined reference to `crypto_aead_ascon80pqv12_esp32_timingleaks_decrypt'
try.c: collect2: error: ld returned 1 exit status
Number of similar (implementation,compiler) pairs: 1, namely:
Implementation | Compiler |
T:esp32 | gcc -march=native -mtune=native -Os -fwrapv -fPIC -fPIE -gdwarf-4 -Wall (11.4.0) |
Compiler output
aead.c: In file included from round.h:8,
aead.c: from permutations.h:11,
aead.c: from aead.c:4:
aead.c: word.h:32:11: warning: 'crypto_int64_bitmod_01' is static but used in inline function 'NOTZERO' which is not static
aead.c: 32 | return (crypto_int64_bitmod_01(((int)(result & 0xff) - 1),8)) - 1;
aead.c: | ^~~~~~~~~~~~~~~~~~~~~~
permutations.c: In file included from round.h:8,
permutations.c: from permutations.h:11,
permutations.c: from permutations.c:1:
permutations.c: word.h:32:11: warning: 'crypto_int64_bitmod_01' is static but used in inline function 'NOTZERO' which is not static
permutations.c: 32 | return (crypto_int64_bitmod_01(((int)(result & 0xff) - 1),8)) - 1;
permutations.c: | ^~~~~~~~~~~~~~~~~~~~~~
Number of similar (implementation,compiler) pairs: 8, namely:
Implementation | Compiler |
opt32 | gcc -march=native -mtune=native -O2 -fwrapv -fPIC -fPIE -gdwarf-4 -Wall (11.4.0) |
opt32 | gcc -march=native -mtune=native -O3 -fwrapv -fPIC -fPIE -gdwarf-4 -Wall (11.4.0) |
opt32 | gcc -march=native -mtune=native -O -fwrapv -fPIC -fPIE -gdwarf-4 -Wall (11.4.0) |
opt32 | gcc -march=native -mtune=native -Os -fwrapv -fPIC -fPIE -gdwarf-4 -Wall (11.4.0) |
opt64 | gcc -march=native -mtune=native -O2 -fwrapv -fPIC -fPIE -gdwarf-4 -Wall (11.4.0) |
opt64 | gcc -march=native -mtune=native -O3 -fwrapv -fPIC -fPIE -gdwarf-4 -Wall (11.4.0) |
opt64 | gcc -march=native -mtune=native -O -fwrapv -fPIC -fPIE -gdwarf-4 -Wall (11.4.0) |
opt64 | gcc -march=native -mtune=native -Os -fwrapv -fPIC -fPIE -gdwarf-4 -Wall (11.4.0) |
Compiler output
aead.c: In file included from round.h:8,
aead.c: from permutations.h:11,
aead.c: from aead.c:3:
aead.c: word.h:32:11: warning: 'crypto_int64_bitmod_01' is static but used in inline function 'NOTZERO' which is not static
aead.c: 32 | return (crypto_int64_bitmod_01(((int)(result & 0xff) - 1),8)) - 1;
aead.c: | ^~~~~~~~~~~~~~~~~~~~~~
crypto_aead.c: In file included from round.h:8,
crypto_aead.c: from permutations.h:11,
crypto_aead.c: from crypto_aead.c:8:
crypto_aead.c: word.h:32:11: warning: 'crypto_int64_bitmod_01' is static but used in inline function 'NOTZERO' which is not static
crypto_aead.c: 32 | return (crypto_int64_bitmod_01(((int)(result & 0xff) - 1),8)) - 1;
crypto_aead.c: | ^~~~~~~~~~~~~~~~~~~~~~
permutations.c: In file included from round.h:8,
permutations.c: from permutations.h:11,
permutations.c: from permutations.c:1:
permutations.c: word.h:32:11: warning: 'crypto_int64_bitmod_01' is static but used in inline function 'NOTZERO' which is not static
permutations.c: 32 | return (crypto_int64_bitmod_01(((int)(result & 0xff) - 1),8)) - 1;
permutations.c: | ^~~~~~~~~~~~~~~~~~~~~~
update.c: update.c: In function 'ascon_update':
update.c: update.c:21:13: warning: unused variable 'rate' [-Wunused-variable]
update.c: 21 | const int rate = ASCON_AEAD_RATE;
update.c: | ^~~~
update.c: In file included from round.h:8,
update.c: from permutations.h:11,
update.c: from update.c:3:
update.c: update.c: At top level:
update.c: word.h:32:11: warning: 'crypto_int64_bitmod_01' is static but used in inline function 'NOTZERO' which is not static
update.c: 32 | return (crypto_int64_bitmod_01(((int)(result & 0xff) - 1),8)) - 1;
update.c: | ^~~~~~~~~~~~~~~~~~~~~~
Number of similar (implementation,compiler) pairs: 8, namely:
Implementation | Compiler |
opt32_lowsize | gcc -march=native -mtune=native -O2 -fwrapv -fPIC -fPIE -gdwarf-4 -Wall (11.4.0) |
opt32_lowsize | gcc -march=native -mtune=native -O3 -fwrapv -fPIC -fPIE -gdwarf-4 -Wall (11.4.0) |
opt32_lowsize | gcc -march=native -mtune=native -O -fwrapv -fPIC -fPIE -gdwarf-4 -Wall (11.4.0) |
opt32_lowsize | gcc -march=native -mtune=native -Os -fwrapv -fPIC -fPIE -gdwarf-4 -Wall (11.4.0) |
opt64_lowsize | gcc -march=native -mtune=native -O2 -fwrapv -fPIC -fPIE -gdwarf-4 -Wall (11.4.0) |
opt64_lowsize | gcc -march=native -mtune=native -O3 -fwrapv -fPIC -fPIE -gdwarf-4 -Wall (11.4.0) |
opt64_lowsize | gcc -march=native -mtune=native -O -fwrapv -fPIC -fPIE -gdwarf-4 -Wall (11.4.0) |
opt64_lowsize | gcc -march=native -mtune=native -Os -fwrapv -fPIC -fPIE -gdwarf-4 -Wall (11.4.0) |
Compiler output
aead.c: In file included from round.h:8,
aead.c: from permutations.h:11,
aead.c: from aead.c:5:
aead.c: word.h:61:11: warning: 'crypto_int64_bitmod_01' is static but used in inline function 'NOTZERO' which is not static
aead.c: 61 | return (crypto_int64_bitmod_01(((int)(result & 0xff) - 1),8)) - 1;
aead.c: | ^~~~~~~~~~~~~~~~~~~~~~
permutations.c: In file included from round.h:8,
permutations.c: from permutations.h:11,
permutations.c: from permutations.c:1:
permutations.c: word.h:61:11: warning: 'crypto_int64_bitmod_01' is static but used in inline function 'NOTZERO' which is not static
permutations.c: 61 | return (crypto_int64_bitmod_01(((int)(result & 0xff) - 1),8)) - 1;
permutations.c: | ^~~~~~~~~~~~~~~~~~~~~~
Number of similar (implementation,compiler) pairs: 4, namely:
Implementation | Compiler |
opt8 | gcc -march=native -mtune=native -O2 -fwrapv -fPIC -fPIE -gdwarf-4 -Wall (11.4.0) |
opt8 | gcc -march=native -mtune=native -O3 -fwrapv -fPIC -fPIE -gdwarf-4 -Wall (11.4.0) |
opt8 | gcc -march=native -mtune=native -O -fwrapv -fPIC -fPIE -gdwarf-4 -Wall (11.4.0) |
opt8 | gcc -march=native -mtune=native -Os -fwrapv -fPIC -fPIE -gdwarf-4 -Wall (11.4.0) |
Compiler output
aead.c: In file included from round.h:8,
aead.c: from permutations.h:11,
aead.c: from aead.c:5:
aead.c: word.h:61:11: warning: 'crypto_int64_bitmod_01' is static but used in inline function 'NOTZERO' which is not static
aead.c: 61 | return (crypto_int64_bitmod_01(((int)(result & 0xff) - 1),8)) - 1;
aead.c: | ^~~~~~~~~~~~~~~~~~~~~~
permutations.c: In file included from round.h:8,
permutations.c: from permutations.h:11,
permutations.c: from permutations.c:1:
permutations.c: word.h:61:11: warning: 'crypto_int64_bitmod_01' is static but used in inline function 'NOTZERO' which is not static
permutations.c: 61 | return (crypto_int64_bitmod_01(((int)(result & 0xff) - 1),8)) - 1;
permutations.c: | ^~~~~~~~~~~~~~~~~~~~~~
update.c: In file included from round.h:8,
update.c: from permutations.h:11,
update.c: from update.c:3:
update.c: word.h:61:11: warning: 'crypto_int64_bitmod_01' is static but used in inline function 'NOTZERO' which is not static
update.c: 61 | return (crypto_int64_bitmod_01(((int)(result & 0xff) - 1),8)) - 1;
update.c: | ^~~~~~~~~~~~~~~~~~~~~~
Number of similar (implementation,compiler) pairs: 4, namely:
Implementation | Compiler |
opt8_lowsize | gcc -march=native -mtune=native -O2 -fwrapv -fPIC -fPIE -gdwarf-4 -Wall (11.4.0) |
opt8_lowsize | gcc -march=native -mtune=native -O3 -fwrapv -fPIC -fPIE -gdwarf-4 -Wall (11.4.0) |
opt8_lowsize | gcc -march=native -mtune=native -O -fwrapv -fPIC -fPIE -gdwarf-4 -Wall (11.4.0) |
opt8_lowsize | gcc -march=native -mtune=native -Os -fwrapv -fPIC -fPIE -gdwarf-4 -Wall (11.4.0) |
Namespace violations
constants.o constants R
interleave.o B R
permutations.o P12 T
permutations.o P6 T
Number of similar (implementation,compiler) pairs: 9, namely:
Implementation | Compiler |
bi32 | clang -march=native -O2 -fwrapv -Qunused-arguments -fPIC -fPIE -gdwarf-4 -Wall (Ubuntu_Clang_14.0.0) |
bi32 | clang -march=native -O3 -fwrapv -Qunused-arguments -fPIC -fPIE -gdwarf-4 -Wall (Ubuntu_Clang_14.0.0) |
bi32 | clang -march=native -O -fwrapv -Qunused-arguments -fPIC -fPIE -gdwarf-4 -Wall (Ubuntu_Clang_14.0.0) |
bi32 | clang -march=native -Os -fwrapv -Qunused-arguments -fPIC -fPIE -gdwarf-4 -Wall (Ubuntu_Clang_14.0.0) |
bi32 | clang -mcpu=native -O3 -fwrapv -Qunused-arguments -fPIC -fPIE -gdwarf-4 -Wall (Ubuntu_Clang_14.0.0) |
bi32 | gcc -march=native -mtune=native -O2 -fwrapv -fPIC -fPIE -gdwarf-4 -Wall (11.4.0) |
bi32 | gcc -march=native -mtune=native -O3 -fwrapv -fPIC -fPIE -gdwarf-4 -Wall (11.4.0) |
bi32 | gcc -march=native -mtune=native -O -fwrapv -fPIC -fPIE -gdwarf-4 -Wall (11.4.0) |
bi32 | gcc -march=native -mtune=native -Os -fwrapv -fPIC -fPIE -gdwarf-4 -Wall (11.4.0) |
Namespace violations
aead.o ascon_adata T
aead.o ascon_decrypt T
aead.o ascon_encrypt T
aead.o ascon_final T
aead.o ascon_initaead T
aead.o ascon_loadkey T
constants.o constants R
interleave.o B R
Number of similar (implementation,compiler) pairs: 9, namely:
Implementation | Compiler |
bi32_lowreg | clang -march=native -O2 -fwrapv -Qunused-arguments -fPIC -fPIE -gdwarf-4 -Wall (Ubuntu_Clang_14.0.0) |
bi32_lowreg | clang -march=native -O3 -fwrapv -Qunused-arguments -fPIC -fPIE -gdwarf-4 -Wall (Ubuntu_Clang_14.0.0) |
bi32_lowreg | clang -march=native -O -fwrapv -Qunused-arguments -fPIC -fPIE -gdwarf-4 -Wall (Ubuntu_Clang_14.0.0) |
bi32_lowreg | clang -march=native -Os -fwrapv -Qunused-arguments -fPIC -fPIE -gdwarf-4 -Wall (Ubuntu_Clang_14.0.0) |
bi32_lowreg | clang -mcpu=native -O3 -fwrapv -Qunused-arguments -fPIC -fPIE -gdwarf-4 -Wall (Ubuntu_Clang_14.0.0) |
bi32_lowreg | gcc -march=native -mtune=native -O2 -fwrapv -fPIC -fPIE -gdwarf-4 -Wall (11.4.0) |
bi32_lowreg | gcc -march=native -mtune=native -O3 -fwrapv -fPIC -fPIE -gdwarf-4 -Wall (11.4.0) |
bi32_lowreg | gcc -march=native -mtune=native -O -fwrapv -fPIC -fPIE -gdwarf-4 -Wall (11.4.0) |
bi32_lowreg | gcc -march=native -mtune=native -Os -fwrapv -fPIC -fPIE -gdwarf-4 -Wall (11.4.0) |
Namespace violations
aead.o ascon_aead T
constants.o constants R
interleave.o B R
interleave.o FROMBI T
interleave.o TOBI T
permutations.o P T
update.o ascon_update T
Number of similar (implementation,compiler) pairs: 9, namely:
Implementation | Compiler |
bi32_lowsize | clang -march=native -O2 -fwrapv -Qunused-arguments -fPIC -fPIE -gdwarf-4 -Wall (Ubuntu_Clang_14.0.0) |
bi32_lowsize | clang -march=native -O3 -fwrapv -Qunused-arguments -fPIC -fPIE -gdwarf-4 -Wall (Ubuntu_Clang_14.0.0) |
bi32_lowsize | clang -march=native -O -fwrapv -Qunused-arguments -fPIC -fPIE -gdwarf-4 -Wall (Ubuntu_Clang_14.0.0) |
bi32_lowsize | clang -march=native -Os -fwrapv -Qunused-arguments -fPIC -fPIE -gdwarf-4 -Wall (Ubuntu_Clang_14.0.0) |
bi32_lowsize | clang -mcpu=native -O3 -fwrapv -Qunused-arguments -fPIC -fPIE -gdwarf-4 -Wall (Ubuntu_Clang_14.0.0) |
bi32_lowsize | gcc -march=native -mtune=native -O2 -fwrapv -fPIC -fPIE -gdwarf-4 -Wall (11.4.0) |
bi32_lowsize | gcc -march=native -mtune=native -O3 -fwrapv -fPIC -fPIE -gdwarf-4 -Wall (11.4.0) |
bi32_lowsize | gcc -march=native -mtune=native -O -fwrapv -fPIC -fPIE -gdwarf-4 -Wall (11.4.0) |
bi32_lowsize | gcc -march=native -mtune=native -Os -fwrapv -fPIC -fPIE -gdwarf-4 -Wall (11.4.0) |
Namespace violations
constants.o constants R
interleave.o FROMBI T
interleave.o TOBI T
permutations.o P T
Number of similar (implementation,compiler) pairs: 9, namely:
Implementation | Compiler |
bi8 | clang -march=native -O2 -fwrapv -Qunused-arguments -fPIC -fPIE -gdwarf-4 -Wall (Ubuntu_Clang_14.0.0) |
bi8 | clang -march=native -O3 -fwrapv -Qunused-arguments -fPIC -fPIE -gdwarf-4 -Wall (Ubuntu_Clang_14.0.0) |
bi8 | clang -march=native -O -fwrapv -Qunused-arguments -fPIC -fPIE -gdwarf-4 -Wall (Ubuntu_Clang_14.0.0) |
bi8 | clang -march=native -Os -fwrapv -Qunused-arguments -fPIC -fPIE -gdwarf-4 -Wall (Ubuntu_Clang_14.0.0) |
bi8 | clang -mcpu=native -O3 -fwrapv -Qunused-arguments -fPIC -fPIE -gdwarf-4 -Wall (Ubuntu_Clang_14.0.0) |
bi8 | gcc -march=native -mtune=native -O2 -fwrapv -fPIC -fPIE -gdwarf-4 -Wall (11.4.0) |
bi8 | gcc -march=native -mtune=native -O3 -fwrapv -fPIC -fPIE -gdwarf-4 -Wall (11.4.0) |
bi8 | gcc -march=native -mtune=native -O -fwrapv -fPIC -fPIE -gdwarf-4 -Wall (11.4.0) |
bi8 | gcc -march=native -mtune=native -Os -fwrapv -fPIC -fPIE -gdwarf-4 -Wall (11.4.0) |
Namespace violations
aead.o ascon_aead T
permutations.o P T
update.o ascon_update T
Number of similar (implementation,compiler) pairs: 18, namely:
Implementation | Compiler |
opt32_lowsize | clang -march=native -O2 -fwrapv -Qunused-arguments -fPIC -fPIE -gdwarf-4 -Wall (Ubuntu_Clang_14.0.0) |
opt32_lowsize | clang -march=native -O3 -fwrapv -Qunused-arguments -fPIC -fPIE -gdwarf-4 -Wall (Ubuntu_Clang_14.0.0) |
opt32_lowsize | clang -march=native -O -fwrapv -Qunused-arguments -fPIC -fPIE -gdwarf-4 -Wall (Ubuntu_Clang_14.0.0) |
opt32_lowsize | clang -march=native -Os -fwrapv -Qunused-arguments -fPIC -fPIE -gdwarf-4 -Wall (Ubuntu_Clang_14.0.0) |
opt32_lowsize | clang -mcpu=native -O3 -fwrapv -Qunused-arguments -fPIC -fPIE -gdwarf-4 -Wall (Ubuntu_Clang_14.0.0) |
opt32_lowsize | gcc -march=native -mtune=native -O2 -fwrapv -fPIC -fPIE -gdwarf-4 -Wall (11.4.0) |
opt32_lowsize | gcc -march=native -mtune=native -O3 -fwrapv -fPIC -fPIE -gdwarf-4 -Wall (11.4.0) |
opt32_lowsize | gcc -march=native -mtune=native -O -fwrapv -fPIC -fPIE -gdwarf-4 -Wall (11.4.0) |
opt32_lowsize | gcc -march=native -mtune=native -Os -fwrapv -fPIC -fPIE -gdwarf-4 -Wall (11.4.0) |
opt64_lowsize | clang -march=native -O2 -fwrapv -Qunused-arguments -fPIC -fPIE -gdwarf-4 -Wall (Ubuntu_Clang_14.0.0) |
opt64_lowsize | clang -march=native -O3 -fwrapv -Qunused-arguments -fPIC -fPIE -gdwarf-4 -Wall (Ubuntu_Clang_14.0.0) |
opt64_lowsize | clang -march=native -O -fwrapv -Qunused-arguments -fPIC -fPIE -gdwarf-4 -Wall (Ubuntu_Clang_14.0.0) |
opt64_lowsize | clang -march=native -Os -fwrapv -Qunused-arguments -fPIC -fPIE -gdwarf-4 -Wall (Ubuntu_Clang_14.0.0) |
opt64_lowsize | clang -mcpu=native -O3 -fwrapv -Qunused-arguments -fPIC -fPIE -gdwarf-4 -Wall (Ubuntu_Clang_14.0.0) |
opt64_lowsize | gcc -march=native -mtune=native -O2 -fwrapv -fPIC -fPIE -gdwarf-4 -Wall (11.4.0) |
opt64_lowsize | gcc -march=native -mtune=native -O3 -fwrapv -fPIC -fPIE -gdwarf-4 -Wall (11.4.0) |
opt64_lowsize | gcc -march=native -mtune=native -O -fwrapv -fPIC -fPIE -gdwarf-4 -Wall (11.4.0) |
opt64_lowsize | gcc -march=native -mtune=native -Os -fwrapv -fPIC -fPIE -gdwarf-4 -Wall (11.4.0) |
Namespace violations
aead.o ascon_adata T
aead.o ascon_decrypt T
aead.o ascon_encrypt T
aead.o ascon_final T
aead.o ascon_initaead T
aead.o ascon_loadkey T
permutations.o P T
Number of similar (implementation,compiler) pairs: 9, namely:
Implementation | Compiler |
opt8 | clang -march=native -O2 -fwrapv -Qunused-arguments -fPIC -fPIE -gdwarf-4 -Wall (Ubuntu_Clang_14.0.0) |
opt8 | clang -march=native -O3 -fwrapv -Qunused-arguments -fPIC -fPIE -gdwarf-4 -Wall (Ubuntu_Clang_14.0.0) |
opt8 | clang -march=native -O -fwrapv -Qunused-arguments -fPIC -fPIE -gdwarf-4 -Wall (Ubuntu_Clang_14.0.0) |
opt8 | clang -march=native -Os -fwrapv -Qunused-arguments -fPIC -fPIE -gdwarf-4 -Wall (Ubuntu_Clang_14.0.0) |
opt8 | clang -mcpu=native -O3 -fwrapv -Qunused-arguments -fPIC -fPIE -gdwarf-4 -Wall (Ubuntu_Clang_14.0.0) |
opt8 | gcc -march=native -mtune=native -O2 -fwrapv -fPIC -fPIE -gdwarf-4 -Wall (11.4.0) |
opt8 | gcc -march=native -mtune=native -O3 -fwrapv -fPIC -fPIE -gdwarf-4 -Wall (11.4.0) |
opt8 | gcc -march=native -mtune=native -O -fwrapv -fPIC -fPIE -gdwarf-4 -Wall (11.4.0) |
opt8 | gcc -march=native -mtune=native -Os -fwrapv -fPIC -fPIE -gdwarf-4 -Wall (11.4.0) |
Namespace violations
aead.o ascon_final T
aead.o ascon_initaead T
aead.o ascon_loadkey T
permutations.o P T
update.o ascon_update T
Number of similar (implementation,compiler) pairs: 9, namely:
Implementation | Compiler |
opt8_lowsize | clang -march=native -O2 -fwrapv -Qunused-arguments -fPIC -fPIE -gdwarf-4 -Wall (Ubuntu_Clang_14.0.0) |
opt8_lowsize | clang -march=native -O3 -fwrapv -Qunused-arguments -fPIC -fPIE -gdwarf-4 -Wall (Ubuntu_Clang_14.0.0) |
opt8_lowsize | clang -march=native -O -fwrapv -Qunused-arguments -fPIC -fPIE -gdwarf-4 -Wall (Ubuntu_Clang_14.0.0) |
opt8_lowsize | clang -march=native -Os -fwrapv -Qunused-arguments -fPIC -fPIE -gdwarf-4 -Wall (Ubuntu_Clang_14.0.0) |
opt8_lowsize | clang -mcpu=native -O3 -fwrapv -Qunused-arguments -fPIC -fPIE -gdwarf-4 -Wall (Ubuntu_Clang_14.0.0) |
opt8_lowsize | gcc -march=native -mtune=native -O2 -fwrapv -fPIC -fPIE -gdwarf-4 -Wall (11.4.0) |
opt8_lowsize | gcc -march=native -mtune=native -O3 -fwrapv -fPIC -fPIE -gdwarf-4 -Wall (11.4.0) |
opt8_lowsize | gcc -march=native -mtune=native -O -fwrapv -fPIC -fPIE -gdwarf-4 -Wall (11.4.0) |
opt8_lowsize | gcc -march=native -mtune=native -Os -fwrapv -fPIC -fPIE -gdwarf-4 -Wall (11.4.0) |
TIMECOP error (can be valgrind bug)
error 132
Process terminating with default action of signal 4 (SIGILL)
Illegal opcode at address 0x10C176
at 0x...: VERIFY (word.h:153)
by 0x...: crypto_aead_ascon80pqv12_opt8_constbranchindex_decrypt (aead.c:192)
by 0x...: test (try.c:300)
by 0x...: main (try-anything.c:345)
timeout: the monitored command dumped core
Illegal instruction
Number of similar (implementation,compiler) pairs: 1, namely:
Implementation | Compiler |
opt8 | clang -march=native -O2 -fwrapv -Qunused-arguments -fPIC -fPIE -gdwarf-4 -Wall (Ubuntu_Clang_14.0.0) |
TIMECOP error (can be valgrind bug)
error 132
Process terminating with default action of signal 4 (SIGILL)
Illegal opcode at address 0x10C216
at 0x...: VERIFY (word.h:153)
by 0x...: crypto_aead_ascon80pqv12_opt8_constbranchindex_decrypt (aead.c:192)
by 0x...: test (try.c:300)
by 0x...: main (try-anything.c:345)
timeout: the monitored command dumped core
Illegal instruction
Number of similar (implementation,compiler) pairs: 1, namely:
Implementation | Compiler |
opt8 | clang -march=native -O3 -fwrapv -Qunused-arguments -fPIC -fPIE -gdwarf-4 -Wall (Ubuntu_Clang_14.0.0) |
TIMECOP error (can be valgrind bug)
error 132
Process terminating with default action of signal 4 (SIGILL)
Illegal opcode at address 0x10BA5F
at 0x...: VERIFY (word.h:153)
by 0x...: crypto_aead_ascon80pqv12_opt8_lowsize_constbranchindex_decrypt (aead.c:119)
by 0x...: test (try.c:300)
by 0x...: main (try-anything.c:345)
timeout: the monitored command dumped core
Illegal instruction
Number of similar (implementation,compiler) pairs: 1, namely:
Implementation | Compiler |
opt8_lowsize | clang -march=native -O2 -fwrapv -Qunused-arguments -fPIC -fPIE -gdwarf-4 -Wall (Ubuntu_Clang_14.0.0) |
TIMECOP error (can be valgrind bug)
error 132
Process terminating with default action of signal 4 (SIGILL)
Illegal opcode at address 0x10BAFF
at 0x...: VERIFY (word.h:153)
by 0x...: crypto_aead_ascon80pqv12_opt8_lowsize_constbranchindex_decrypt (aead.c:119)
by 0x...: test (try.c:300)
by 0x...: main (try-anything.c:345)
timeout: the monitored command dumped core
Illegal instruction
Number of similar (implementation,compiler) pairs: 1, namely:
Implementation | Compiler |
opt8_lowsize | clang -march=native -O3 -fwrapv -Qunused-arguments -fPIC -fPIE -gdwarf-4 -Wall (Ubuntu_Clang_14.0.0) |
Passed TIMECOP
TIMECOP iterations: 10
Number of similar (implementation,compiler) pairs: 95, namely:
Implementation | Compiler |
bi32 | clang -march=native -O2 -fwrapv -Qunused-arguments -fPIC -fPIE -gdwarf-4 -Wall (Ubuntu_Clang_14.0.0) |
bi32 | clang -march=native -O3 -fwrapv -Qunused-arguments -fPIC -fPIE -gdwarf-4 -Wall (Ubuntu_Clang_14.0.0) |
bi32 | clang -march=native -O -fwrapv -Qunused-arguments -fPIC -fPIE -gdwarf-4 -Wall (Ubuntu_Clang_14.0.0) |
bi32 | clang -march=native -Os -fwrapv -Qunused-arguments -fPIC -fPIE -gdwarf-4 -Wall (Ubuntu_Clang_14.0.0) |
bi32 | clang -mcpu=native -O3 -fwrapv -Qunused-arguments -fPIC -fPIE -gdwarf-4 -Wall (Ubuntu_Clang_14.0.0) |
bi32 | gcc -march=native -mtune=native -O2 -fwrapv -fPIC -fPIE -gdwarf-4 -Wall (11.4.0) |
bi32 | gcc -march=native -mtune=native -O3 -fwrapv -fPIC -fPIE -gdwarf-4 -Wall (11.4.0) |
bi32 | gcc -march=native -mtune=native -O -fwrapv -fPIC -fPIE -gdwarf-4 -Wall (11.4.0) |
bi32 | gcc -march=native -mtune=native -Os -fwrapv -fPIC -fPIE -gdwarf-4 -Wall (11.4.0) |
bi32_lowreg | clang -march=native -O2 -fwrapv -Qunused-arguments -fPIC -fPIE -gdwarf-4 -Wall (Ubuntu_Clang_14.0.0) |
bi32_lowreg | clang -march=native -O3 -fwrapv -Qunused-arguments -fPIC -fPIE -gdwarf-4 -Wall (Ubuntu_Clang_14.0.0) |
bi32_lowreg | clang -march=native -O -fwrapv -Qunused-arguments -fPIC -fPIE -gdwarf-4 -Wall (Ubuntu_Clang_14.0.0) |
bi32_lowreg | clang -march=native -Os -fwrapv -Qunused-arguments -fPIC -fPIE -gdwarf-4 -Wall (Ubuntu_Clang_14.0.0) |
bi32_lowreg | clang -mcpu=native -O3 -fwrapv -Qunused-arguments -fPIC -fPIE -gdwarf-4 -Wall (Ubuntu_Clang_14.0.0) |
bi32_lowreg | gcc -march=native -mtune=native -O2 -fwrapv -fPIC -fPIE -gdwarf-4 -Wall (11.4.0) |
bi32_lowreg | gcc -march=native -mtune=native -O3 -fwrapv -fPIC -fPIE -gdwarf-4 -Wall (11.4.0) |
bi32_lowreg | gcc -march=native -mtune=native -O -fwrapv -fPIC -fPIE -gdwarf-4 -Wall (11.4.0) |
bi32_lowreg | gcc -march=native -mtune=native -Os -fwrapv -fPIC -fPIE -gdwarf-4 -Wall (11.4.0) |
bi32_lowsize | clang -march=native -O2 -fwrapv -Qunused-arguments -fPIC -fPIE -gdwarf-4 -Wall (Ubuntu_Clang_14.0.0) |
bi32_lowsize | clang -march=native -O3 -fwrapv -Qunused-arguments -fPIC -fPIE -gdwarf-4 -Wall (Ubuntu_Clang_14.0.0) |
bi32_lowsize | clang -march=native -O -fwrapv -Qunused-arguments -fPIC -fPIE -gdwarf-4 -Wall (Ubuntu_Clang_14.0.0) |
bi32_lowsize | clang -march=native -Os -fwrapv -Qunused-arguments -fPIC -fPIE -gdwarf-4 -Wall (Ubuntu_Clang_14.0.0) |
bi32_lowsize | clang -mcpu=native -O3 -fwrapv -Qunused-arguments -fPIC -fPIE -gdwarf-4 -Wall (Ubuntu_Clang_14.0.0) |
bi32_lowsize | gcc -march=native -mtune=native -O2 -fwrapv -fPIC -fPIE -gdwarf-4 -Wall (11.4.0) |
bi32_lowsize | gcc -march=native -mtune=native -O3 -fwrapv -fPIC -fPIE -gdwarf-4 -Wall (11.4.0) |
bi32_lowsize | gcc -march=native -mtune=native -O -fwrapv -fPIC -fPIE -gdwarf-4 -Wall (11.4.0) |
bi32_lowsize | gcc -march=native -mtune=native -Os -fwrapv -fPIC -fPIE -gdwarf-4 -Wall (11.4.0) |
bi8 | clang -march=native -O2 -fwrapv -Qunused-arguments -fPIC -fPIE -gdwarf-4 -Wall (Ubuntu_Clang_14.0.0) |
bi8 | clang -march=native -O3 -fwrapv -Qunused-arguments -fPIC -fPIE -gdwarf-4 -Wall (Ubuntu_Clang_14.0.0) |
bi8 | clang -march=native -O -fwrapv -Qunused-arguments -fPIC -fPIE -gdwarf-4 -Wall (Ubuntu_Clang_14.0.0) |
bi8 | clang -march=native -Os -fwrapv -Qunused-arguments -fPIC -fPIE -gdwarf-4 -Wall (Ubuntu_Clang_14.0.0) |
bi8 | clang -mcpu=native -O3 -fwrapv -Qunused-arguments -fPIC -fPIE -gdwarf-4 -Wall (Ubuntu_Clang_14.0.0) |
bi8 | gcc -march=native -mtune=native -O2 -fwrapv -fPIC -fPIE -gdwarf-4 -Wall (11.4.0) |
bi8 | gcc -march=native -mtune=native -O3 -fwrapv -fPIC -fPIE -gdwarf-4 -Wall (11.4.0) |
bi8 | gcc -march=native -mtune=native -O -fwrapv -fPIC -fPIE -gdwarf-4 -Wall (11.4.0) |
bi8 | gcc -march=native -mtune=native -Os -fwrapv -fPIC -fPIE -gdwarf-4 -Wall (11.4.0) |
opt32 | clang -march=native -O2 -fwrapv -Qunused-arguments -fPIC -fPIE -gdwarf-4 -Wall (Ubuntu_Clang_14.0.0) |
opt32 | clang -march=native -O3 -fwrapv -Qunused-arguments -fPIC -fPIE -gdwarf-4 -Wall (Ubuntu_Clang_14.0.0) |
opt32 | clang -march=native -O -fwrapv -Qunused-arguments -fPIC -fPIE -gdwarf-4 -Wall (Ubuntu_Clang_14.0.0) |
opt32 | clang -march=native -Os -fwrapv -Qunused-arguments -fPIC -fPIE -gdwarf-4 -Wall (Ubuntu_Clang_14.0.0) |
opt32 | clang -mcpu=native -O3 -fwrapv -Qunused-arguments -fPIC -fPIE -gdwarf-4 -Wall (Ubuntu_Clang_14.0.0) |
opt32 | gcc -march=native -mtune=native -O2 -fwrapv -fPIC -fPIE -gdwarf-4 -Wall (11.4.0) |
opt32 | gcc -march=native -mtune=native -O3 -fwrapv -fPIC -fPIE -gdwarf-4 -Wall (11.4.0) |
opt32 | gcc -march=native -mtune=native -O -fwrapv -fPIC -fPIE -gdwarf-4 -Wall (11.4.0) |
opt32 | gcc -march=native -mtune=native -Os -fwrapv -fPIC -fPIE -gdwarf-4 -Wall (11.4.0) |
opt32_lowsize | clang -march=native -O2 -fwrapv -Qunused-arguments -fPIC -fPIE -gdwarf-4 -Wall (Ubuntu_Clang_14.0.0) |
opt32_lowsize | clang -march=native -O3 -fwrapv -Qunused-arguments -fPIC -fPIE -gdwarf-4 -Wall (Ubuntu_Clang_14.0.0) |
opt32_lowsize | clang -march=native -O -fwrapv -Qunused-arguments -fPIC -fPIE -gdwarf-4 -Wall (Ubuntu_Clang_14.0.0) |
opt32_lowsize | clang -march=native -Os -fwrapv -Qunused-arguments -fPIC -fPIE -gdwarf-4 -Wall (Ubuntu_Clang_14.0.0) |
opt32_lowsize | clang -mcpu=native -O3 -fwrapv -Qunused-arguments -fPIC -fPIE -gdwarf-4 -Wall (Ubuntu_Clang_14.0.0) |
opt32_lowsize | gcc -march=native -mtune=native -O2 -fwrapv -fPIC -fPIE -gdwarf-4 -Wall (11.4.0) |
opt32_lowsize | gcc -march=native -mtune=native -O3 -fwrapv -fPIC -fPIE -gdwarf-4 -Wall (11.4.0) |
opt32_lowsize | gcc -march=native -mtune=native -O -fwrapv -fPIC -fPIE -gdwarf-4 -Wall (11.4.0) |
opt32_lowsize | gcc -march=native -mtune=native -Os -fwrapv -fPIC -fPIE -gdwarf-4 -Wall (11.4.0) |
opt64 | clang -march=native -O2 -fwrapv -Qunused-arguments -fPIC -fPIE -gdwarf-4 -Wall (Ubuntu_Clang_14.0.0) |
opt64 | clang -march=native -O3 -fwrapv -Qunused-arguments -fPIC -fPIE -gdwarf-4 -Wall (Ubuntu_Clang_14.0.0) |
opt64 | clang -march=native -O -fwrapv -Qunused-arguments -fPIC -fPIE -gdwarf-4 -Wall (Ubuntu_Clang_14.0.0) |
opt64 | clang -march=native -Os -fwrapv -Qunused-arguments -fPIC -fPIE -gdwarf-4 -Wall (Ubuntu_Clang_14.0.0) |
opt64 | clang -mcpu=native -O3 -fwrapv -Qunused-arguments -fPIC -fPIE -gdwarf-4 -Wall (Ubuntu_Clang_14.0.0) |
opt64 | gcc -march=native -mtune=native -O2 -fwrapv -fPIC -fPIE -gdwarf-4 -Wall (11.4.0) |
opt64 | gcc -march=native -mtune=native -O3 -fwrapv -fPIC -fPIE -gdwarf-4 -Wall (11.4.0) |
opt64 | gcc -march=native -mtune=native -O -fwrapv -fPIC -fPIE -gdwarf-4 -Wall (11.4.0) |
opt64 | gcc -march=native -mtune=native -Os -fwrapv -fPIC -fPIE -gdwarf-4 -Wall (11.4.0) |
opt64_lowsize | clang -march=native -O2 -fwrapv -Qunused-arguments -fPIC -fPIE -gdwarf-4 -Wall (Ubuntu_Clang_14.0.0) |
opt64_lowsize | clang -march=native -O3 -fwrapv -Qunused-arguments -fPIC -fPIE -gdwarf-4 -Wall (Ubuntu_Clang_14.0.0) |
opt64_lowsize | clang -march=native -O -fwrapv -Qunused-arguments -fPIC -fPIE -gdwarf-4 -Wall (Ubuntu_Clang_14.0.0) |
opt64_lowsize | clang -march=native -Os -fwrapv -Qunused-arguments -fPIC -fPIE -gdwarf-4 -Wall (Ubuntu_Clang_14.0.0) |
opt64_lowsize | clang -mcpu=native -O3 -fwrapv -Qunused-arguments -fPIC -fPIE -gdwarf-4 -Wall (Ubuntu_Clang_14.0.0) |
opt64_lowsize | gcc -march=native -mtune=native -O2 -fwrapv -fPIC -fPIE -gdwarf-4 -Wall (11.4.0) |
opt64_lowsize | gcc -march=native -mtune=native -O3 -fwrapv -fPIC -fPIE -gdwarf-4 -Wall (11.4.0) |
opt64_lowsize | gcc -march=native -mtune=native -O -fwrapv -fPIC -fPIE -gdwarf-4 -Wall (11.4.0) |
opt64_lowsize | gcc -march=native -mtune=native -Os -fwrapv -fPIC -fPIE -gdwarf-4 -Wall (11.4.0) |
opt8 | clang -march=native -O -fwrapv -Qunused-arguments -fPIC -fPIE -gdwarf-4 -Wall (Ubuntu_Clang_14.0.0) |
opt8 | clang -march=native -Os -fwrapv -Qunused-arguments -fPIC -fPIE -gdwarf-4 -Wall (Ubuntu_Clang_14.0.0) |
opt8 | clang -mcpu=native -O3 -fwrapv -Qunused-arguments -fPIC -fPIE -gdwarf-4 -Wall (Ubuntu_Clang_14.0.0) |
opt8 | gcc -march=native -mtune=native -O2 -fwrapv -fPIC -fPIE -gdwarf-4 -Wall (11.4.0) |
opt8 | gcc -march=native -mtune=native -O3 -fwrapv -fPIC -fPIE -gdwarf-4 -Wall (11.4.0) |
opt8 | gcc -march=native -mtune=native -O -fwrapv -fPIC -fPIE -gdwarf-4 -Wall (11.4.0) |
opt8 | gcc -march=native -mtune=native -Os -fwrapv -fPIC -fPIE -gdwarf-4 -Wall (11.4.0) |
opt8_lowsize | clang -march=native -O -fwrapv -Qunused-arguments -fPIC -fPIE -gdwarf-4 -Wall (Ubuntu_Clang_14.0.0) |
opt8_lowsize | clang -march=native -Os -fwrapv -Qunused-arguments -fPIC -fPIE -gdwarf-4 -Wall (Ubuntu_Clang_14.0.0) |
opt8_lowsize | clang -mcpu=native -O3 -fwrapv -Qunused-arguments -fPIC -fPIE -gdwarf-4 -Wall (Ubuntu_Clang_14.0.0) |
opt8_lowsize | gcc -march=native -mtune=native -O2 -fwrapv -fPIC -fPIE -gdwarf-4 -Wall (11.4.0) |
opt8_lowsize | gcc -march=native -mtune=native -O3 -fwrapv -fPIC -fPIE -gdwarf-4 -Wall (11.4.0) |
opt8_lowsize | gcc -march=native -mtune=native -O -fwrapv -fPIC -fPIE -gdwarf-4 -Wall (11.4.0) |
opt8_lowsize | gcc -march=native -mtune=native -Os -fwrapv -fPIC -fPIE -gdwarf-4 -Wall (11.4.0) |
ref | clang -march=native -O2 -fwrapv -Qunused-arguments -fPIC -fPIE -gdwarf-4 -Wall (Ubuntu_Clang_14.0.0) |
ref | clang -march=native -O3 -fwrapv -Qunused-arguments -fPIC -fPIE -gdwarf-4 -Wall (Ubuntu_Clang_14.0.0) |
ref | clang -march=native -O -fwrapv -Qunused-arguments -fPIC -fPIE -gdwarf-4 -Wall (Ubuntu_Clang_14.0.0) |
ref | clang -march=native -Os -fwrapv -Qunused-arguments -fPIC -fPIE -gdwarf-4 -Wall (Ubuntu_Clang_14.0.0) |
ref | clang -mcpu=native -O3 -fwrapv -Qunused-arguments -fPIC -fPIE -gdwarf-4 -Wall (Ubuntu_Clang_14.0.0) |
ref | gcc -march=native -mtune=native -O2 -fwrapv -fPIC -fPIE -gdwarf-4 -Wall (11.4.0) |
ref | gcc -march=native -mtune=native -O3 -fwrapv -fPIC -fPIE -gdwarf-4 -Wall (11.4.0) |
ref | gcc -march=native -mtune=native -O -fwrapv -fPIC -fPIE -gdwarf-4 -Wall (11.4.0) |
ref | gcc -march=native -mtune=native -Os -fwrapv -fPIC -fPIE -gdwarf-4 -Wall (11.4.0) |