Test results for amd64, hydra4, crypto_aead/omdsha256k256n104tau160v1
[Page version: 20250403 07:21:53]
Measurements for amd64, hydra4, crypto_aead
Test results for amd64, hydra4, crypto_aead
Test results for crypto_aead/omdsha256k256n104tau160v1
Computer: hydra4
Microarchitecture: amd64; K10 32nm (300f10)
Architecture: amd64
CPU ID: AuthenticAMD-00300f10-178bfbff
SUPERCOP version: 20250307
Operation: crypto_aead
Primitive: omdsha256k256n104tau160v1
Time | Object size | Test size | Implementation | Compiler | Benchmark date | SUPERCOP version |
271201 | 18816 0 0 | 41392 780 1080 | T:ref | gcc -march=native -mtune=native -O3 -fwrapv -fPIC -fPIE -gdwarf-4 -Wall | 20250312 | 20250307 |
296874 | 10889 0 0 | 32392 812 1016 | T:ref | clang -march=native -O2 -fwrapv -Qunused-arguments -fPIC -fPIE -gdwarf-4 -Wall | 20250312 | 20250307 |
304835 | 8742 0 0 | 31208 812 1016 | T:ref | clang -mcpu=native -O3 -fwrapv -Qunused-arguments -fPIC -fPIE -gdwarf-4 -Wall | 20250312 | 20250307 |
305063 | 8814 0 0 | 31272 812 1016 | T:ref | clang -march=native -O3 -fwrapv -Qunused-arguments -fPIC -fPIE -gdwarf-4 -Wall | 20250312 | 20250307 |
318445 | 4774 0 0 | 24286 804 1016 | T:ref | clang -march=native -Os -fwrapv -Qunused-arguments -fPIC -fPIE -gdwarf-4 -Wall | 20250312 | 20250307 |
339785 | 7772 0 0 | 29200 780 1080 | T:ref | gcc -march=native -mtune=native -O2 -fwrapv -fPIC -fPIE -gdwarf-4 -Wall | 20250312 | 20250307 |
356395 | 4523 0 0 | 24486 804 1016 | T:ref | clang -march=native -O -fwrapv -Qunused-arguments -fPIC -fPIE -gdwarf-4 -Wall | 20250312 | 20250307 |
358567 | 3991 0 0 | 22907 756 1048 | T:ref | gcc -march=native -mtune=native -Os -fwrapv -fPIC -fPIE -gdwarf-4 -Wall | 20250312 | 20250307 |
381692 | 6337 0 0 | 26887 772 1080 | T:ref | gcc -march=native -mtune=native -O -fwrapv -fPIC -fPIE -gdwarf-4 -Wall | 20250312 | 20250307 |
Compiler output
try.c: /usr/bin/ld: libcrypto_aead_omdsha256k256n104tau160v1.a(omdsha256.o):.../supercop-data/hydra4/amd64/try/c/clang_-march=native_-O2_-fwrapv_-Qunused-arguments_-fPIC_-fPIE_-gdwarf-4_-Wall/timingleaks/crypto_aead/omdsha256k256n104tau160v1/avx1/work/./omdsha256.h:137: multiple definition of `Hash'; libcrypto_aead_omdsha256k256n104tau160v1.a(encrypt.o):.../supercop-data/hydra4/amd64/try/c/clang_-march=native_-O2_-fwrapv_-Qunused-arguments_-fPIC_-fPIE_-gdwarf-4_-Wall/timingleaks/crypto_aead/omdsha256k256n104tau160v1/avx1/work/./omdsha256.h:137: first defined here
try.c: clang: error: linker command failed with exit code 1 (use -v to see invocation)
Number of similar (implementation,compiler) pairs: 1, namely:
Implementation | Compiler |
T:avx1 | clang -march=native -O2 -fwrapv -Qunused-arguments -fPIC -fPIE -gdwarf-4 -Wall (Debian_Clang_11.0.1) |
Compiler output
try.c: /usr/bin/ld: libcrypto_aead_omdsha256k256n104tau160v1.a(omdsha256.o):.../supercop-data/hydra4/amd64/try/c/clang_-march=native_-O3_-fwrapv_-Qunused-arguments_-fPIC_-fPIE_-gdwarf-4_-Wall/timingleaks/crypto_aead/omdsha256k256n104tau160v1/avx1/work/./omdsha256.h:137: multiple definition of `Hash'; libcrypto_aead_omdsha256k256n104tau160v1.a(encrypt.o):.../supercop-data/hydra4/amd64/try/c/clang_-march=native_-O3_-fwrapv_-Qunused-arguments_-fPIC_-fPIE_-gdwarf-4_-Wall/timingleaks/crypto_aead/omdsha256k256n104tau160v1/avx1/work/./omdsha256.h:137: first defined here
try.c: clang: error: linker command failed with exit code 1 (use -v to see invocation)
Number of similar (implementation,compiler) pairs: 1, namely:
Implementation | Compiler |
T:avx1 | clang -march=native -O3 -fwrapv -Qunused-arguments -fPIC -fPIE -gdwarf-4 -Wall (Debian_Clang_11.0.1) |
Compiler output
try.c: /usr/bin/ld: libcrypto_aead_omdsha256k256n104tau160v1.a(omdsha256.o):.../supercop-data/hydra4/amd64/try/c/clang_-march=native_-O_-fwrapv_-Qunused-arguments_-fPIC_-fPIE_-gdwarf-4_-Wall/timingleaks/crypto_aead/omdsha256k256n104tau160v1/avx1/work/./omdsha256.h:137: multiple definition of `Hash'; libcrypto_aead_omdsha256k256n104tau160v1.a(encrypt.o):.../supercop-data/hydra4/amd64/try/c/clang_-march=native_-O_-fwrapv_-Qunused-arguments_-fPIC_-fPIE_-gdwarf-4_-Wall/timingleaks/crypto_aead/omdsha256k256n104tau160v1/avx1/work/./omdsha256.h:137: first defined here
try.c: clang: error: linker command failed with exit code 1 (use -v to see invocation)
Number of similar (implementation,compiler) pairs: 1, namely:
Implementation | Compiler |
T:avx1 | clang -march=native -O -fwrapv -Qunused-arguments -fPIC -fPIE -gdwarf-4 -Wall (Debian_Clang_11.0.1) |
Compiler output
try.c: /usr/bin/ld: libcrypto_aead_omdsha256k256n104tau160v1.a(omdsha256.o):.../supercop-data/hydra4/amd64/try/c/clang_-march=native_-Os_-fwrapv_-Qunused-arguments_-fPIC_-fPIE_-gdwarf-4_-Wall/timingleaks/crypto_aead/omdsha256k256n104tau160v1/avx1/work/./omdsha256.h:137: multiple definition of `Hash'; libcrypto_aead_omdsha256k256n104tau160v1.a(encrypt.o):.../supercop-data/hydra4/amd64/try/c/clang_-march=native_-Os_-fwrapv_-Qunused-arguments_-fPIC_-fPIE_-gdwarf-4_-Wall/timingleaks/crypto_aead/omdsha256k256n104tau160v1/avx1/work/./omdsha256.h:137: first defined here
try.c: clang: error: linker command failed with exit code 1 (use -v to see invocation)
Number of similar (implementation,compiler) pairs: 1, namely:
Implementation | Compiler |
T:avx1 | clang -march=native -Os -fwrapv -Qunused-arguments -fPIC -fPIE -gdwarf-4 -Wall (Debian_Clang_11.0.1) |
Compiler output
try.c: /usr/bin/ld: libcrypto_aead_omdsha256k256n104tau160v1.a(omdsha256.o):.../supercop-data/hydra4/amd64/try/c/clang_-mcpu=native_-O3_-fwrapv_-Qunused-arguments_-fPIC_-fPIE_-gdwarf-4_-Wall/timingleaks/crypto_aead/omdsha256k256n104tau160v1/avx1/work/./omdsha256.h:137: multiple definition of `Hash'; libcrypto_aead_omdsha256k256n104tau160v1.a(encrypt.o):.../supercop-data/hydra4/amd64/try/c/clang_-mcpu=native_-O3_-fwrapv_-Qunused-arguments_-fPIC_-fPIE_-gdwarf-4_-Wall/timingleaks/crypto_aead/omdsha256k256n104tau160v1/avx1/work/./omdsha256.h:137: first defined here
try.c: clang: error: linker command failed with exit code 1 (use -v to see invocation)
Number of similar (implementation,compiler) pairs: 1, namely:
Implementation | Compiler |
T:avx1 | clang -mcpu=native -O3 -fwrapv -Qunused-arguments -fPIC -fPIE -gdwarf-4 -Wall (Debian_Clang_11.0.1) |
Compiler output
encrypt.c: /tmp/ccBe2hl6.s: Assembler messages:
encrypt.c: /tmp/ccBe2hl6.s:5268: Error: can't resolve `.data' {.data section} - `.Ltext0' {.text section}
encrypt.c: /tmp/ccBe2hl6.s:5269: Error: can't resolve `.data' {.data section} - `.Ltext0' {.text section}
encrypt.c: /tmp/ccBe2hl6.s:5272: Error: can't resolve `.data' {.data section} - `.Ltext0' {.text section}
encrypt.c: /tmp/ccBe2hl6.s:5273: Error: can't resolve `.data' {.data section} - `.Ltext0' {.text section}
encrypt.c: /tmp/ccBe2hl6.s:5289: Error: can't resolve `.data' {.data section} - `.Ltext0' {.text section}
encrypt.c: /tmp/ccBe2hl6.s:5290: Error: can't resolve `.data' {.data section} - `.Ltext0' {.text section}
encrypt.c: /tmp/ccBe2hl6.s:5293: Error: can't resolve `.data' {.data section} - `.Ltext0' {.text section}
encrypt.c: /tmp/ccBe2hl6.s:5294: Error: can't resolve `.data' {.data section} - `.Ltext0' {.text section}
encrypt.c: /tmp/ccBe2hl6.s:5297: Error: can't resolve `.data' {.data section} - `.Ltext0' {.text section}
encrypt.c: /tmp/ccBe2hl6.s:5298: Error: can't resolve `.data' {.data section} - `.Ltext0' {.text section}
encrypt.c: /tmp/ccBe2hl6.s:5312: Error: can't resolve `.data' {.data section} - `.Ltext0' {.text section}
encrypt.c: /tmp/ccBe2hl6.s:5313: Error: can't resolve `.data' {.data section} - `.Ltext0' {.text section}
encrypt.c: /tmp/ccBe2hl6.s:5316: Error: can't resolve `.data' {.data section} - `.Ltext0' {.text section}
encrypt.c: /tmp/ccBe2hl6.s:5317: Error: can't resolve `.data' {.data section} - `.Ltext0' {.text section}
encrypt.c: /tmp/ccBe2hl6.s:5333: Error: can't resolve `.data' {.data section} - `.Ltext0' {.text section}
encrypt.c: /tmp/ccBe2hl6.s:5334: Error: can't resolve `.data' {.data section} - `.Ltext0' {.text section}
encrypt.c: /tmp/ccBe2hl6.s:5337: Error: can't resolve `.data' {.data section} - `.Ltext0' {.text section}
encrypt.c: /tmp/ccBe2hl6.s:5338: Error: can't resolve `.data' {.data section} - `.Ltext0' {.text section}
encrypt.c: /tmp/ccBe2hl6.s:5341: Error: can't resolve `.data' {.data section} - `.Ltext0' {.text section}
encrypt.c: /tmp/ccBe2hl6.s:5342: Error: can't resolve `.data' {.data section} - `.Ltext0' {.text section}
encrypt.c: /tmp/ccBe2hl6.s:5360: Error: can't resolve `.data' {.data section} - `.Ltext0' {.text section}
encrypt.c: /tmp/ccBe2hl6.s:5361: Error: can't resolve `.data' {.data section} - `.Ltext0' {.text section}
encrypt.c: /tmp/ccBe2hl6.s:5364: Error: can't resolve `.data' {.data section} - `.Ltext0' {.text section}
encrypt.c: /tmp/ccBe2hl6.s:5365: Error: can't resolve `.data' {.data section} - `.Ltext0' {.text section}
encrypt.c: ...
Number of similar (implementation,compiler) pairs: 1, namely:
Implementation | Compiler |
T:avx1 | gcc -march=native -mtune=native -O2 -fwrapv -fPIC -fPIE -gdwarf-4 -Wall (10.2.1_20210110) |
Compiler output
encrypt.c: /tmp/ccReahgq.s: Assembler messages:
encrypt.c: /tmp/ccReahgq.s:5268: Error: can't resolve `.data' {.data section} - `.Ltext0' {.text section}
encrypt.c: /tmp/ccReahgq.s:5269: Error: can't resolve `.data' {.data section} - `.Ltext0' {.text section}
encrypt.c: /tmp/ccReahgq.s:5272: Error: can't resolve `.data' {.data section} - `.Ltext0' {.text section}
encrypt.c: /tmp/ccReahgq.s:5273: Error: can't resolve `.data' {.data section} - `.Ltext0' {.text section}
encrypt.c: /tmp/ccReahgq.s:5289: Error: can't resolve `.data' {.data section} - `.Ltext0' {.text section}
encrypt.c: /tmp/ccReahgq.s:5290: Error: can't resolve `.data' {.data section} - `.Ltext0' {.text section}
encrypt.c: /tmp/ccReahgq.s:5293: Error: can't resolve `.data' {.data section} - `.Ltext0' {.text section}
encrypt.c: /tmp/ccReahgq.s:5294: Error: can't resolve `.data' {.data section} - `.Ltext0' {.text section}
encrypt.c: /tmp/ccReahgq.s:5297: Error: can't resolve `.data' {.data section} - `.Ltext0' {.text section}
encrypt.c: /tmp/ccReahgq.s:5298: Error: can't resolve `.data' {.data section} - `.Ltext0' {.text section}
encrypt.c: /tmp/ccReahgq.s:5312: Error: can't resolve `.data' {.data section} - `.Ltext0' {.text section}
encrypt.c: /tmp/ccReahgq.s:5313: Error: can't resolve `.data' {.data section} - `.Ltext0' {.text section}
encrypt.c: /tmp/ccReahgq.s:5316: Error: can't resolve `.data' {.data section} - `.Ltext0' {.text section}
encrypt.c: /tmp/ccReahgq.s:5317: Error: can't resolve `.data' {.data section} - `.Ltext0' {.text section}
encrypt.c: /tmp/ccReahgq.s:5333: Error: can't resolve `.data' {.data section} - `.Ltext0' {.text section}
encrypt.c: /tmp/ccReahgq.s:5334: Error: can't resolve `.data' {.data section} - `.Ltext0' {.text section}
encrypt.c: /tmp/ccReahgq.s:5337: Error: can't resolve `.data' {.data section} - `.Ltext0' {.text section}
encrypt.c: /tmp/ccReahgq.s:5338: Error: can't resolve `.data' {.data section} - `.Ltext0' {.text section}
encrypt.c: /tmp/ccReahgq.s:5341: Error: can't resolve `.data' {.data section} - `.Ltext0' {.text section}
encrypt.c: /tmp/ccReahgq.s:5342: Error: can't resolve `.data' {.data section} - `.Ltext0' {.text section}
encrypt.c: /tmp/ccReahgq.s:5360: Error: can't resolve `.data' {.data section} - `.Ltext0' {.text section}
encrypt.c: /tmp/ccReahgq.s:5361: Error: can't resolve `.data' {.data section} - `.Ltext0' {.text section}
encrypt.c: /tmp/ccReahgq.s:5364: Error: can't resolve `.data' {.data section} - `.Ltext0' {.text section}
encrypt.c: /tmp/ccReahgq.s:5365: Error: can't resolve `.data' {.data section} - `.Ltext0' {.text section}
encrypt.c: ...
Number of similar (implementation,compiler) pairs: 1, namely:
Implementation | Compiler |
T:avx1 | gcc -march=native -mtune=native -O3 -fwrapv -fPIC -fPIE -gdwarf-4 -Wall (10.2.1_20210110) |
Compiler output
encrypt.c: /tmp/cclx564E.s: Assembler messages:
encrypt.c: /tmp/cclx564E.s:5261: Error: can't resolve `.data' {.data section} - `.Ltext0' {.text section}
encrypt.c: /tmp/cclx564E.s:5262: Error: can't resolve `.data' {.data section} - `.Ltext0' {.text section}
encrypt.c: /tmp/cclx564E.s:5265: Error: can't resolve `.data' {.data section} - `.Ltext0' {.text section}
encrypt.c: /tmp/cclx564E.s:5266: Error: can't resolve `.data' {.data section} - `.Ltext0' {.text section}
encrypt.c: /tmp/cclx564E.s:5282: Error: can't resolve `.data' {.data section} - `.Ltext0' {.text section}
encrypt.c: /tmp/cclx564E.s:5283: Error: can't resolve `.data' {.data section} - `.Ltext0' {.text section}
encrypt.c: /tmp/cclx564E.s:5286: Error: can't resolve `.data' {.data section} - `.Ltext0' {.text section}
encrypt.c: /tmp/cclx564E.s:5287: Error: can't resolve `.data' {.data section} - `.Ltext0' {.text section}
encrypt.c: /tmp/cclx564E.s:5290: Error: can't resolve `.data' {.data section} - `.Ltext0' {.text section}
encrypt.c: /tmp/cclx564E.s:5291: Error: can't resolve `.data' {.data section} - `.Ltext0' {.text section}
encrypt.c: /tmp/cclx564E.s:5305: Error: can't resolve `.data' {.data section} - `.Ltext0' {.text section}
encrypt.c: /tmp/cclx564E.s:5306: Error: can't resolve `.data' {.data section} - `.Ltext0' {.text section}
encrypt.c: /tmp/cclx564E.s:5309: Error: can't resolve `.data' {.data section} - `.Ltext0' {.text section}
encrypt.c: /tmp/cclx564E.s:5310: Error: can't resolve `.data' {.data section} - `.Ltext0' {.text section}
encrypt.c: /tmp/cclx564E.s:5326: Error: can't resolve `.data' {.data section} - `.Ltext0' {.text section}
encrypt.c: /tmp/cclx564E.s:5327: Error: can't resolve `.data' {.data section} - `.Ltext0' {.text section}
encrypt.c: /tmp/cclx564E.s:5330: Error: can't resolve `.data' {.data section} - `.Ltext0' {.text section}
encrypt.c: /tmp/cclx564E.s:5331: Error: can't resolve `.data' {.data section} - `.Ltext0' {.text section}
encrypt.c: /tmp/cclx564E.s:5334: Error: can't resolve `.data' {.data section} - `.Ltext0' {.text section}
encrypt.c: /tmp/cclx564E.s:5335: Error: can't resolve `.data' {.data section} - `.Ltext0' {.text section}
encrypt.c: /tmp/cclx564E.s:5353: Error: can't resolve `.data' {.data section} - `.Ltext0' {.text section}
encrypt.c: /tmp/cclx564E.s:5354: Error: can't resolve `.data' {.data section} - `.Ltext0' {.text section}
encrypt.c: /tmp/cclx564E.s:5357: Error: can't resolve `.data' {.data section} - `.Ltext0' {.text section}
encrypt.c: /tmp/cclx564E.s:5358: Error: can't resolve `.data' {.data section} - `.Ltext0' {.text section}
encrypt.c: ...
Number of similar (implementation,compiler) pairs: 1, namely:
Implementation | Compiler |
T:avx1 | gcc -march=native -mtune=native -O -fwrapv -fPIC -fPIE -gdwarf-4 -Wall (10.2.1_20210110) |
Compiler output
encrypt.c: /tmp/ccxBo2Rj.s: Assembler messages:
encrypt.c: /tmp/ccxBo2Rj.s:5270: Error: can't resolve `.data' {.data section} - `.Ltext0' {.text section}
encrypt.c: /tmp/ccxBo2Rj.s:5271: Error: can't resolve `.data' {.data section} - `.Ltext0' {.text section}
encrypt.c: /tmp/ccxBo2Rj.s:5274: Error: can't resolve `.data' {.data section} - `.Ltext0' {.text section}
encrypt.c: /tmp/ccxBo2Rj.s:5275: Error: can't resolve `.data' {.data section} - `.Ltext0' {.text section}
encrypt.c: /tmp/ccxBo2Rj.s:5291: Error: can't resolve `.data' {.data section} - `.Ltext0' {.text section}
encrypt.c: /tmp/ccxBo2Rj.s:5292: Error: can't resolve `.data' {.data section} - `.Ltext0' {.text section}
encrypt.c: /tmp/ccxBo2Rj.s:5295: Error: can't resolve `.data' {.data section} - `.Ltext0' {.text section}
encrypt.c: /tmp/ccxBo2Rj.s:5296: Error: can't resolve `.data' {.data section} - `.Ltext0' {.text section}
encrypt.c: /tmp/ccxBo2Rj.s:5299: Error: can't resolve `.data' {.data section} - `.Ltext0' {.text section}
encrypt.c: /tmp/ccxBo2Rj.s:5300: Error: can't resolve `.data' {.data section} - `.Ltext0' {.text section}
encrypt.c: /tmp/ccxBo2Rj.s:5314: Error: can't resolve `.data' {.data section} - `.Ltext0' {.text section}
encrypt.c: /tmp/ccxBo2Rj.s:5315: Error: can't resolve `.data' {.data section} - `.Ltext0' {.text section}
encrypt.c: /tmp/ccxBo2Rj.s:5318: Error: can't resolve `.data' {.data section} - `.Ltext0' {.text section}
encrypt.c: /tmp/ccxBo2Rj.s:5319: Error: can't resolve `.data' {.data section} - `.Ltext0' {.text section}
encrypt.c: /tmp/ccxBo2Rj.s:5335: Error: can't resolve `.data' {.data section} - `.Ltext0' {.text section}
encrypt.c: /tmp/ccxBo2Rj.s:5336: Error: can't resolve `.data' {.data section} - `.Ltext0' {.text section}
encrypt.c: /tmp/ccxBo2Rj.s:5339: Error: can't resolve `.data' {.data section} - `.Ltext0' {.text section}
encrypt.c: /tmp/ccxBo2Rj.s:5340: Error: can't resolve `.data' {.data section} - `.Ltext0' {.text section}
encrypt.c: /tmp/ccxBo2Rj.s:5343: Error: can't resolve `.data' {.data section} - `.Ltext0' {.text section}
encrypt.c: /tmp/ccxBo2Rj.s:5344: Error: can't resolve `.data' {.data section} - `.Ltext0' {.text section}
encrypt.c: /tmp/ccxBo2Rj.s:5362: Error: can't resolve `.data' {.data section} - `.Ltext0' {.text section}
encrypt.c: /tmp/ccxBo2Rj.s:5363: Error: can't resolve `.data' {.data section} - `.Ltext0' {.text section}
encrypt.c: /tmp/ccxBo2Rj.s:5366: Error: can't resolve `.data' {.data section} - `.Ltext0' {.text section}
encrypt.c: /tmp/ccxBo2Rj.s:5367: Error: can't resolve `.data' {.data section} - `.Ltext0' {.text section}
encrypt.c: ...
Number of similar (implementation,compiler) pairs: 1, namely:
Implementation | Compiler |
T:avx1 | gcc -march=native -mtune=native -Os -fwrapv -fPIC -fPIE -gdwarf-4 -Wall (10.2.1_20210110) |
Compiler output
try.c: /usr/bin/ld: libcrypto_aead_omdsha256k256n104tau160v1.a(omdsha256.o):.../supercop-data/hydra4/amd64/try/c/clang_-march=native_-O2_-fwrapv_-Qunused-arguments_-fPIC_-fPIE_-gdwarf-4_-Wall/timingleaks/crypto_aead/omdsha256k256n104tau160v1/sse4/work/./omdsha256.h:137: multiple definition of `Hash'; libcrypto_aead_omdsha256k256n104tau160v1.a(encrypt.o):.../supercop-data/hydra4/amd64/try/c/clang_-march=native_-O2_-fwrapv_-Qunused-arguments_-fPIC_-fPIE_-gdwarf-4_-Wall/timingleaks/crypto_aead/omdsha256k256n104tau160v1/sse4/work/./omdsha256.h:137: first defined here
try.c: clang: error: linker command failed with exit code 1 (use -v to see invocation)
Number of similar (implementation,compiler) pairs: 1, namely:
Implementation | Compiler |
T:sse4 | clang -march=native -O2 -fwrapv -Qunused-arguments -fPIC -fPIE -gdwarf-4 -Wall (Debian_Clang_11.0.1) |
Compiler output
try.c: /usr/bin/ld: libcrypto_aead_omdsha256k256n104tau160v1.a(omdsha256.o):.../supercop-data/hydra4/amd64/try/c/clang_-march=native_-O3_-fwrapv_-Qunused-arguments_-fPIC_-fPIE_-gdwarf-4_-Wall/timingleaks/crypto_aead/omdsha256k256n104tau160v1/sse4/work/./omdsha256.h:137: multiple definition of `Hash'; libcrypto_aead_omdsha256k256n104tau160v1.a(encrypt.o):.../supercop-data/hydra4/amd64/try/c/clang_-march=native_-O3_-fwrapv_-Qunused-arguments_-fPIC_-fPIE_-gdwarf-4_-Wall/timingleaks/crypto_aead/omdsha256k256n104tau160v1/sse4/work/./omdsha256.h:137: first defined here
try.c: clang: error: linker command failed with exit code 1 (use -v to see invocation)
Number of similar (implementation,compiler) pairs: 1, namely:
Implementation | Compiler |
T:sse4 | clang -march=native -O3 -fwrapv -Qunused-arguments -fPIC -fPIE -gdwarf-4 -Wall (Debian_Clang_11.0.1) |
Compiler output
try.c: /usr/bin/ld: libcrypto_aead_omdsha256k256n104tau160v1.a(omdsha256.o):.../supercop-data/hydra4/amd64/try/c/clang_-march=native_-O_-fwrapv_-Qunused-arguments_-fPIC_-fPIE_-gdwarf-4_-Wall/timingleaks/crypto_aead/omdsha256k256n104tau160v1/sse4/work/./omdsha256.h:137: multiple definition of `Hash'; libcrypto_aead_omdsha256k256n104tau160v1.a(encrypt.o):.../supercop-data/hydra4/amd64/try/c/clang_-march=native_-O_-fwrapv_-Qunused-arguments_-fPIC_-fPIE_-gdwarf-4_-Wall/timingleaks/crypto_aead/omdsha256k256n104tau160v1/sse4/work/./omdsha256.h:137: first defined here
try.c: clang: error: linker command failed with exit code 1 (use -v to see invocation)
Number of similar (implementation,compiler) pairs: 1, namely:
Implementation | Compiler |
T:sse4 | clang -march=native -O -fwrapv -Qunused-arguments -fPIC -fPIE -gdwarf-4 -Wall (Debian_Clang_11.0.1) |
Compiler output
try.c: /usr/bin/ld: libcrypto_aead_omdsha256k256n104tau160v1.a(omdsha256.o):.../supercop-data/hydra4/amd64/try/c/clang_-march=native_-Os_-fwrapv_-Qunused-arguments_-fPIC_-fPIE_-gdwarf-4_-Wall/timingleaks/crypto_aead/omdsha256k256n104tau160v1/sse4/work/./omdsha256.h:137: multiple definition of `Hash'; libcrypto_aead_omdsha256k256n104tau160v1.a(encrypt.o):.../supercop-data/hydra4/amd64/try/c/clang_-march=native_-Os_-fwrapv_-Qunused-arguments_-fPIC_-fPIE_-gdwarf-4_-Wall/timingleaks/crypto_aead/omdsha256k256n104tau160v1/sse4/work/./omdsha256.h:137: first defined here
try.c: clang: error: linker command failed with exit code 1 (use -v to see invocation)
Number of similar (implementation,compiler) pairs: 1, namely:
Implementation | Compiler |
T:sse4 | clang -march=native -Os -fwrapv -Qunused-arguments -fPIC -fPIE -gdwarf-4 -Wall (Debian_Clang_11.0.1) |
Compiler output
try.c: /usr/bin/ld: libcrypto_aead_omdsha256k256n104tau160v1.a(omdsha256.o):.../supercop-data/hydra4/amd64/try/c/clang_-mcpu=native_-O3_-fwrapv_-Qunused-arguments_-fPIC_-fPIE_-gdwarf-4_-Wall/timingleaks/crypto_aead/omdsha256k256n104tau160v1/sse4/work/./omdsha256.h:137: multiple definition of `Hash'; libcrypto_aead_omdsha256k256n104tau160v1.a(encrypt.o):.../supercop-data/hydra4/amd64/try/c/clang_-mcpu=native_-O3_-fwrapv_-Qunused-arguments_-fPIC_-fPIE_-gdwarf-4_-Wall/timingleaks/crypto_aead/omdsha256k256n104tau160v1/sse4/work/./omdsha256.h:137: first defined here
try.c: clang: error: linker command failed with exit code 1 (use -v to see invocation)
Number of similar (implementation,compiler) pairs: 1, namely:
Implementation | Compiler |
T:sse4 | clang -mcpu=native -O3 -fwrapv -Qunused-arguments -fPIC -fPIE -gdwarf-4 -Wall (Debian_Clang_11.0.1) |
Compiler output
encrypt.c: /tmp/ccy1dPyd.s: Assembler messages:
encrypt.c: /tmp/ccy1dPyd.s:5307: Error: can't resolve `.data' {.data section} - `.Ltext0' {.text section}
encrypt.c: /tmp/ccy1dPyd.s:5308: Error: can't resolve `.data' {.data section} - `.Ltext0' {.text section}
encrypt.c: /tmp/ccy1dPyd.s:5311: Error: can't resolve `.data' {.data section} - `.Ltext0' {.text section}
encrypt.c: /tmp/ccy1dPyd.s:5312: Error: can't resolve `.data' {.data section} - `.Ltext0' {.text section}
encrypt.c: /tmp/ccy1dPyd.s:5328: Error: can't resolve `.data' {.data section} - `.Ltext0' {.text section}
encrypt.c: /tmp/ccy1dPyd.s:5329: Error: can't resolve `.data' {.data section} - `.Ltext0' {.text section}
encrypt.c: /tmp/ccy1dPyd.s:5332: Error: can't resolve `.data' {.data section} - `.Ltext0' {.text section}
encrypt.c: /tmp/ccy1dPyd.s:5333: Error: can't resolve `.data' {.data section} - `.Ltext0' {.text section}
encrypt.c: /tmp/ccy1dPyd.s:5336: Error: can't resolve `.data' {.data section} - `.Ltext0' {.text section}
encrypt.c: /tmp/ccy1dPyd.s:5337: Error: can't resolve `.data' {.data section} - `.Ltext0' {.text section}
encrypt.c: /tmp/ccy1dPyd.s:5351: Error: can't resolve `.data' {.data section} - `.Ltext0' {.text section}
encrypt.c: /tmp/ccy1dPyd.s:5352: Error: can't resolve `.data' {.data section} - `.Ltext0' {.text section}
encrypt.c: /tmp/ccy1dPyd.s:5355: Error: can't resolve `.data' {.data section} - `.Ltext0' {.text section}
encrypt.c: /tmp/ccy1dPyd.s:5356: Error: can't resolve `.data' {.data section} - `.Ltext0' {.text section}
encrypt.c: /tmp/ccy1dPyd.s:5372: Error: can't resolve `.data' {.data section} - `.Ltext0' {.text section}
encrypt.c: /tmp/ccy1dPyd.s:5373: Error: can't resolve `.data' {.data section} - `.Ltext0' {.text section}
encrypt.c: /tmp/ccy1dPyd.s:5376: Error: can't resolve `.data' {.data section} - `.Ltext0' {.text section}
encrypt.c: /tmp/ccy1dPyd.s:5377: Error: can't resolve `.data' {.data section} - `.Ltext0' {.text section}
encrypt.c: /tmp/ccy1dPyd.s:5380: Error: can't resolve `.data' {.data section} - `.Ltext0' {.text section}
encrypt.c: /tmp/ccy1dPyd.s:5381: Error: can't resolve `.data' {.data section} - `.Ltext0' {.text section}
encrypt.c: /tmp/ccy1dPyd.s:5399: Error: can't resolve `.data' {.data section} - `.Ltext0' {.text section}
encrypt.c: /tmp/ccy1dPyd.s:5400: Error: can't resolve `.data' {.data section} - `.Ltext0' {.text section}
encrypt.c: /tmp/ccy1dPyd.s:5403: Error: can't resolve `.data' {.data section} - `.Ltext0' {.text section}
encrypt.c: /tmp/ccy1dPyd.s:5404: Error: can't resolve `.data' {.data section} - `.Ltext0' {.text section}
encrypt.c: ...
Number of similar (implementation,compiler) pairs: 1, namely:
Implementation | Compiler |
T:sse4 | gcc -march=native -mtune=native -O2 -fwrapv -fPIC -fPIE -gdwarf-4 -Wall (10.2.1_20210110) |
Compiler output
encrypt.c: /tmp/ccdESHtp.s: Assembler messages:
encrypt.c: /tmp/ccdESHtp.s:5307: Error: can't resolve `.data' {.data section} - `.Ltext0' {.text section}
encrypt.c: /tmp/ccdESHtp.s:5308: Error: can't resolve `.data' {.data section} - `.Ltext0' {.text section}
encrypt.c: /tmp/ccdESHtp.s:5311: Error: can't resolve `.data' {.data section} - `.Ltext0' {.text section}
encrypt.c: /tmp/ccdESHtp.s:5312: Error: can't resolve `.data' {.data section} - `.Ltext0' {.text section}
encrypt.c: /tmp/ccdESHtp.s:5328: Error: can't resolve `.data' {.data section} - `.Ltext0' {.text section}
encrypt.c: /tmp/ccdESHtp.s:5329: Error: can't resolve `.data' {.data section} - `.Ltext0' {.text section}
encrypt.c: /tmp/ccdESHtp.s:5332: Error: can't resolve `.data' {.data section} - `.Ltext0' {.text section}
encrypt.c: /tmp/ccdESHtp.s:5333: Error: can't resolve `.data' {.data section} - `.Ltext0' {.text section}
encrypt.c: /tmp/ccdESHtp.s:5336: Error: can't resolve `.data' {.data section} - `.Ltext0' {.text section}
encrypt.c: /tmp/ccdESHtp.s:5337: Error: can't resolve `.data' {.data section} - `.Ltext0' {.text section}
encrypt.c: /tmp/ccdESHtp.s:5351: Error: can't resolve `.data' {.data section} - `.Ltext0' {.text section}
encrypt.c: /tmp/ccdESHtp.s:5352: Error: can't resolve `.data' {.data section} - `.Ltext0' {.text section}
encrypt.c: /tmp/ccdESHtp.s:5355: Error: can't resolve `.data' {.data section} - `.Ltext0' {.text section}
encrypt.c: /tmp/ccdESHtp.s:5356: Error: can't resolve `.data' {.data section} - `.Ltext0' {.text section}
encrypt.c: /tmp/ccdESHtp.s:5372: Error: can't resolve `.data' {.data section} - `.Ltext0' {.text section}
encrypt.c: /tmp/ccdESHtp.s:5373: Error: can't resolve `.data' {.data section} - `.Ltext0' {.text section}
encrypt.c: /tmp/ccdESHtp.s:5376: Error: can't resolve `.data' {.data section} - `.Ltext0' {.text section}
encrypt.c: /tmp/ccdESHtp.s:5377: Error: can't resolve `.data' {.data section} - `.Ltext0' {.text section}
encrypt.c: /tmp/ccdESHtp.s:5380: Error: can't resolve `.data' {.data section} - `.Ltext0' {.text section}
encrypt.c: /tmp/ccdESHtp.s:5381: Error: can't resolve `.data' {.data section} - `.Ltext0' {.text section}
encrypt.c: /tmp/ccdESHtp.s:5399: Error: can't resolve `.data' {.data section} - `.Ltext0' {.text section}
encrypt.c: /tmp/ccdESHtp.s:5400: Error: can't resolve `.data' {.data section} - `.Ltext0' {.text section}
encrypt.c: /tmp/ccdESHtp.s:5403: Error: can't resolve `.data' {.data section} - `.Ltext0' {.text section}
encrypt.c: /tmp/ccdESHtp.s:5404: Error: can't resolve `.data' {.data section} - `.Ltext0' {.text section}
encrypt.c: ...
Number of similar (implementation,compiler) pairs: 1, namely:
Implementation | Compiler |
T:sse4 | gcc -march=native -mtune=native -O3 -fwrapv -fPIC -fPIE -gdwarf-4 -Wall (10.2.1_20210110) |
Compiler output
encrypt.c: /tmp/cc1FftG8.s: Assembler messages:
encrypt.c: /tmp/cc1FftG8.s:5300: Error: can't resolve `.data' {.data section} - `.Ltext0' {.text section}
encrypt.c: /tmp/cc1FftG8.s:5301: Error: can't resolve `.data' {.data section} - `.Ltext0' {.text section}
encrypt.c: /tmp/cc1FftG8.s:5304: Error: can't resolve `.data' {.data section} - `.Ltext0' {.text section}
encrypt.c: /tmp/cc1FftG8.s:5305: Error: can't resolve `.data' {.data section} - `.Ltext0' {.text section}
encrypt.c: /tmp/cc1FftG8.s:5321: Error: can't resolve `.data' {.data section} - `.Ltext0' {.text section}
encrypt.c: /tmp/cc1FftG8.s:5322: Error: can't resolve `.data' {.data section} - `.Ltext0' {.text section}
encrypt.c: /tmp/cc1FftG8.s:5325: Error: can't resolve `.data' {.data section} - `.Ltext0' {.text section}
encrypt.c: /tmp/cc1FftG8.s:5326: Error: can't resolve `.data' {.data section} - `.Ltext0' {.text section}
encrypt.c: /tmp/cc1FftG8.s:5329: Error: can't resolve `.data' {.data section} - `.Ltext0' {.text section}
encrypt.c: /tmp/cc1FftG8.s:5330: Error: can't resolve `.data' {.data section} - `.Ltext0' {.text section}
encrypt.c: /tmp/cc1FftG8.s:5344: Error: can't resolve `.data' {.data section} - `.Ltext0' {.text section}
encrypt.c: /tmp/cc1FftG8.s:5345: Error: can't resolve `.data' {.data section} - `.Ltext0' {.text section}
encrypt.c: /tmp/cc1FftG8.s:5348: Error: can't resolve `.data' {.data section} - `.Ltext0' {.text section}
encrypt.c: /tmp/cc1FftG8.s:5349: Error: can't resolve `.data' {.data section} - `.Ltext0' {.text section}
encrypt.c: /tmp/cc1FftG8.s:5365: Error: can't resolve `.data' {.data section} - `.Ltext0' {.text section}
encrypt.c: /tmp/cc1FftG8.s:5366: Error: can't resolve `.data' {.data section} - `.Ltext0' {.text section}
encrypt.c: /tmp/cc1FftG8.s:5369: Error: can't resolve `.data' {.data section} - `.Ltext0' {.text section}
encrypt.c: /tmp/cc1FftG8.s:5370: Error: can't resolve `.data' {.data section} - `.Ltext0' {.text section}
encrypt.c: /tmp/cc1FftG8.s:5373: Error: can't resolve `.data' {.data section} - `.Ltext0' {.text section}
encrypt.c: /tmp/cc1FftG8.s:5374: Error: can't resolve `.data' {.data section} - `.Ltext0' {.text section}
encrypt.c: /tmp/cc1FftG8.s:5392: Error: can't resolve `.data' {.data section} - `.Ltext0' {.text section}
encrypt.c: /tmp/cc1FftG8.s:5393: Error: can't resolve `.data' {.data section} - `.Ltext0' {.text section}
encrypt.c: /tmp/cc1FftG8.s:5396: Error: can't resolve `.data' {.data section} - `.Ltext0' {.text section}
encrypt.c: /tmp/cc1FftG8.s:5397: Error: can't resolve `.data' {.data section} - `.Ltext0' {.text section}
encrypt.c: ...
Number of similar (implementation,compiler) pairs: 1, namely:
Implementation | Compiler |
T:sse4 | gcc -march=native -mtune=native -O -fwrapv -fPIC -fPIE -gdwarf-4 -Wall (10.2.1_20210110) |
Compiler output
encrypt.c: /tmp/ccCnLtyk.s: Assembler messages:
encrypt.c: /tmp/ccCnLtyk.s:5309: Error: can't resolve `.data' {.data section} - `.Ltext0' {.text section}
encrypt.c: /tmp/ccCnLtyk.s:5310: Error: can't resolve `.data' {.data section} - `.Ltext0' {.text section}
encrypt.c: /tmp/ccCnLtyk.s:5313: Error: can't resolve `.data' {.data section} - `.Ltext0' {.text section}
encrypt.c: /tmp/ccCnLtyk.s:5314: Error: can't resolve `.data' {.data section} - `.Ltext0' {.text section}
encrypt.c: /tmp/ccCnLtyk.s:5330: Error: can't resolve `.data' {.data section} - `.Ltext0' {.text section}
encrypt.c: /tmp/ccCnLtyk.s:5331: Error: can't resolve `.data' {.data section} - `.Ltext0' {.text section}
encrypt.c: /tmp/ccCnLtyk.s:5334: Error: can't resolve `.data' {.data section} - `.Ltext0' {.text section}
encrypt.c: /tmp/ccCnLtyk.s:5335: Error: can't resolve `.data' {.data section} - `.Ltext0' {.text section}
encrypt.c: /tmp/ccCnLtyk.s:5338: Error: can't resolve `.data' {.data section} - `.Ltext0' {.text section}
encrypt.c: /tmp/ccCnLtyk.s:5339: Error: can't resolve `.data' {.data section} - `.Ltext0' {.text section}
encrypt.c: /tmp/ccCnLtyk.s:5353: Error: can't resolve `.data' {.data section} - `.Ltext0' {.text section}
encrypt.c: /tmp/ccCnLtyk.s:5354: Error: can't resolve `.data' {.data section} - `.Ltext0' {.text section}
encrypt.c: /tmp/ccCnLtyk.s:5357: Error: can't resolve `.data' {.data section} - `.Ltext0' {.text section}
encrypt.c: /tmp/ccCnLtyk.s:5358: Error: can't resolve `.data' {.data section} - `.Ltext0' {.text section}
encrypt.c: /tmp/ccCnLtyk.s:5374: Error: can't resolve `.data' {.data section} - `.Ltext0' {.text section}
encrypt.c: /tmp/ccCnLtyk.s:5375: Error: can't resolve `.data' {.data section} - `.Ltext0' {.text section}
encrypt.c: /tmp/ccCnLtyk.s:5378: Error: can't resolve `.data' {.data section} - `.Ltext0' {.text section}
encrypt.c: /tmp/ccCnLtyk.s:5379: Error: can't resolve `.data' {.data section} - `.Ltext0' {.text section}
encrypt.c: /tmp/ccCnLtyk.s:5382: Error: can't resolve `.data' {.data section} - `.Ltext0' {.text section}
encrypt.c: /tmp/ccCnLtyk.s:5383: Error: can't resolve `.data' {.data section} - `.Ltext0' {.text section}
encrypt.c: /tmp/ccCnLtyk.s:5401: Error: can't resolve `.data' {.data section} - `.Ltext0' {.text section}
encrypt.c: /tmp/ccCnLtyk.s:5402: Error: can't resolve `.data' {.data section} - `.Ltext0' {.text section}
encrypt.c: /tmp/ccCnLtyk.s:5405: Error: can't resolve `.data' {.data section} - `.Ltext0' {.text section}
encrypt.c: /tmp/ccCnLtyk.s:5406: Error: can't resolve `.data' {.data section} - `.Ltext0' {.text section}
encrypt.c: ...
Number of similar (implementation,compiler) pairs: 1, namely:
Implementation | Compiler |
T:sse4 | gcc -march=native -mtune=native -Os -fwrapv -fPIC -fPIE -gdwarf-4 -Wall (10.2.1_20210110) |
Namespace violations
omdsha256.o calc_L_i T
omdsha256.o double_block T
omdsha256.o final_masking_associated_data T
omdsha256.o final_masking_message T
omdsha256.o hash T
omdsha256.o increment_masking_associated_data T
omdsha256.o increment_masking_message T
omdsha256.o key_func T
omdsha256.o l2b T
omdsha256.o ntz T
omdsha256.o omdsha256_process T
omdsha256.o triple_block T
omdsha256.o xor_block T
sha256.o sha256_comp T
Number of similar (implementation,compiler) pairs: 9, namely:
Implementation | Compiler |
T:ref | clang -march=native -O2 -fwrapv -Qunused-arguments -fPIC -fPIE -gdwarf-4 -Wall (Debian_Clang_11.0.1) |
T:ref | clang -march=native -O3 -fwrapv -Qunused-arguments -fPIC -fPIE -gdwarf-4 -Wall (Debian_Clang_11.0.1) |
T:ref | clang -march=native -O -fwrapv -Qunused-arguments -fPIC -fPIE -gdwarf-4 -Wall (Debian_Clang_11.0.1) |
T:ref | clang -march=native -Os -fwrapv -Qunused-arguments -fPIC -fPIE -gdwarf-4 -Wall (Debian_Clang_11.0.1) |
T:ref | clang -mcpu=native -O3 -fwrapv -Qunused-arguments -fPIC -fPIE -gdwarf-4 -Wall (Debian_Clang_11.0.1) |
T:ref | gcc -march=native -mtune=native -O2 -fwrapv -fPIC -fPIE -gdwarf-4 -Wall (10.2.1_20210110) |
T:ref | gcc -march=native -mtune=native -O3 -fwrapv -fPIC -fPIE -gdwarf-4 -Wall (10.2.1_20210110) |
T:ref | gcc -march=native -mtune=native -O -fwrapv -fPIC -fPIE -gdwarf-4 -Wall (10.2.1_20210110) |
T:ref | gcc -march=native -mtune=native -Os -fwrapv -fPIC -fPIE -gdwarf-4 -Wall (10.2.1_20210110) |