Test results for amd64, hunsnivy, crypto_hashblocks/sha512

[Page version: 20261005 16:07:32]

Measurements for amd64, hunsnivy, crypto_hashblocks Test results for amd64, hunsnivy, crypto_hashblocks Test results for crypto_hashblocks/sha512
Computer: hunsnivy
Microarchitecture: amd64; Ivy Bridge+AES (306a9)
Architecture: amd64
CPU ID: GenuineIntel-000306a9-bfebfbff
SUPERCOP version: 20261004
Operation: crypto_hashblocks
Primitive: sha512
TimeObject sizeTest sizeImplementationCompilerBenchmark dateSUPERCOP version
146014818 0 028075 1256 1496compactclang -march=native -O2 -fwrapv -Qunused-arguments -fPIC -fPIE -gdwarf-4 -Wall2026090420260831
148594946 0 027683 1256 1496compactclang -mcpu=native -O3 -fwrapv -Qunused-arguments -fPIC -fPIE -gdwarf-4 -Wall2026090420260831
149174466 0 024611 1256 1496compactclang -march=native -O -fwrapv -Qunused-arguments -fPIC -fPIE -gdwarf-4 -Wall2026090420260831
152365122 0 027915 1256 1496compactclang -march=native -O3 -fwrapv -Qunused-arguments -fPIC -fPIE -gdwarf-4 -Wall2026090420260831
1525017393 0 037515 1256 1496inplaceclang -march=native -O -fwrapv -Qunused-arguments -fPIC -fPIE -gdwarf-4 -Wall2026090420260831
1525717393 0 040147 1256 1496inplaceclang -march=native -O3 -fwrapv -Qunused-arguments -fPIC -fPIE -gdwarf-4 -Wall2026090420260831
152714880 0 027159 1216 1592compactgcc -march=native -mtune=native -O3 -fwrapv -fPIC -fPIE -gdwarf-4 -Wall2026090420260831
153223541 0 023125 1248 1496wflipclang -march=native -Os -fwrapv -Qunused-arguments -fPIC -fPIE -gdwarf-4 -Wall2026090420260831
1532617404 0 037547 1256 1496refclang -march=native -O -fwrapv -Qunused-arguments -fPIC -fPIE -gdwarf-4 -Wall2026090420260831
1534317404 0 040659 1256 1496refclang -march=native -O2 -fwrapv -Qunused-arguments -fPIC -fPIE -gdwarf-4 -Wall2026090420260831
1536817404 0 040179 1256 1496refclang -march=native -O3 -fwrapv -Qunused-arguments -fPIC -fPIE -gdwarf-4 -Wall2026090420260831
1540417393 0 040627 1256 1496inplaceclang -march=native -O2 -fwrapv -Qunused-arguments -fPIC -fPIE -gdwarf-4 -Wall2026090420260831
1547617514 0 037101 1248 1496inplaceclang -march=native -Os -fwrapv -Qunused-arguments -fPIC -fPIE -gdwarf-4 -Wall2026090420260831
154763842 0 026539 1256 1496wflipclang -mcpu=native -O3 -fwrapv -Qunused-arguments -fPIC -fPIE -gdwarf-4 -Wall2026090420260831
154863593 0 023723 1256 1496wflipclang -march=native -O -fwrapv -Qunused-arguments -fPIC -fPIE -gdwarf-4 -Wall2026090420260831
1549717602 0 037197 1248 1496refclang -march=native -Os -fwrapv -Qunused-arguments -fPIC -fPIE -gdwarf-4 -Wall2026090420260831
155313930 0 026675 1256 1496wflipclang -march=native -O3 -fwrapv -Qunused-arguments -fPIC -fPIE -gdwarf-4 -Wall2026090420260831
155323930 0 027155 1256 1496wflipclang -march=native -O2 -fwrapv -Qunused-arguments -fPIC -fPIE -gdwarf-4 -Wall2026090420260831
155484393 0 024967 1216 1592compactgcc -march=native -mtune=native -O2 -fwrapv -fPIC -fPIE -gdwarf-4 -Wall2026090420260831
159523598 0 024103 1216 1592wflipgcc -march=native -mtune=native -O2 -fwrapv -fPIC -fPIE -gdwarf-4 -Wall2026090420260831
159684461 0 024069 1248 1496compactclang -march=native -Os -fwrapv -Qunused-arguments -fPIC -fPIE -gdwarf-4 -Wall2026090420260831
159683469 0 025703 1216 1592wflipgcc -march=native -mtune=native -O3 -fwrapv -fPIC -fPIE -gdwarf-4 -Wall2026090420260831
1598216593 0 039307 1256 1496inplaceclang -mcpu=native -O3 -fwrapv -Qunused-arguments -fPIC -fPIE -gdwarf-4 -Wall2026090420260831
1599116604 0 039307 1256 1496refclang -mcpu=native -O3 -fwrapv -Qunused-arguments -fPIC -fPIE -gdwarf-4 -Wall2026090420260831
1599216600 0 035533 1192 1560inplacegcc -march=native -mtune=native -Os -fwrapv -fPIC -fPIE -gdwarf-4 -Wall2026090420260831
160314383 0 023325 1192 1560compactgcc -march=native -mtune=native -Os -fwrapv -fPIC -fPIE -gdwarf-4 -Wall2026090420260831
1609916607 0 035533 1192 1560refgcc -march=native -mtune=native -Os -fwrapv -fPIC -fPIE -gdwarf-4 -Wall2026090420260831
1627016342 0 038575 1216 1592refgcc -march=native -mtune=native -O3 -fwrapv -fPIC -fPIE -gdwarf-4 -Wall2026090420260831
163894512 0 024806 1208 1592compactgcc -march=native -mtune=native -O -fwrapv -fPIC -fPIE -gdwarf-4 -Wall2026090420260831
164763760 0 022661 1192 1560wflipgcc -march=native -mtune=native -Os -fwrapv -fPIC -fPIE -gdwarf-4 -Wall2026090420260831
1654416504 0 038767 1216 1592inplacegcc -march=native -mtune=native -O3 -fwrapv -fPIC -fPIE -gdwarf-4 -Wall2026090420260831
165605281 0 025462 1208 1592wflipgcc -march=native -mtune=native -O -fwrapv -fPIC -fPIE -gdwarf-4 -Wall2026090420260831
1689916532 0 037047 1216 1592refgcc -march=native -mtune=native -O2 -fwrapv -fPIC -fPIE -gdwarf-4 -Wall2026090420260831
170271981 0 024691 1256 1496compact4clang -mcpu=native -O3 -fwrapv -Qunused-arguments -fPIC -fPIE -gdwarf-4 -Wall2026090420260831
1711116688 0 037239 1216 1592inplacegcc -march=native -mtune=native -O2 -fwrapv -fPIC -fPIE -gdwarf-4 -Wall2026090420260831
171931613 0 024859 1256 1496compact4clang -march=native -O2 -fwrapv -Qunused-arguments -fPIC -fPIE -gdwarf-4 -Wall2026090420260831
172091992 0 024763 1256 1496compact4clang -march=native -O3 -fwrapv -Qunused-arguments -fPIC -fPIE -gdwarf-4 -Wall2026090420260831
174241935 0 024191 1216 1592compact4gcc -march=native -mtune=native -O3 -fwrapv -fPIC -fPIE -gdwarf-4 -Wall2026090420260831
1781016760 0 037014 1208 1592inplacegcc -march=native -mtune=native -O -fwrapv -fPIC -fPIE -gdwarf-4 -Wall2026090420260831
1790116836 0 037046 1208 1592refgcc -march=native -mtune=native -O -fwrapv -fPIC -fPIE -gdwarf-4 -Wall2026090420260831
180351357 0 020949 1248 1496compact4clang -march=native -Os -fwrapv -Qunused-arguments -fPIC -fPIE -gdwarf-4 -Wall2026090420260831
181171502 0 022071 1216 1592compact4gcc -march=native -mtune=native -O2 -fwrapv -fPIC -fPIE -gdwarf-4 -Wall2026090420260831
185841307 0 020237 1192 1560compact4gcc -march=native -mtune=native -Os -fwrapv -fPIC -fPIE -gdwarf-4 -Wall2026090420260831
188631263 0 021395 1256 1496compact4clang -march=native -O -fwrapv -Qunused-arguments -fPIC -fPIE -gdwarf-4 -Wall2026090420260831
213651483 0 021750 1208 1592compact4gcc -march=native -mtune=native -O -fwrapv -fPIC -fPIE -gdwarf-4 -Wall2026090420260831
249733271 0 025971 1256 1496compact2clang -mcpu=native -O3 -fwrapv -Qunused-arguments -fPIC -fPIE -gdwarf-4 -Wall2026090420260831
250033405 0 026171 1256 1496compact2clang -march=native -O3 -fwrapv -Qunused-arguments -fPIC -fPIE -gdwarf-4 -Wall2026090420260831
250812241 0 025491 1256 1496compact2clang -march=native -O2 -fwrapv -Qunused-arguments -fPIC -fPIE -gdwarf-4 -Wall2026090420260831
252191873 0 022027 1256 1496compact2clang -march=native -O -fwrapv -Qunused-arguments -fPIC -fPIE -gdwarf-4 -Wall2026090420260831
258371982 0 024691 1256 1496compact3clang -mcpu=native -O3 -fwrapv -Qunused-arguments -fPIC -fPIE -gdwarf-4 -Wall2026090420260831
258401641 0 024891 1256 1496compact3clang -march=native -O2 -fwrapv -Qunused-arguments -fPIC -fPIE -gdwarf-4 -Wall2026090420260831
259011525 0 021133 1248 1496compact2clang -march=native -Os -fwrapv -Qunused-arguments -fPIC -fPIE -gdwarf-4 -Wall2026090420260831
259061343 0 021491 1256 1496compact3clang -march=native -O -fwrapv -Qunused-arguments -fPIC -fPIE -gdwarf-4 -Wall2026090420260831
259701993 0 024763 1256 1496compact3clang -march=native -O3 -fwrapv -Qunused-arguments -fPIC -fPIE -gdwarf-4 -Wall2026090420260831
265011360 0 020949 1248 1496compact3clang -march=native -Os -fwrapv -Qunused-arguments -fPIC -fPIE -gdwarf-4 -Wall2026090420260831
268811657 0 022231 1216 1592compact2gcc -march=native -mtune=native -O2 -fwrapv -fPIC -fPIE -gdwarf-4 -Wall2026090420260831
269492148 0 024423 1216 1592compact2gcc -march=native -mtune=native -O3 -fwrapv -fPIC -fPIE -gdwarf-4 -Wall2026090420260831
281681673 0 020597 1192 1560compact2gcc -march=native -mtune=native -Os -fwrapv -fPIC -fPIE -gdwarf-4 -Wall2026090420260831
283111535 0 022103 1216 1592compact3gcc -march=native -mtune=native -O2 -fwrapv -fPIC -fPIE -gdwarf-4 -Wall2026090420260831
285301886 0 024159 1216 1592compact3gcc -march=native -mtune=native -O3 -fwrapv -fPIC -fPIE -gdwarf-4 -Wall2026090420260831
290071784 0 022078 1208 1592compact2gcc -march=native -mtune=native -O -fwrapv -fPIC -fPIE -gdwarf-4 -Wall2026090420260831
296941611 0 021878 1208 1592compact3gcc -march=native -mtune=native -O -fwrapv -fPIC -fPIE -gdwarf-4 -Wall2026090420260831
297581437 0 020365 1192 1560compact3gcc -march=native -mtune=native -Os -fwrapv -fPIC -fPIE -gdwarf-4 -Wall2026090420260831

Test failure


error 132
Illegal instruction

Number of similar (implementation,compiler) pairs: 9, namely:
ImplementationCompiler
avx2clang -march=native -O2 -fwrapv -Qunused-arguments -fPIC -fPIE -gdwarf-4 -Wall (Debian_Clang_19.1.7_(3+b1))
avx2clang -march=native -O3 -fwrapv -Qunused-arguments -fPIC -fPIE -gdwarf-4 -Wall (Debian_Clang_19.1.7_(3+b1))
avx2clang -march=native -O -fwrapv -Qunused-arguments -fPIC -fPIE -gdwarf-4 -Wall (Debian_Clang_19.1.7_(3+b1))
avx2clang -march=native -Os -fwrapv -Qunused-arguments -fPIC -fPIE -gdwarf-4 -Wall (Debian_Clang_19.1.7_(3+b1))
avx2clang -mcpu=native -O3 -fwrapv -Qunused-arguments -fPIC -fPIE -gdwarf-4 -Wall (Debian_Clang_19.1.7_(3+b1))
avx2gcc -march=native -mtune=native -O2 -fwrapv -fPIC -fPIE -gdwarf-4 -Wall (14.2.0)
avx2gcc -march=native -mtune=native -O3 -fwrapv -fPIC -fPIE -gdwarf-4 -Wall (14.2.0)
avx2gcc -march=native -mtune=native -O -fwrapv -fPIC -fPIE -gdwarf-4 -Wall (14.2.0)
avx2gcc -march=native -mtune=native -Os -fwrapv -fPIC -fPIE -gdwarf-4 -Wall (14.2.0)

Compiler output


inner.c: inner.c:89:14: error: always_inline function '_mm256_shuffle_epi8' requires target feature 'avx2', but would be inlined into function 'crypto_hashblocks_sha512_avx_constbranchindex_inner' that is compiled without support for 'avx2'
inner.c:    89 |         X0 = _mm256_shuffle_epi8(X0,bigendian64);
inner.c:       |              ^
inner.c: inner.c:91:14: error: always_inline function '_mm256_add_epi64' requires target feature 'avx2', but would be inlined into function 'crypto_hashblocks_sha512_avx_constbranchindex_inner' that is compiled without support for 'avx2'
inner.c:    91 |         D0 = _mm256_add_epi64(X0,D0);
inner.c:       |              ^
inner.c: inner.c:97:14: error: always_inline function '_mm256_shuffle_epi8' requires target feature 'avx2', but would be inlined into function 'crypto_hashblocks_sha512_avx_constbranchindex_inner' that is compiled without support for 'avx2'
inner.c:    97 |         X4 = _mm256_shuffle_epi8(X4,bigendian64);
inner.c:       |              ^
inner.c: inner.c:99:14: error: always_inline function '_mm256_add_epi64' requires target feature 'avx2', but would be inlined into function 'crypto_hashblocks_sha512_avx_constbranchindex_inner' that is compiled without support for 'avx2'
inner.c:    99 |         D4 = _mm256_add_epi64(X4,D4);
inner.c:       |              ^
inner.c: inner.c:107:14: error: always_inline function '_mm256_shuffle_epi8' requires target feature 'avx2', but would be inlined into function 'crypto_hashblocks_sha512_avx_constbranchindex_inner' that is compiled without support for 'avx2'
inner.c:   107 |         X8 = _mm256_shuffle_epi8(X8,bigendian64);
inner.c:       |              ^
inner.c: inner.c:109:14: error: always_inline function '_mm256_add_epi64' requires target feature 'avx2', but would be inlined into function 'crypto_hashblocks_sha512_avx_constbranchindex_inner' that is compiled without support for 'avx2'
inner.c:   109 |         D8 = _mm256_add_epi64(X8,D8);
inner.c:       |              ^
inner.c: inner.c:120:15: error: always_inline function '_mm256_shuffle_epi8' requires target feature 'avx2', but would be inlined into function 'crypto_hashblocks_sha512_avx_constbranchindex_inner' that is compiled without support for 'avx2'
inner.c:   120 |         X12 = _mm256_shuffle_epi8(X12,bigendian64);
inner.c:       |               ^
inner.c: inner.c:122:15: error: always_inline function '_mm256_add_epi64' requires target feature 'avx2', but would be inlined into function 'crypto_hashblocks_sha512_avx_constbranchindex_inner' that is compiled without support for 'avx2'
inner.c:   122 |         D12 = _mm256_add_epi64(X12,D12);
inner.c:       |               ^
inner.c: inner.c:139:11: error: always_inline function '_mm256_srli_epi64' requires target feature 'avx2', but would be inlined into function 'crypto_hashblocks_sha512_avx_constbranchindex_inner' that is compiled without support for 'avx2'
inner.c: ...

Number of similar (implementation,compiler) pairs: 4, namely:
ImplementationCompiler
avxclang -march=native -O2 -fwrapv -Qunused-arguments -fPIC -fPIE -gdwarf-4 -Wall (Debian_Clang_19.1.7_(3+b1))
avxclang -march=native -O3 -fwrapv -Qunused-arguments -fPIC -fPIE -gdwarf-4 -Wall (Debian_Clang_19.1.7_(3+b1))
avxclang -march=native -O -fwrapv -Qunused-arguments -fPIC -fPIE -gdwarf-4 -Wall (Debian_Clang_19.1.7_(3+b1))
avxclang -march=native -Os -fwrapv -Qunused-arguments -fPIC -fPIE -gdwarf-4 -Wall (Debian_Clang_19.1.7_(3+b1))

Compiler output


inner.c: inner.c:88:14: error: always_inline function '_mm256_loadu_si256' requires target feature 'avx', but would be inlined into function 'crypto_hashblocks_sha512_avx_constbranchindex_inner' that is compiled without support for 'avx'
inner.c:    88 |         X0 = _mm256_loadu_si256((void *) (in+0));
inner.c:       |              ^
inner.c: inner.c:88:14: error: AVX vector return of type '__m256i' (vector of 4 'long long' values) without 'avx' enabled changes the ABI
inner.c: inner.c:89:37: error: always_inline function '_mm256_set_epi8' requires target feature 'avx', but would be inlined into function 'crypto_hashblocks_sha512_avx_constbranchindex_inner' that is compiled without support for 'avx'
inner.c:    89 |         X0 = _mm256_shuffle_epi8(X0,bigendian64);
inner.c:       |                                     ^
inner.c: inner.c:26:21: note: expanded from macro 'bigendian64'
inner.c:    26 | #define bigendian64 _mm256_set_epi8(8,9,10,11,12,13,14,15,0,1,2,3,4,5,6,7,8,9,10,11,12,13,14,15,0,1,2,3,4,5,6,7)
inner.c:       |                     ^
inner.c: inner.c:89:37: error: AVX vector return of type '__m256i' (vector of 4 'long long' values) without 'avx' enabled changes the ABI
inner.c: inner.c:26:21: note: expanded from macro 'bigendian64'
inner.c:    26 | #define bigendian64 _mm256_set_epi8(8,9,10,11,12,13,14,15,0,1,2,3,4,5,6,7,8,9,10,11,12,13,14,15,0,1,2,3,4,5,6,7)
inner.c:       |                     ^
inner.c: inner.c:89:14: error: always_inline function '_mm256_shuffle_epi8' requires target feature 'avx2', but would be inlined into function 'crypto_hashblocks_sha512_avx_constbranchindex_inner' that is compiled without support for 'avx2'
inner.c:    89 |         X0 = _mm256_shuffle_epi8(X0,bigendian64);
inner.c:       |              ^
inner.c: inner.c:89:14: error: AVX vector argument of type '__m256i' (vector of 4 'long long' values) without 'avx' enabled changes the ABI
inner.c: inner.c:90:14: error: always_inline function '_mm256_loadu_si256' requires target feature 'avx', but would be inlined into function 'crypto_hashblocks_sha512_avx_constbranchindex_inner' that is compiled without support for 'avx'
inner.c:    90 |         D0 = _mm256_loadu_si256((void *) &constants[0]);
inner.c:       |              ^
inner.c: inner.c:90:14: error: AVX vector return of type '__m256i' (vector of 4 'long long' values) without 'avx' enabled changes the ABI
inner.c: inner.c:91:14: error: always_inline function '_mm256_add_epi64' requires target feature 'avx2', but would be inlined into function 'crypto_hashblocks_sha512_avx_constbranchindex_inner' that is compiled without support for 'avx2'
inner.c:    91 |         D0 = _mm256_add_epi64(X0,D0);
inner.c:       |              ^
inner.c: ...

Number of similar (implementation,compiler) pairs: 1, namely:
ImplementationCompiler
avxclang -mcpu=native -O3 -fwrapv -Qunused-arguments -fPIC -fPIE -gdwarf-4 -Wall (Debian_Clang_19.1.7_(3+b1))

Compiler output


inner.c: In file included from /usr/lib/gcc/x86_64-linux-gnu/14/include/immintrin.h:53,
inner.c:                  from inner.c:3:
inner.c: /usr/lib/gcc/x86_64-linux-gnu/14/include/avx2intrin.h: In function 'crypto_hashblocks_sha512_avx_constbranchindex_inner':
inner.c: /usr/lib/gcc/x86_64-linux-gnu/14/include/avx2intrin.h:126:1: error: inlining failed in call to 'always_inline' '_mm256_add_epi64': target specific option mismatch
inner.c:   126 | _mm256_add_epi64 (__m256i __A, __m256i __B)
inner.c:       | ^~~~~~~~~~~~~~~~
inner.c: inner.c:122:15: note: called from here
inner.c:   122 |         D12 = _mm256_add_epi64(X12,D12);
inner.c:       |               ^~~~~~~~~~~~~~~~~~~~~~~~~
inner.c: /usr/lib/gcc/x86_64-linux-gnu/14/include/avx2intrin.h:588:1: error: inlining failed in call to 'always_inline' '_mm256_shuffle_epi8': target specific option mismatch
inner.c:   588 | _mm256_shuffle_epi8 (__m256i __X, __m256i __Y)
inner.c:       | ^~~~~~~~~~~~~~~~~~~
inner.c: inner.c:120:15: note: called from here
inner.c:   120 |         X12 = _mm256_shuffle_epi8(X12,bigendian64);
inner.c:       |               ^~~~~~~~~~~~~~~~~~~~~~~~~~~~~~~~~~~~
inner.c: /usr/lib/gcc/x86_64-linux-gnu/14/include/avx2intrin.h:126:1: error: inlining failed in call to 'always_inline' '_mm256_add_epi64': target specific option mismatch
inner.c:   126 | _mm256_add_epi64 (__m256i __A, __m256i __B)
inner.c:       | ^~~~~~~~~~~~~~~~
inner.c: inner.c:109:14: note: called from here
inner.c:   109 |         D8 = _mm256_add_epi64(X8,D8);
inner.c:       |              ^~~~~~~~~~~~~~~~~~~~~~~
inner.c: /usr/lib/gcc/x86_64-linux-gnu/14/include/avx2intrin.h:588:1: error: inlining failed in call to 'always_inline' '_mm256_shuffle_epi8': target specific option mismatch
inner.c:   588 | _mm256_shuffle_epi8 (__m256i __X, __m256i __Y)
inner.c:       | ^~~~~~~~~~~~~~~~~~~
inner.c: inner.c:107:14: note: called from here
inner.c: ...

Number of similar (implementation,compiler) pairs: 4, namely:
ImplementationCompiler
avxgcc -march=native -mtune=native -O2 -fwrapv -fPIC -fPIE -gdwarf-4 -Wall (14.2.0)
avxgcc -march=native -mtune=native -O3 -fwrapv -fPIC -fPIE -gdwarf-4 -Wall (14.2.0)
avxgcc -march=native -mtune=native -O -fwrapv -fPIC -fPIE -gdwarf-4 -Wall (14.2.0)
avxgcc -march=native -mtune=native -Os -fwrapv -fPIC -fPIE -gdwarf-4 -Wall (14.2.0)

Compiler output


try.c: /usr/bin/ld: libcrypto_hashblocks_sha512.a(blocks.o): in function `crypto_hashblocks_sha512_dolbeau_intelavx2rorxasm_constbranchindex':
try.c: .../supercop-data/hunsnivy/amd64/try/c/clang_-march=native_-O2_-fwrapv_-Qunused-arguments_-fPIC_-fPIE_-gdwarf-4_-Wall/constbranchindex/crypto_hashblocks/sha512/dolbeau/intelavx2rorxasm/work/blocks.c:45:(.text+0x...): undefined reference to `sha512_rorx'
try.c: clang: error: linker command failed with exit code 1 (use -v to see invocation)

Number of similar (implementation,compiler) pairs: 1, namely:
ImplementationCompiler
dolbeau/intelavx2rorxasmclang -march=native -O2 -fwrapv -Qunused-arguments -fPIC -fPIE -gdwarf-4 -Wall (Debian_Clang_19.1.7_(3+b1))

Compiler output


try.c: /usr/bin/ld: libcrypto_hashblocks_sha512.a(blocks.o): in function `crypto_hashblocks_sha512_dolbeau_intelavx2rorxasm_constbranchindex':
try.c: .../supercop-data/hunsnivy/amd64/try/c/clang_-march=native_-O3_-fwrapv_-Qunused-arguments_-fPIC_-fPIE_-gdwarf-4_-Wall/constbranchindex/crypto_hashblocks/sha512/dolbeau/intelavx2rorxasm/work/blocks.c:45:(.text+0x...): undefined reference to `sha512_rorx'
try.c: clang: error: linker command failed with exit code 1 (use -v to see invocation)

Number of similar (implementation,compiler) pairs: 1, namely:
ImplementationCompiler
dolbeau/intelavx2rorxasmclang -march=native -O3 -fwrapv -Qunused-arguments -fPIC -fPIE -gdwarf-4 -Wall (Debian_Clang_19.1.7_(3+b1))

Compiler output


try.c: /usr/bin/ld: libcrypto_hashblocks_sha512.a(blocks.o): in function `crypto_hashblocks_sha512_dolbeau_intelavx2rorxasm_constbranchindex':
try.c: .../supercop-data/hunsnivy/amd64/try/c/clang_-march=native_-O_-fwrapv_-Qunused-arguments_-fPIC_-fPIE_-gdwarf-4_-Wall/constbranchindex/crypto_hashblocks/sha512/dolbeau/intelavx2rorxasm/work/blocks.c:45:(.text+0x...): undefined reference to `sha512_rorx'
try.c: clang: error: linker command failed with exit code 1 (use -v to see invocation)

Number of similar (implementation,compiler) pairs: 1, namely:
ImplementationCompiler
dolbeau/intelavx2rorxasmclang -march=native -O -fwrapv -Qunused-arguments -fPIC -fPIE -gdwarf-4 -Wall (Debian_Clang_19.1.7_(3+b1))

Compiler output


try.c: /usr/bin/ld: libcrypto_hashblocks_sha512.a(blocks.o): in function `crypto_hashblocks_sha512_dolbeau_intelavx2rorxasm_constbranchindex':
try.c: .../supercop-data/hunsnivy/amd64/try/c/clang_-march=native_-Os_-fwrapv_-Qunused-arguments_-fPIC_-fPIE_-gdwarf-4_-Wall/constbranchindex/crypto_hashblocks/sha512/dolbeau/intelavx2rorxasm/work/blocks.c:45:(.text+0x...): undefined reference to `sha512_rorx'
try.c: clang: error: linker command failed with exit code 1 (use -v to see invocation)

Number of similar (implementation,compiler) pairs: 1, namely:
ImplementationCompiler
dolbeau/intelavx2rorxasmclang -march=native -Os -fwrapv -Qunused-arguments -fPIC -fPIE -gdwarf-4 -Wall (Debian_Clang_19.1.7_(3+b1))

Compiler output


try.c: /usr/bin/ld: libcrypto_hashblocks_sha512.a(blocks.o): in function `crypto_hashblocks_sha512_dolbeau_intelavx2rorxasm_constbranchindex':
try.c: .../supercop-data/hunsnivy/amd64/try/c/clang_-mcpu=native_-O3_-fwrapv_-Qunused-arguments_-fPIC_-fPIE_-gdwarf-4_-Wall/constbranchindex/crypto_hashblocks/sha512/dolbeau/intelavx2rorxasm/work/blocks.c:45:(.text+0x...): undefined reference to `sha512_rorx'
try.c: clang: error: linker command failed with exit code 1 (use -v to see invocation)

Number of similar (implementation,compiler) pairs: 1, namely:
ImplementationCompiler
dolbeau/intelavx2rorxasmclang -mcpu=native -O3 -fwrapv -Qunused-arguments -fPIC -fPIE -gdwarf-4 -Wall (Debian_Clang_19.1.7_(3+b1))

Compiler output


try.c: /usr/bin/ld: libcrypto_hashblocks_sha512.a(blocks.o): in function `crypto_hashblocks_sha512_dolbeau_intelavx2rorxasm_constbranchindex':
try.c: .../supercop-data/hunsnivy/amd64/try/c/gcc_-march=native_-mtune=native_-O2_-fwrapv_-fPIC_-fPIE_-gdwarf-4_-Wall/constbranchindex/crypto_hashblocks/sha512/dolbeau/intelavx2rorxasm/work/blocks.c:45:(.text+0x...): undefined reference to `sha512_rorx'
try.c: collect2: error: ld returned 1 exit status

Number of similar (implementation,compiler) pairs: 1, namely:
ImplementationCompiler
dolbeau/intelavx2rorxasmgcc -march=native -mtune=native -O2 -fwrapv -fPIC -fPIE -gdwarf-4 -Wall (14.2.0)

Compiler output


try.c: /usr/bin/ld: libcrypto_hashblocks_sha512.a(blocks.o): in function `crypto_hashblocks_sha512_dolbeau_intelavx2rorxasm_constbranchindex':
try.c: .../supercop-data/hunsnivy/amd64/try/c/gcc_-march=native_-mtune=native_-O3_-fwrapv_-fPIC_-fPIE_-gdwarf-4_-Wall/constbranchindex/crypto_hashblocks/sha512/dolbeau/intelavx2rorxasm/work/blocks.c:45:(.text+0x...): undefined reference to `sha512_rorx'
try.c: collect2: error: ld returned 1 exit status

Number of similar (implementation,compiler) pairs: 1, namely:
ImplementationCompiler
dolbeau/intelavx2rorxasmgcc -march=native -mtune=native -O3 -fwrapv -fPIC -fPIE -gdwarf-4 -Wall (14.2.0)

Compiler output


try.c: /usr/bin/ld: libcrypto_hashblocks_sha512.a(blocks.o): in function `crypto_hashblocks_sha512_dolbeau_intelavx2rorxasm_constbranchindex':
try.c: .../supercop-data/hunsnivy/amd64/try/c/gcc_-march=native_-mtune=native_-O_-fwrapv_-fPIC_-fPIE_-gdwarf-4_-Wall/constbranchindex/crypto_hashblocks/sha512/dolbeau/intelavx2rorxasm/work/blocks.c:45:(.text+0x...): undefined reference to `sha512_rorx'
try.c: collect2: error: ld returned 1 exit status

Number of similar (implementation,compiler) pairs: 1, namely:
ImplementationCompiler
dolbeau/intelavx2rorxasmgcc -march=native -mtune=native -O -fwrapv -fPIC -fPIE -gdwarf-4 -Wall (14.2.0)

Compiler output


try.c: /usr/bin/ld: libcrypto_hashblocks_sha512.a(blocks.o): in function `crypto_hashblocks_sha512_dolbeau_intelavx2rorxasm_constbranchindex':
try.c: .../supercop-data/hunsnivy/amd64/try/c/gcc_-march=native_-mtune=native_-Os_-fwrapv_-fPIC_-fPIE_-gdwarf-4_-Wall/constbranchindex/crypto_hashblocks/sha512/dolbeau/intelavx2rorxasm/work/blocks.c:45:(.text+0x...): undefined reference to `sha512_rorx'
try.c: collect2: error: ld returned 1 exit status

Number of similar (implementation,compiler) pairs: 1, namely:
ImplementationCompiler
dolbeau/intelavx2rorxasmgcc -march=native -mtune=native -Os -fwrapv -fPIC -fPIE -gdwarf-4 -Wall (14.2.0)

Compiler output


try.c: /usr/bin/ld: libcrypto_hashblocks_sha512.a(blocks.o): in function `crypto_hashblocks_sha512_dolbeau_intelavxasm_constbranchindex':
try.c: .../supercop-data/hunsnivy/amd64/try/c/clang_-march=native_-O2_-fwrapv_-Qunused-arguments_-fPIC_-fPIE_-gdwarf-4_-Wall/constbranchindex/crypto_hashblocks/sha512/dolbeau/intelavxasm/work/blocks.c:45:(.text+0x...): undefined reference to `sha512_avx'
try.c: clang: error: linker command failed with exit code 1 (use -v to see invocation)

Number of similar (implementation,compiler) pairs: 1, namely:
ImplementationCompiler
dolbeau/intelavxasmclang -march=native -O2 -fwrapv -Qunused-arguments -fPIC -fPIE -gdwarf-4 -Wall (Debian_Clang_19.1.7_(3+b1))

Compiler output


try.c: /usr/bin/ld: libcrypto_hashblocks_sha512.a(blocks.o): in function `crypto_hashblocks_sha512_dolbeau_intelavxasm_constbranchindex':
try.c: .../supercop-data/hunsnivy/amd64/try/c/clang_-march=native_-O3_-fwrapv_-Qunused-arguments_-fPIC_-fPIE_-gdwarf-4_-Wall/constbranchindex/crypto_hashblocks/sha512/dolbeau/intelavxasm/work/blocks.c:45:(.text+0x...): undefined reference to `sha512_avx'
try.c: clang: error: linker command failed with exit code 1 (use -v to see invocation)

Number of similar (implementation,compiler) pairs: 1, namely:
ImplementationCompiler
dolbeau/intelavxasmclang -march=native -O3 -fwrapv -Qunused-arguments -fPIC -fPIE -gdwarf-4 -Wall (Debian_Clang_19.1.7_(3+b1))

Compiler output


try.c: /usr/bin/ld: libcrypto_hashblocks_sha512.a(blocks.o): in function `crypto_hashblocks_sha512_dolbeau_intelavxasm_constbranchindex':
try.c: .../supercop-data/hunsnivy/amd64/try/c/clang_-march=native_-O_-fwrapv_-Qunused-arguments_-fPIC_-fPIE_-gdwarf-4_-Wall/constbranchindex/crypto_hashblocks/sha512/dolbeau/intelavxasm/work/blocks.c:45:(.text+0x...): undefined reference to `sha512_avx'
try.c: clang: error: linker command failed with exit code 1 (use -v to see invocation)

Number of similar (implementation,compiler) pairs: 1, namely:
ImplementationCompiler
dolbeau/intelavxasmclang -march=native -O -fwrapv -Qunused-arguments -fPIC -fPIE -gdwarf-4 -Wall (Debian_Clang_19.1.7_(3+b1))

Compiler output


try.c: /usr/bin/ld: libcrypto_hashblocks_sha512.a(blocks.o): in function `crypto_hashblocks_sha512_dolbeau_intelavxasm_constbranchindex':
try.c: .../supercop-data/hunsnivy/amd64/try/c/clang_-march=native_-Os_-fwrapv_-Qunused-arguments_-fPIC_-fPIE_-gdwarf-4_-Wall/constbranchindex/crypto_hashblocks/sha512/dolbeau/intelavxasm/work/blocks.c:45:(.text+0x...): undefined reference to `sha512_avx'
try.c: clang: error: linker command failed with exit code 1 (use -v to see invocation)

Number of similar (implementation,compiler) pairs: 1, namely:
ImplementationCompiler
dolbeau/intelavxasmclang -march=native -Os -fwrapv -Qunused-arguments -fPIC -fPIE -gdwarf-4 -Wall (Debian_Clang_19.1.7_(3+b1))

Compiler output


try.c: /usr/bin/ld: libcrypto_hashblocks_sha512.a(blocks.o): in function `crypto_hashblocks_sha512_dolbeau_intelavxasm_constbranchindex':
try.c: .../supercop-data/hunsnivy/amd64/try/c/clang_-mcpu=native_-O3_-fwrapv_-Qunused-arguments_-fPIC_-fPIE_-gdwarf-4_-Wall/constbranchindex/crypto_hashblocks/sha512/dolbeau/intelavxasm/work/blocks.c:45:(.text+0x...): undefined reference to `sha512_avx'
try.c: clang: error: linker command failed with exit code 1 (use -v to see invocation)

Number of similar (implementation,compiler) pairs: 1, namely:
ImplementationCompiler
dolbeau/intelavxasmclang -mcpu=native -O3 -fwrapv -Qunused-arguments -fPIC -fPIE -gdwarf-4 -Wall (Debian_Clang_19.1.7_(3+b1))

Compiler output


try.c: /usr/bin/ld: libcrypto_hashblocks_sha512.a(blocks.o): in function `crypto_hashblocks_sha512_dolbeau_intelavxasm_constbranchindex':
try.c: .../supercop-data/hunsnivy/amd64/try/c/gcc_-march=native_-mtune=native_-O2_-fwrapv_-fPIC_-fPIE_-gdwarf-4_-Wall/constbranchindex/crypto_hashblocks/sha512/dolbeau/intelavxasm/work/blocks.c:45:(.text+0x...): undefined reference to `sha512_avx'
try.c: collect2: error: ld returned 1 exit status

Number of similar (implementation,compiler) pairs: 1, namely:
ImplementationCompiler
dolbeau/intelavxasmgcc -march=native -mtune=native -O2 -fwrapv -fPIC -fPIE -gdwarf-4 -Wall (14.2.0)

Compiler output


try.c: /usr/bin/ld: libcrypto_hashblocks_sha512.a(blocks.o): in function `crypto_hashblocks_sha512_dolbeau_intelavxasm_constbranchindex':
try.c: .../supercop-data/hunsnivy/amd64/try/c/gcc_-march=native_-mtune=native_-O3_-fwrapv_-fPIC_-fPIE_-gdwarf-4_-Wall/constbranchindex/crypto_hashblocks/sha512/dolbeau/intelavxasm/work/blocks.c:45:(.text+0x...): undefined reference to `sha512_avx'
try.c: collect2: error: ld returned 1 exit status

Number of similar (implementation,compiler) pairs: 1, namely:
ImplementationCompiler
dolbeau/intelavxasmgcc -march=native -mtune=native -O3 -fwrapv -fPIC -fPIE -gdwarf-4 -Wall (14.2.0)

Compiler output


try.c: /usr/bin/ld: libcrypto_hashblocks_sha512.a(blocks.o): in function `crypto_hashblocks_sha512_dolbeau_intelavxasm_constbranchindex':
try.c: .../supercop-data/hunsnivy/amd64/try/c/gcc_-march=native_-mtune=native_-O_-fwrapv_-fPIC_-fPIE_-gdwarf-4_-Wall/constbranchindex/crypto_hashblocks/sha512/dolbeau/intelavxasm/work/blocks.c:45:(.text+0x...): undefined reference to `sha512_avx'
try.c: collect2: error: ld returned 1 exit status

Number of similar (implementation,compiler) pairs: 1, namely:
ImplementationCompiler
dolbeau/intelavxasmgcc -march=native -mtune=native -O -fwrapv -fPIC -fPIE -gdwarf-4 -Wall (14.2.0)

Compiler output


try.c: /usr/bin/ld: libcrypto_hashblocks_sha512.a(blocks.o): in function `crypto_hashblocks_sha512_dolbeau_intelavxasm_constbranchindex':
try.c: .../supercop-data/hunsnivy/amd64/try/c/gcc_-march=native_-mtune=native_-Os_-fwrapv_-fPIC_-fPIE_-gdwarf-4_-Wall/constbranchindex/crypto_hashblocks/sha512/dolbeau/intelavxasm/work/blocks.c:45:(.text+0x...): undefined reference to `sha512_avx'
try.c: collect2: error: ld returned 1 exit status

Number of similar (implementation,compiler) pairs: 1, namely:
ImplementationCompiler
dolbeau/intelavxasmgcc -march=native -mtune=native -Os -fwrapv -fPIC -fPIE -gdwarf-4 -Wall (14.2.0)

Compiler output


try.c: /usr/bin/ld: libcrypto_hashblocks_sha512.a(blocks.o): in function `crypto_hashblocks_sha512_dolbeau_intelsse4asm_constbranchindex':
try.c: .../supercop-data/hunsnivy/amd64/try/c/clang_-march=native_-O2_-fwrapv_-Qunused-arguments_-fPIC_-fPIE_-gdwarf-4_-Wall/constbranchindex/crypto_hashblocks/sha512/dolbeau/intelsse4asm/work/blocks.c:45:(.text+0x...): undefined reference to `sha512_sse4'
try.c: clang: error: linker command failed with exit code 1 (use -v to see invocation)

Number of similar (implementation,compiler) pairs: 1, namely:
ImplementationCompiler
dolbeau/intelsse4asmclang -march=native -O2 -fwrapv -Qunused-arguments -fPIC -fPIE -gdwarf-4 -Wall (Debian_Clang_19.1.7_(3+b1))

Compiler output


try.c: /usr/bin/ld: libcrypto_hashblocks_sha512.a(blocks.o): in function `crypto_hashblocks_sha512_dolbeau_intelsse4asm_constbranchindex':
try.c: .../supercop-data/hunsnivy/amd64/try/c/clang_-march=native_-O3_-fwrapv_-Qunused-arguments_-fPIC_-fPIE_-gdwarf-4_-Wall/constbranchindex/crypto_hashblocks/sha512/dolbeau/intelsse4asm/work/blocks.c:45:(.text+0x...): undefined reference to `sha512_sse4'
try.c: clang: error: linker command failed with exit code 1 (use -v to see invocation)

Number of similar (implementation,compiler) pairs: 1, namely:
ImplementationCompiler
dolbeau/intelsse4asmclang -march=native -O3 -fwrapv -Qunused-arguments -fPIC -fPIE -gdwarf-4 -Wall (Debian_Clang_19.1.7_(3+b1))

Compiler output


try.c: /usr/bin/ld: libcrypto_hashblocks_sha512.a(blocks.o): in function `crypto_hashblocks_sha512_dolbeau_intelsse4asm_constbranchindex':
try.c: .../supercop-data/hunsnivy/amd64/try/c/clang_-march=native_-O_-fwrapv_-Qunused-arguments_-fPIC_-fPIE_-gdwarf-4_-Wall/constbranchindex/crypto_hashblocks/sha512/dolbeau/intelsse4asm/work/blocks.c:45:(.text+0x...): undefined reference to `sha512_sse4'
try.c: clang: error: linker command failed with exit code 1 (use -v to see invocation)

Number of similar (implementation,compiler) pairs: 1, namely:
ImplementationCompiler
dolbeau/intelsse4asmclang -march=native -O -fwrapv -Qunused-arguments -fPIC -fPIE -gdwarf-4 -Wall (Debian_Clang_19.1.7_(3+b1))

Compiler output


try.c: /usr/bin/ld: libcrypto_hashblocks_sha512.a(blocks.o): in function `crypto_hashblocks_sha512_dolbeau_intelsse4asm_constbranchindex':
try.c: .../supercop-data/hunsnivy/amd64/try/c/clang_-march=native_-Os_-fwrapv_-Qunused-arguments_-fPIC_-fPIE_-gdwarf-4_-Wall/constbranchindex/crypto_hashblocks/sha512/dolbeau/intelsse4asm/work/blocks.c:45:(.text+0x...): undefined reference to `sha512_sse4'
try.c: clang: error: linker command failed with exit code 1 (use -v to see invocation)

Number of similar (implementation,compiler) pairs: 1, namely:
ImplementationCompiler
dolbeau/intelsse4asmclang -march=native -Os -fwrapv -Qunused-arguments -fPIC -fPIE -gdwarf-4 -Wall (Debian_Clang_19.1.7_(3+b1))

Compiler output


try.c: /usr/bin/ld: libcrypto_hashblocks_sha512.a(blocks.o): in function `crypto_hashblocks_sha512_dolbeau_intelsse4asm_constbranchindex':
try.c: .../supercop-data/hunsnivy/amd64/try/c/clang_-mcpu=native_-O3_-fwrapv_-Qunused-arguments_-fPIC_-fPIE_-gdwarf-4_-Wall/constbranchindex/crypto_hashblocks/sha512/dolbeau/intelsse4asm/work/blocks.c:45:(.text+0x...): undefined reference to `sha512_sse4'
try.c: clang: error: linker command failed with exit code 1 (use -v to see invocation)

Number of similar (implementation,compiler) pairs: 1, namely:
ImplementationCompiler
dolbeau/intelsse4asmclang -mcpu=native -O3 -fwrapv -Qunused-arguments -fPIC -fPIE -gdwarf-4 -Wall (Debian_Clang_19.1.7_(3+b1))

Compiler output


try.c: /usr/bin/ld: libcrypto_hashblocks_sha512.a(blocks.o): in function `crypto_hashblocks_sha512_dolbeau_intelsse4asm_constbranchindex':
try.c: .../supercop-data/hunsnivy/amd64/try/c/gcc_-march=native_-mtune=native_-O2_-fwrapv_-fPIC_-fPIE_-gdwarf-4_-Wall/constbranchindex/crypto_hashblocks/sha512/dolbeau/intelsse4asm/work/blocks.c:45:(.text+0x...): undefined reference to `sha512_sse4'
try.c: collect2: error: ld returned 1 exit status

Number of similar (implementation,compiler) pairs: 1, namely:
ImplementationCompiler
dolbeau/intelsse4asmgcc -march=native -mtune=native -O2 -fwrapv -fPIC -fPIE -gdwarf-4 -Wall (14.2.0)

Compiler output


try.c: /usr/bin/ld: libcrypto_hashblocks_sha512.a(blocks.o): in function `crypto_hashblocks_sha512_dolbeau_intelsse4asm_constbranchindex':
try.c: .../supercop-data/hunsnivy/amd64/try/c/gcc_-march=native_-mtune=native_-O3_-fwrapv_-fPIC_-fPIE_-gdwarf-4_-Wall/constbranchindex/crypto_hashblocks/sha512/dolbeau/intelsse4asm/work/blocks.c:45:(.text+0x...): undefined reference to `sha512_sse4'
try.c: collect2: error: ld returned 1 exit status

Number of similar (implementation,compiler) pairs: 1, namely:
ImplementationCompiler
dolbeau/intelsse4asmgcc -march=native -mtune=native -O3 -fwrapv -fPIC -fPIE -gdwarf-4 -Wall (14.2.0)

Compiler output


try.c: /usr/bin/ld: libcrypto_hashblocks_sha512.a(blocks.o): in function `crypto_hashblocks_sha512_dolbeau_intelsse4asm_constbranchindex':
try.c: .../supercop-data/hunsnivy/amd64/try/c/gcc_-march=native_-mtune=native_-O_-fwrapv_-fPIC_-fPIE_-gdwarf-4_-Wall/constbranchindex/crypto_hashblocks/sha512/dolbeau/intelsse4asm/work/blocks.c:45:(.text+0x...): undefined reference to `sha512_sse4'
try.c: collect2: error: ld returned 1 exit status

Number of similar (implementation,compiler) pairs: 1, namely:
ImplementationCompiler
dolbeau/intelsse4asmgcc -march=native -mtune=native -O -fwrapv -fPIC -fPIE -gdwarf-4 -Wall (14.2.0)

Compiler output


try.c: /usr/bin/ld: libcrypto_hashblocks_sha512.a(blocks.o): in function `crypto_hashblocks_sha512_dolbeau_intelsse4asm_constbranchindex':
try.c: .../supercop-data/hunsnivy/amd64/try/c/gcc_-march=native_-mtune=native_-Os_-fwrapv_-fPIC_-fPIE_-gdwarf-4_-Wall/constbranchindex/crypto_hashblocks/sha512/dolbeau/intelsse4asm/work/blocks.c:45:(.text+0x...): undefined reference to `sha512_sse4'
try.c: collect2: error: ld returned 1 exit status

Number of similar (implementation,compiler) pairs: 1, namely:
ImplementationCompiler
dolbeau/intelsse4asmgcc -march=native -mtune=native -Os -fwrapv -fPIC -fPIE -gdwarf-4 -Wall (14.2.0)

Passed TIMECOP


TIMECOP iterations: 10

Number of similar (implementation,compiler) pairs: 63, namely:
ImplementationCompiler
compactclang -march=native -O2 -fwrapv -Qunused-arguments -fPIC -fPIE -gdwarf-4 -Wall (Debian_Clang_19.1.7_(3+b1))
compactclang -march=native -O3 -fwrapv -Qunused-arguments -fPIC -fPIE -gdwarf-4 -Wall (Debian_Clang_19.1.7_(3+b1))
compactclang -march=native -O -fwrapv -Qunused-arguments -fPIC -fPIE -gdwarf-4 -Wall (Debian_Clang_19.1.7_(3+b1))
compactclang -march=native -Os -fwrapv -Qunused-arguments -fPIC -fPIE -gdwarf-4 -Wall (Debian_Clang_19.1.7_(3+b1))
compactclang -mcpu=native -O3 -fwrapv -Qunused-arguments -fPIC -fPIE -gdwarf-4 -Wall (Debian_Clang_19.1.7_(3+b1))
compactgcc -march=native -mtune=native -O2 -fwrapv -fPIC -fPIE -gdwarf-4 -Wall (14.2.0)
compactgcc -march=native -mtune=native -O3 -fwrapv -fPIC -fPIE -gdwarf-4 -Wall (14.2.0)
compactgcc -march=native -mtune=native -O -fwrapv -fPIC -fPIE -gdwarf-4 -Wall (14.2.0)
compactgcc -march=native -mtune=native -Os -fwrapv -fPIC -fPIE -gdwarf-4 -Wall (14.2.0)
compact2clang -march=native -O2 -fwrapv -Qunused-arguments -fPIC -fPIE -gdwarf-4 -Wall (Debian_Clang_19.1.7_(3+b1))
compact2clang -march=native -O3 -fwrapv -Qunused-arguments -fPIC -fPIE -gdwarf-4 -Wall (Debian_Clang_19.1.7_(3+b1))
compact2clang -march=native -O -fwrapv -Qunused-arguments -fPIC -fPIE -gdwarf-4 -Wall (Debian_Clang_19.1.7_(3+b1))
compact2clang -march=native -Os -fwrapv -Qunused-arguments -fPIC -fPIE -gdwarf-4 -Wall (Debian_Clang_19.1.7_(3+b1))
compact2clang -mcpu=native -O3 -fwrapv -Qunused-arguments -fPIC -fPIE -gdwarf-4 -Wall (Debian_Clang_19.1.7_(3+b1))
compact2gcc -march=native -mtune=native -O2 -fwrapv -fPIC -fPIE -gdwarf-4 -Wall (14.2.0)
compact2gcc -march=native -mtune=native -O3 -fwrapv -fPIC -fPIE -gdwarf-4 -Wall (14.2.0)
compact2gcc -march=native -mtune=native -O -fwrapv -fPIC -fPIE -gdwarf-4 -Wall (14.2.0)
compact2gcc -march=native -mtune=native -Os -fwrapv -fPIC -fPIE -gdwarf-4 -Wall (14.2.0)
compact3clang -march=native -O2 -fwrapv -Qunused-arguments -fPIC -fPIE -gdwarf-4 -Wall (Debian_Clang_19.1.7_(3+b1))
compact3clang -march=native -O3 -fwrapv -Qunused-arguments -fPIC -fPIE -gdwarf-4 -Wall (Debian_Clang_19.1.7_(3+b1))
compact3clang -march=native -O -fwrapv -Qunused-arguments -fPIC -fPIE -gdwarf-4 -Wall (Debian_Clang_19.1.7_(3+b1))
compact3clang -march=native -Os -fwrapv -Qunused-arguments -fPIC -fPIE -gdwarf-4 -Wall (Debian_Clang_19.1.7_(3+b1))
compact3clang -mcpu=native -O3 -fwrapv -Qunused-arguments -fPIC -fPIE -gdwarf-4 -Wall (Debian_Clang_19.1.7_(3+b1))
compact3gcc -march=native -mtune=native -O2 -fwrapv -fPIC -fPIE -gdwarf-4 -Wall (14.2.0)
compact3gcc -march=native -mtune=native -O3 -fwrapv -fPIC -fPIE -gdwarf-4 -Wall (14.2.0)
compact3gcc -march=native -mtune=native -O -fwrapv -fPIC -fPIE -gdwarf-4 -Wall (14.2.0)
compact3gcc -march=native -mtune=native -Os -fwrapv -fPIC -fPIE -gdwarf-4 -Wall (14.2.0)
compact4clang -march=native -O2 -fwrapv -Qunused-arguments -fPIC -fPIE -gdwarf-4 -Wall (Debian_Clang_19.1.7_(3+b1))
compact4clang -march=native -O3 -fwrapv -Qunused-arguments -fPIC -fPIE -gdwarf-4 -Wall (Debian_Clang_19.1.7_(3+b1))
compact4clang -march=native -O -fwrapv -Qunused-arguments -fPIC -fPIE -gdwarf-4 -Wall (Debian_Clang_19.1.7_(3+b1))
compact4clang -march=native -Os -fwrapv -Qunused-arguments -fPIC -fPIE -gdwarf-4 -Wall (Debian_Clang_19.1.7_(3+b1))
compact4clang -mcpu=native -O3 -fwrapv -Qunused-arguments -fPIC -fPIE -gdwarf-4 -Wall (Debian_Clang_19.1.7_(3+b1))
compact4gcc -march=native -mtune=native -O2 -fwrapv -fPIC -fPIE -gdwarf-4 -Wall (14.2.0)
compact4gcc -march=native -mtune=native -O3 -fwrapv -fPIC -fPIE -gdwarf-4 -Wall (14.2.0)
compact4gcc -march=native -mtune=native -O -fwrapv -fPIC -fPIE -gdwarf-4 -Wall (14.2.0)
compact4gcc -march=native -mtune=native -Os -fwrapv -fPIC -fPIE -gdwarf-4 -Wall (14.2.0)
inplaceclang -march=native -O2 -fwrapv -Qunused-arguments -fPIC -fPIE -gdwarf-4 -Wall (Debian_Clang_19.1.7_(3+b1))
inplaceclang -march=native -O3 -fwrapv -Qunused-arguments -fPIC -fPIE -gdwarf-4 -Wall (Debian_Clang_19.1.7_(3+b1))
inplaceclang -march=native -O -fwrapv -Qunused-arguments -fPIC -fPIE -gdwarf-4 -Wall (Debian_Clang_19.1.7_(3+b1))
inplaceclang -march=native -Os -fwrapv -Qunused-arguments -fPIC -fPIE -gdwarf-4 -Wall (Debian_Clang_19.1.7_(3+b1))
inplaceclang -mcpu=native -O3 -fwrapv -Qunused-arguments -fPIC -fPIE -gdwarf-4 -Wall (Debian_Clang_19.1.7_(3+b1))
inplacegcc -march=native -mtune=native -O2 -fwrapv -fPIC -fPIE -gdwarf-4 -Wall (14.2.0)
inplacegcc -march=native -mtune=native -O3 -fwrapv -fPIC -fPIE -gdwarf-4 -Wall (14.2.0)
inplacegcc -march=native -mtune=native -O -fwrapv -fPIC -fPIE -gdwarf-4 -Wall (14.2.0)
inplacegcc -march=native -mtune=native -Os -fwrapv -fPIC -fPIE -gdwarf-4 -Wall (14.2.0)
refclang -march=native -O2 -fwrapv -Qunused-arguments -fPIC -fPIE -gdwarf-4 -Wall (Debian_Clang_19.1.7_(3+b1))
refclang -march=native -O3 -fwrapv -Qunused-arguments -fPIC -fPIE -gdwarf-4 -Wall (Debian_Clang_19.1.7_(3+b1))
refclang -march=native -O -fwrapv -Qunused-arguments -fPIC -fPIE -gdwarf-4 -Wall (Debian_Clang_19.1.7_(3+b1))
refclang -march=native -Os -fwrapv -Qunused-arguments -fPIC -fPIE -gdwarf-4 -Wall (Debian_Clang_19.1.7_(3+b1))
refclang -mcpu=native -O3 -fwrapv -Qunused-arguments -fPIC -fPIE -gdwarf-4 -Wall (Debian_Clang_19.1.7_(3+b1))
refgcc -march=native -mtune=native -O2 -fwrapv -fPIC -fPIE -gdwarf-4 -Wall (14.2.0)
refgcc -march=native -mtune=native -O3 -fwrapv -fPIC -fPIE -gdwarf-4 -Wall (14.2.0)
refgcc -march=native -mtune=native -O -fwrapv -fPIC -fPIE -gdwarf-4 -Wall (14.2.0)
refgcc -march=native -mtune=native -Os -fwrapv -fPIC -fPIE -gdwarf-4 -Wall (14.2.0)
wflipclang -march=native -O2 -fwrapv -Qunused-arguments -fPIC -fPIE -gdwarf-4 -Wall (Debian_Clang_19.1.7_(3+b1))
wflipclang -march=native -O3 -fwrapv -Qunused-arguments -fPIC -fPIE -gdwarf-4 -Wall (Debian_Clang_19.1.7_(3+b1))
wflipclang -march=native -O -fwrapv -Qunused-arguments -fPIC -fPIE -gdwarf-4 -Wall (Debian_Clang_19.1.7_(3+b1))
wflipclang -march=native -Os -fwrapv -Qunused-arguments -fPIC -fPIE -gdwarf-4 -Wall (Debian_Clang_19.1.7_(3+b1))
wflipclang -mcpu=native -O3 -fwrapv -Qunused-arguments -fPIC -fPIE -gdwarf-4 -Wall (Debian_Clang_19.1.7_(3+b1))
wflipgcc -march=native -mtune=native -O2 -fwrapv -fPIC -fPIE -gdwarf-4 -Wall (14.2.0)
wflipgcc -march=native -mtune=native -O3 -fwrapv -fPIC -fPIE -gdwarf-4 -Wall (14.2.0)
wflipgcc -march=native -mtune=native -O -fwrapv -fPIC -fPIE -gdwarf-4 -Wall (14.2.0)
wflipgcc -march=native -mtune=native -Os -fwrapv -fPIC -fPIE -gdwarf-4 -Wall (14.2.0)