Test results for amd64, hunsnivy, crypto_hash/echo512

[Page version: 20260922 08:20:24]

Measurements for amd64, hunsnivy, crypto_hash Test results for amd64, hunsnivy, crypto_hash Test results for crypto_hash/echo512
Computer: hunsnivy
Microarchitecture: amd64; Ivy Bridge+AES (306a9)
Architecture: amd64
CPU ID: GenuineIntel-000306a9-bfebfbff
SUPERCOP version: 20260831
Operation: crypto_hash
Primitive: echo512
TimeObject sizeTest sizeImplementationCompilerBenchmark dateSUPERCOP version
7171419873 0 040823 1216 1592T:ccalik/vpermgcc -march=native -mtune=native -O2 -fwrapv -fPIC -fPIE -gdwarf-4 -Wall2026090420260831
7176119873 0 040823 1216 1592T:ccalik/aesnigcc -march=native -mtune=native -O2 -fwrapv -fPIC -fPIE -gdwarf-4 -Wall2026090420260831
7183423696 0 046359 1216 1592T:ccalik/vpermgcc -march=native -mtune=native -O3 -fwrapv -fPIC -fPIE -gdwarf-4 -Wall2026090420260831
7218623696 0 046359 1216 1592T:ccalik/aesnigcc -march=native -mtune=native -O3 -fwrapv -fPIC -fPIE -gdwarf-4 -Wall2026090420260831
7288320721 0 041335 1216 1592T:ccalik/aesnigcc -march=native -mtune=native -O -fwrapv -fPIC -fPIE -gdwarf-4 -Wall2026090420260831
7334720721 0 041335 1216 1592T:ccalik/vpermgcc -march=native -mtune=native -O -fwrapv -fPIC -fPIE -gdwarf-4 -Wall2026090420260831
7374525560 0 048539 1256 1496T:ccalik/aesniclang -march=native -O3 -fwrapv -Qunused-arguments -fPIC -fPIE -gdwarf-4 -Wall2026090420260831
7395624592 0 048067 1256 1496T:ccalik/vpermclang -march=native -O2 -fwrapv -Qunused-arguments -fPIC -fPIE -gdwarf-4 -Wall2026090420260831
7441619704 0 038893 1192 1560T:ccalik/vpermgcc -march=native -mtune=native -Os -fwrapv -fPIC -fPIE -gdwarf-4 -Wall2026090420260831
7471619704 0 038893 1192 1560T:ccalik/aesnigcc -march=native -mtune=native -Os -fwrapv -fPIC -fPIE -gdwarf-4 -Wall2026090420260831
7654625560 0 048539 1256 1496T:ccalik/vpermclang -march=native -O3 -fwrapv -Qunused-arguments -fPIC -fPIE -gdwarf-4 -Wall2026090420260831
7752624592 0 048067 1256 1496T:ccalik/aesniclang -march=native -O2 -fwrapv -Qunused-arguments -fPIC -fPIE -gdwarf-4 -Wall2026090420260831
7953816756 0 040211 1256 1496T:ccalik/bitslicedclang -march=native -O2 -fwrapv -Qunused-arguments -fPIC -fPIE -gdwarf-4 -Wall2026090420260831
7982014266 0 034189 1248 1496T:ccalik/bitslicedclang -march=native -Os -fwrapv -Qunused-arguments -fPIC -fPIE -gdwarf-4 -Wall2026090420260831
8072716980 0 039971 1256 1496T:ccalik/bitslicedclang -march=native -O3 -fwrapv -Qunused-arguments -fPIC -fPIE -gdwarf-4 -Wall2026090420260831
8080324304 0 044205 1248 1496T:ccalik/aesniclang -march=native -Os -fwrapv -Qunused-arguments -fPIC -fPIE -gdwarf-4 -Wall2026090420260831
8111524304 0 044205 1248 1496T:ccalik/vpermclang -march=native -Os -fwrapv -Qunused-arguments -fPIC -fPIE -gdwarf-4 -Wall2026090420260831
8134515292 0 035895 1216 1592T:ccalik/bitslicedgcc -march=native -mtune=native -O -fwrapv -fPIC -fPIE -gdwarf-4 -Wall2026090420260831
8232925952 0 046267 1256 1496T:ccalik/aesniclang -march=native -O -fwrapv -Qunused-arguments -fPIC -fPIE -gdwarf-4 -Wall2026090420260831
8333125952 0 046267 1256 1496T:ccalik/vpermclang -march=native -O -fwrapv -Qunused-arguments -fPIC -fPIE -gdwarf-4 -Wall2026090420260831
8780517536 0 040199 1216 1592T:ccalik/bitslicedgcc -march=native -mtune=native -O3 -fwrapv -fPIC -fPIE -gdwarf-4 -Wall2026090420260831
8882715953 0 036903 1216 1592T:ccalik/bitslicedgcc -march=native -mtune=native -O2 -fwrapv -fPIC -fPIE -gdwarf-4 -Wall2026090420260831
9010015473 0 034645 1192 1560T:ccalik/bitslicedgcc -march=native -mtune=native -Os -fwrapv -fPIC -fPIE -gdwarf-4 -Wall2026090420260831
9570417672 0 037995 1256 1496T:ccalik/bitslicedclang -march=native -O -fwrapv -Qunused-arguments -fPIC -fPIE -gdwarf-4 -Wall2026090420260831
9627331472 0 054239 1216 1592T:sphlibgcc -march=native -mtune=native -O3 -fwrapv -fPIC -fPIE -gdwarf-4 -Wall2026090420260831
9678628426 0 049423 1216 1592T:sphlibgcc -march=native -mtune=native -O2 -fwrapv -fPIC -fPIE -gdwarf-4 -Wall2026090420260831
9874214040 0 036863 1216 1592T:sphlib-smallgcc -march=native -mtune=native -O3 -fwrapv -fPIC -fPIE -gdwarf-4 -Wall2026090420260831
9916021190 0 141823 1216 1624T:generic/opt64gcc -march=native -mtune=native -O -fwrapv -fPIC -fPIE -gdwarf-4 -Wall2026090420260831
9940828039 0 047293 1192 1560T:sphlibgcc -march=native -mtune=native -Os -fwrapv -fPIC -fPIE -gdwarf-4 -Wall2026090420260831
9975521510 0 142463 1216 1624T:generic/opt64gcc -march=native -mtune=native -O2 -fwrapv -fPIC -fPIE -gdwarf-4 -Wall2026090420260831
10051925806 0 148487 1216 1624T:generic/opt64gcc -march=native -mtune=native -O3 -fwrapv -fPIC -fPIE -gdwarf-4 -Wall2026090420260831
10127929145 0 049839 1216 1592T:sphlibgcc -march=native -mtune=native -O -fwrapv -fPIC -fPIE -gdwarf-4 -Wall2026090420260831
10393418999 0 1638685 1248 1528T:generic/opt32clang -march=native -Os -fwrapv -Qunused-arguments -fPIC -fPIE -gdwarf-4 -Wall2026090420260831
10393720879 0 140053 1192 1592T:generic/opt64gcc -march=native -mtune=native -Os -fwrapv -fPIC -fPIE -gdwarf-4 -Wall2026090420260831
10505612778 0 035883 1256 1496T:sphlib-smallclang -march=native -O3 -fwrapv -Qunused-arguments -fPIC -fPIE -gdwarf-4 -Wall2026090420260831
10520912655 0 036235 1256 1496T:sphlib-smallclang -march=native -O2 -fwrapv -Qunused-arguments -fPIC -fPIE -gdwarf-4 -Wall2026090420260831
10585529248 0 049779 1256 1496T:sphlibclang -march=native -O -fwrapv -Qunused-arguments -fPIC -fPIE -gdwarf-4 -Wall2026090420260831
10604124478 0 144253 1248 1496T:generic/opt64clang -march=native -Os -fwrapv -Qunused-arguments -fPIC -fPIE -gdwarf-4 -Wall2026090420260831
10796327426 0 047421 1248 1496T:sphlibclang -march=native -Os -fwrapv -Qunused-arguments -fPIC -fPIE -gdwarf-4 -Wall2026090420260831
10856913238 0 036323 1256 1496T:sphlib-smallclang -mcpu=native -O3 -fwrapv -Qunused-arguments -fPIC -fPIE -gdwarf-4 -Wall2026090420260831
10869620954 0 1643671 1216 1624T:generic/opt32gcc -march=native -mtune=native -O3 -fwrapv -fPIC -fPIE -gdwarf-4 -Wall2026090420260831
10876325485 0 1648611 1256 1528T:generic/opt32clang -march=native -O3 -fwrapv -Qunused-arguments -fPIC -fPIE -gdwarf-4 -Wall2026090420260831
10960925404 0 1648987 1256 1528T:generic/opt32clang -march=native -O2 -fwrapv -Qunused-arguments -fPIC -fPIE -gdwarf-4 -Wall2026090420260831
11108019746 0 1640735 1216 1624T:generic/opt32gcc -march=native -mtune=native -O2 -fwrapv -fPIC -fPIE -gdwarf-4 -Wall2026090420260831
11140328924 0 1652507 1256 1528T:powerpc/pp32cv2clang -march=native -O2 -fwrapv -Qunused-arguments -fPIC -fPIE -gdwarf-4 -Wall2026090420260831
11170317626 0 1636813 1192 1592T:generic/opt32gcc -march=native -mtune=native -Os -fwrapv -fPIC -fPIE -gdwarf-4 -Wall2026090420260831
11191711129 0 031699 1256 1496T:sphlib-smallclang -march=native -O -fwrapv -Qunused-arguments -fPIC -fPIE -gdwarf-4 -Wall2026090420260831
1122189204 0 028493 1192 1560T:sphlib-smallgcc -march=native -mtune=native -Os -fwrapv -fPIC -fPIE -gdwarf-4 -Wall2026090420260831
11284428973 0 1652099 1256 1528T:powerpc/pp32cv2clang -march=native -O3 -fwrapv -Qunused-arguments -fPIC -fPIE -gdwarf-4 -Wall2026090420260831
11452110114 0 031143 1216 1592T:sphlib-smallgcc -march=native -mtune=native -O2 -fwrapv -fPIC -fPIE -gdwarf-4 -Wall2026090420260831
11939219276 0 1639935 1216 1624T:generic/opt32gcc -march=native -mtune=native -O -fwrapv -fPIC -fPIE -gdwarf-4 -Wall2026090420260831
11996110265 0 031007 1216 1592T:sphlib-smallgcc -march=native -mtune=native -O -fwrapv -fPIC -fPIE -gdwarf-4 -Wall2026090420260831
12101623722 0 1643389 1248 1528T:powerpc/pp32cv2clang -march=native -Os -fwrapv -Qunused-arguments -fPIC -fPIE -gdwarf-4 -Wall2026090420260831
12473021999 0 1644987 1256 1528T:generic/opt32clang -mcpu=native -O3 -fwrapv -Qunused-arguments -fPIC -fPIE -gdwarf-4 -Wall2026090420260831
12721026015 0 1649019 1256 1528T:powerpc/pp32cv2clang -mcpu=native -O3 -fwrapv -Qunused-arguments -fPIC -fPIE -gdwarf-4 -Wall2026090420260831
12795224900 0 145355 1256 1496T:generic/opt64clang -march=native -O -fwrapv -Qunused-arguments -fPIC -fPIE -gdwarf-4 -Wall2026090420260831
12892537206 0 060275 1256 1496T:sphlibclang -mcpu=native -O3 -fwrapv -Qunused-arguments -fPIC -fPIE -gdwarf-4 -Wall2026090420260831
13055519924 0 1640387 1256 1528T:generic/opt32clang -march=native -O -fwrapv -Qunused-arguments -fPIC -fPIE -gdwarf-4 -Wall2026090420260831
13068436906 0 060555 1256 1496T:sphlibclang -march=native -O2 -fwrapv -Qunused-arguments -fPIC -fPIE -gdwarf-4 -Wall2026090420260831
13075937270 0 060443 1256 1496T:sphlibclang -march=native -O3 -fwrapv -Qunused-arguments -fPIC -fPIE -gdwarf-4 -Wall2026090420260831
1321889465 0 029509 1248 1496T:sphlib-smallclang -march=native -Os -fwrapv -Qunused-arguments -fPIC -fPIE -gdwarf-4 -Wall2026090420260831
13337128708 0 151739 1256 1496T:generic/opt64clang -march=native -O3 -fwrapv -Qunused-arguments -fPIC -fPIE -gdwarf-4 -Wall2026090420260831
13528328568 0 152123 1256 1496T:generic/opt64clang -march=native -O2 -fwrapv -Qunused-arguments -fPIC -fPIE -gdwarf-4 -Wall2026090420260831
14544832748 0 155747 1256 1496T:generic/opt64clang -mcpu=native -O3 -fwrapv -Qunused-arguments -fPIC -fPIE -gdwarf-4 -Wall2026090420260831
15483925538 0 1644749 1192 1592T:powerpc/pp32cv2gcc -march=native -mtune=native -Os -fwrapv -fPIC -fPIE -gdwarf-4 -Wall2026090420260831
15499624596 0 1645059 1256 1528T:powerpc/pp32cv2clang -march=native -O -fwrapv -Qunused-arguments -fPIC -fPIE -gdwarf-4 -Wall2026090420260831
16285731770 0 1654487 1216 1624T:powerpc/pp32cv2gcc -march=native -mtune=native -O3 -fwrapv -fPIC -fPIE -gdwarf-4 -Wall2026090420260831
17227828428 0 1649087 1216 1624T:powerpc/pp32cv2gcc -march=native -mtune=native -O -fwrapv -fPIC -fPIE -gdwarf-4 -Wall2026090420260831
17291530690 0 1651679 1216 1624T:powerpc/pp32cv2gcc -march=native -mtune=native -O2 -fwrapv -fPIC -fPIE -gdwarf-4 -Wall2026090420260831
18241519823 0 1642811 1256 1528T:powerpc/pp32cv1clang -mcpu=native -O3 -fwrapv -Qunused-arguments -fPIC -fPIE -gdwarf-4 -Wall2026090420260831
19746223809 0 1646931 1256 1528T:powerpc/pp32cv1clang -march=native -O3 -fwrapv -Qunused-arguments -fPIC -fPIE -gdwarf-4 -Wall2026090420260831
19747923760 0 1647323 1256 1528T:powerpc/pp32cv1clang -march=native -O2 -fwrapv -Qunused-arguments -fPIC -fPIE -gdwarf-4 -Wall2026090420260831
20581318810 0 1641527 1216 1624T:powerpc/pp32cv1gcc -march=native -mtune=native -O3 -fwrapv -fPIC -fPIE -gdwarf-4 -Wall2026090420260831
21275119540 0 1639197 1248 1528T:powerpc/pp32cv1clang -march=native -Os -fwrapv -Qunused-arguments -fPIC -fPIE -gdwarf-4 -Wall2026090420260831
21347917762 0 1638751 1216 1624T:powerpc/pp32cv1gcc -march=native -mtune=native -O2 -fwrapv -fPIC -fPIE -gdwarf-4 -Wall2026090420260831
22448116542 0 1635725 1192 1592T:powerpc/pp32cv1gcc -march=native -mtune=native -Os -fwrapv -fPIC -fPIE -gdwarf-4 -Wall2026090420260831
22534017612 0 1638271 1216 1624T:powerpc/pp32cv1gcc -march=native -mtune=native -O -fwrapv -fPIC -fPIE -gdwarf-4 -Wall2026090420260831
22877718292 0 1638755 1256 1528T:powerpc/pp32cv1clang -march=native -O -fwrapv -Qunused-arguments -fPIC -fPIE -gdwarf-4 -Wall2026090420260831

Compiler output


echo64.S: echo64.S:1064:2: error: '.att_syntax noprefix' is not supported: registers must have a '%' prefix in .att_syntax
echo64.S:  .att_syntax noprefix
echo64.S:  ^
echo64.S: echo64.S:1077:10: error: unknown token in expression
echo64.S:  movabsq $-9187201950435737472, %rax
echo64.S:          ^
echo64.S: echo64.S:1078:10: error: unknown token in expression
echo64.S:  movabsq $-9187201950435737472, %r11
echo64.S:          ^
echo64.S: echo64.S:1079:10: error: unknown token in expression
echo64.S:  movabsq $7599940337074203, %r10
echo64.S:          ^
echo64.S: echo64.S:1080:7: error: unknown token in expression
echo64.S:  movq %rax, MEM_CST+16(%rip)
echo64.S:       ^
echo64.S: echo64.S:1081:10: error: unknown token in expression
echo64.S:  movabsq $7599940337074203, %r9
echo64.S:          ^
echo64.S: echo64.S:1082:10: error: unknown token in expression
echo64.S:  movabsq $-72340172838076674, %rax
echo64.S:          ^
echo64.S: echo64.S:1083:10: error: unknown token in expression
echo64.S:  movabsq $72340172838076673, %r8
echo64.S:          ^
echo64.S: echo64.S:1084:10: error: unknown token in expression
echo64.S: ...

Number of similar (implementation,compiler) pairs: 5, namely:
ImplementationCompiler
T:aes/aes64clang -march=native -O2 -fwrapv -Qunused-arguments -fPIC -fPIE -gdwarf-4 -Wall (Debian_Clang_19.1.7_(3+b1))
T:aes/aes64clang -march=native -O3 -fwrapv -Qunused-arguments -fPIC -fPIE -gdwarf-4 -Wall (Debian_Clang_19.1.7_(3+b1))
T:aes/aes64clang -march=native -O -fwrapv -Qunused-arguments -fPIC -fPIE -gdwarf-4 -Wall (Debian_Clang_19.1.7_(3+b1))
T:aes/aes64clang -march=native -Os -fwrapv -Qunused-arguments -fPIC -fPIE -gdwarf-4 -Wall (Debian_Clang_19.1.7_(3+b1))
T:aes/aes64clang -mcpu=native -O3 -fwrapv -Qunused-arguments -fPIC -fPIE -gdwarf-4 -Wall (Debian_Clang_19.1.7_(3+b1))

Compiler output


try.c: /usr/bin/ld: libcrypto_hash_echo512.a(echo64.o): relocation R_X86_64_32S against symbol `OLDCV' can not be used when making a PIE object; recompile with -fPIE
try.c: /usr/bin/ld: failed to set dynamic section sizes: bad value
try.c: collect2: error: ld returned 1 exit status

Number of similar (implementation,compiler) pairs: 4, namely:
ImplementationCompiler
T:aes/aes64gcc -march=native -mtune=native -O2 -fwrapv -fPIC -fPIE -gdwarf-4 -Wall (14.2.0)
T:aes/aes64gcc -march=native -mtune=native -O3 -fwrapv -fPIC -fPIE -gdwarf-4 -Wall (14.2.0)
T:aes/aes64gcc -march=native -mtune=native -O -fwrapv -fPIC -fPIE -gdwarf-4 -Wall (14.2.0)
T:aes/aes64gcc -march=native -mtune=native -Os -fwrapv -fPIC -fPIE -gdwarf-4 -Wall (14.2.0)

Compiler output


echo64.S: echo64.S:248:2: error: invalid instruction mnemonic 'movzbl'
echo64.S:  movzbl ebp, ah
echo64.S:  ^~~~~~
echo64.S: echo64.S:251:2: error: invalid instruction mnemonic 'movzbl'
echo64.S:  movzbl esi, al
echo64.S:  ^~~~~~
echo64.S: echo64.S:263:2: error: invalid instruction mnemonic 'movzbl'
echo64.S:  movzbl ebp, bl
echo64.S:  ^~~~~~
echo64.S: echo64.S:266:2: error: invalid instruction mnemonic 'movzbl'
echo64.S:  movzbl esi, bh
echo64.S:  ^~~~~~
echo64.S: echo64.S:278:2: error: invalid instruction mnemonic 'movzbl'
echo64.S:  movzbl ebp, al
echo64.S:  ^~~~~~
echo64.S: echo64.S:281:2: error: invalid instruction mnemonic 'movzbl'
echo64.S:  movzbl esi, ah
echo64.S:  ^~~~~~
echo64.S: echo64.S:293:2: error: invalid instruction mnemonic 'movzbl'
echo64.S:  movzbl ebp, bh
echo64.S:  ^~~~~~
echo64.S: echo64.S:296:2: error: invalid instruction mnemonic 'movzbl'
echo64.S:  movzbl esi, bl
echo64.S:  ^~~~~~
echo64.S: echo64.S:308:2: error: invalid instruction mnemonic 'movzbl'
echo64.S: ...

Number of similar (implementation,compiler) pairs: 5, namely:
ImplementationCompiler
T:athlon/athlon64clang -march=native -O2 -fwrapv -Qunused-arguments -fPIC -fPIE -gdwarf-4 -Wall (Debian_Clang_19.1.7_(3+b1))
T:athlon/athlon64clang -march=native -O3 -fwrapv -Qunused-arguments -fPIC -fPIE -gdwarf-4 -Wall (Debian_Clang_19.1.7_(3+b1))
T:athlon/athlon64clang -march=native -O -fwrapv -Qunused-arguments -fPIC -fPIE -gdwarf-4 -Wall (Debian_Clang_19.1.7_(3+b1))
T:athlon/athlon64clang -march=native -Os -fwrapv -Qunused-arguments -fPIC -fPIE -gdwarf-4 -Wall (Debian_Clang_19.1.7_(3+b1))
T:athlon/athlon64clang -mcpu=native -O3 -fwrapv -Qunused-arguments -fPIC -fPIE -gdwarf-4 -Wall (Debian_Clang_19.1.7_(3+b1))

Compiler output


echo64.S: echo64.c: Assembler messages:
echo64.S: echo64.c:519: Error: no such instruction: `movzbl ebp,ah'
echo64.S: echo64.c:519: Error: no such instruction: `movzbl esi,al'
echo64.S: echo64.c:519: Error: no such instruction: `movzbl ebp,bl'
echo64.S: echo64.c:519: Error: no such instruction: `movzbl esi,bh'
echo64.S: echo64.c:519: Error: no such instruction: `movzbl ebp,al'
echo64.S: echo64.c:519: Error: no such instruction: `movzbl esi,ah'
echo64.S: echo64.c:519: Error: no such instruction: `movzbl ebp,bh'
echo64.S: echo64.c:519: Error: no such instruction: `movzbl esi,bl'
echo64.S: echo64.c:519: Error: no such instruction: `movzbl ebp,ah'
echo64.S: echo64.c:519: Error: no such instruction: `movzbl esi,al'
echo64.S: echo64.c:519: Error: no such instruction: `movzbl ebp,bl'
echo64.S: echo64.c:519: Error: no such instruction: `movzbl esi,bh'
echo64.S: echo64.c:519: Error: no such instruction: `movzbl ebp,al'
echo64.S: echo64.c:519: Error: no such instruction: `movzbl esi,ah'
echo64.S: echo64.c:519: Error: no such instruction: `movzbl ebp,bl'
echo64.S: echo64.c:519: Error: no such instruction: `movzbl esi,bh'
echo64.S: echo64.c:519: Error: no such instruction: `movzbl ebp,dl'
echo64.S: echo64.c:519: Error: no such instruction: `movzbl esi,dh'
echo64.S: echo64.c:519: Error: no such instruction: `movzbl ebp,ch'
echo64.S: echo64.c:519: Error: no such instruction: `movzbl esi,cl'
echo64.S: echo64.c:519: Error: no such instruction: `movzbl ebp,cl'
echo64.S: echo64.c:519: Error: no such instruction: `movzbl esi,ch'
echo64.S: echo64.c:519: Error: no such instruction: `movzbl ebp,dh'
echo64.S: echo64.c:519: Error: no such instruction: `movzbl esi,dl'
echo64.S: ...

Number of similar (implementation,compiler) pairs: 4, namely:
ImplementationCompiler
T:athlon/athlon64gcc -march=native -mtune=native -O2 -fwrapv -fPIC -fPIE -gdwarf-4 -Wall (14.2.0)
T:athlon/athlon64gcc -march=native -mtune=native -O3 -fwrapv -fPIC -fPIE -gdwarf-4 -Wall (14.2.0)
T:athlon/athlon64gcc -march=native -mtune=native -O -fwrapv -fPIC -fPIE -gdwarf-4 -Wall (14.2.0)
T:athlon/athlon64gcc -march=native -mtune=native -Os -fwrapv -fPIC -fPIE -gdwarf-4 -Wall (14.2.0)

Compiler output


hash.c: hash.c:263:4: error: always_inline function '_mm_shuffle_epi8' requires target feature 'ssse3', but would be inlined into function 'Compress' that is compiled without support for 'ssse3'
hash.c:   263 |                         TRANSFORM(_state[i][j], _k_ipt, t1, t2);
hash.c:       |                         ^
hash.c: ./vperm.h:52:7: note: expanded from macro 'TRANSFORM'
hash.c:    52 |         t1 = _mm_shuffle_epi8(*((__m128i*)table + 1), t1);\
hash.c:       |              ^
hash.c: hash.c:263:4: error: always_inline function '_mm_shuffle_epi8' requires target feature 'ssse3', but would be inlined into function 'Compress' that is compiled without support for 'ssse3'
hash.c: ./vperm.h:53:7: note: expanded from macro 'TRANSFORM'
hash.c:    53 |         x  = _mm_shuffle_epi8(*((__m128i*)table + 0), x);\
hash.c:       |              ^
hash.c: hash.c:280:5: error: always_inline function '_mm_shuffle_epi8' requires target feature 'ssse3', but would be inlined into function 'Compress' that is compiled without support for 'ssse3'
hash.c:   280 |                                 TRANSFORM(_state[i][j], _k_ipt, t1, t2);
hash.c:       |                                 ^
hash.c: ./vperm.h:52:7: note: expanded from macro 'TRANSFORM'
hash.c:    52 |         t1 = _mm_shuffle_epi8(*((__m128i*)table + 1), t1);\
hash.c:       |              ^
hash.c: hash.c:280:5: error: always_inline function '_mm_shuffle_epi8' requires target feature 'ssse3', but would be inlined into function 'Compress' that is compiled without support for 'ssse3'
hash.c: ./vperm.h:53:7: note: expanded from macro 'TRANSFORM'
hash.c:    53 |         x  = _mm_shuffle_epi8(*((__m128i*)table + 0), x);\
hash.c:       |              ^
hash.c: hash.c:305:4: error: always_inline function '_mm_shuffle_epi8' requires target feature 'ssse3', but would be inlined into function 'Compress' that is compiled without support for 'ssse3'
hash.c:   305 |                         ECHO_SUB_AND_MIX(_state, 0, 0, _state2, 0, 0, 1, 2, 3);
hash.c:       |                         ^
hash.c: hash.c:124:5: note: expanded from macro 'ECHO_SUB_AND_MIX'
hash.c:   124 |                                 AES_ROUND_VPERM_CORE(state[i][j], t1, t2, t3, t4, s1, s2, s3);\
hash.c: ...

Number of similar (implementation,compiler) pairs: 2, namely:
ImplementationCompiler
T:ccalik/aesniclang -mcpu=native -O3 -fwrapv -Qunused-arguments -fPIC -fPIE -gdwarf-4 -Wall (Debian_Clang_19.1.7_(3+b1))
T:ccalik/vpermclang -mcpu=native -O3 -fwrapv -Qunused-arguments -fPIC -fPIE -gdwarf-4 -Wall (Debian_Clang_19.1.7_(3+b1))

Compiler output


hash.c: In file included from hash.c:20:
hash.c: vperm.h:57:9: warning: multi-line comment [-Wcomment]
hash.c:    57 |         //t2 = _mm_shuffle_epi8(table[0], x);\
hash.c:       |         ^

Number of similar (implementation,compiler) pairs: 8, namely:
ImplementationCompiler
T:ccalik/aesnigcc -march=native -mtune=native -O2 -fwrapv -fPIC -fPIE -gdwarf-4 -Wall (14.2.0)
T:ccalik/aesnigcc -march=native -mtune=native -O3 -fwrapv -fPIC -fPIE -gdwarf-4 -Wall (14.2.0)
T:ccalik/aesnigcc -march=native -mtune=native -O -fwrapv -fPIC -fPIE -gdwarf-4 -Wall (14.2.0)
T:ccalik/aesnigcc -march=native -mtune=native -Os -fwrapv -fPIC -fPIE -gdwarf-4 -Wall (14.2.0)
T:ccalik/vpermgcc -march=native -mtune=native -O2 -fwrapv -fPIC -fPIE -gdwarf-4 -Wall (14.2.0)
T:ccalik/vpermgcc -march=native -mtune=native -O3 -fwrapv -fPIC -fPIE -gdwarf-4 -Wall (14.2.0)
T:ccalik/vpermgcc -march=native -mtune=native -O -fwrapv -fPIC -fPIE -gdwarf-4 -Wall (14.2.0)
T:ccalik/vpermgcc -march=native -mtune=native -Os -fwrapv -fPIC -fPIE -gdwarf-4 -Wall (14.2.0)

Compiler output


hash.c: hash.c:468:4: error: always_inline function '_mm_shuffle_epi8' requires target feature 'ssse3', but would be inlined into function 'Compress' that is compiled without support for 'ssse3'
hash.c:   468 |                         AES_SHIFT_ROWS(_state);
hash.c:       |                         ^
hash.c: hash.c:141:14: note: expanded from macro 'AES_SHIFT_ROWS'
hash.c:   141 |                         s[0][0] = _mm_shuffle_epi8(s[0][0], M128(shiftrowsslice));\
hash.c:       |                                   ^
hash.c: hash.c:468:4: error: always_inline function '_mm_shuffle_epi8' requires target feature 'ssse3', but would be inlined into function 'Compress' that is compiled without support for 'ssse3'
hash.c: hash.c:142:14: note: expanded from macro 'AES_SHIFT_ROWS'
hash.c:   142 |                         s[0][1] = _mm_shuffle_epi8(s[0][1], M128(shiftrowsslice));\
hash.c:       |                                   ^
hash.c: hash.c:468:4: error: always_inline function '_mm_shuffle_epi8' requires target feature 'ssse3', but would be inlined into function 'Compress' that is compiled without support for 'ssse3'
hash.c: hash.c:143:14: note: expanded from macro 'AES_SHIFT_ROWS'
hash.c:   143 |                         s[0][2] = _mm_shuffle_epi8(s[0][2], M128(shiftrowsslice));\
hash.c:       |                                   ^
hash.c: hash.c:468:4: error: always_inline function '_mm_shuffle_epi8' requires target feature 'ssse3', but would be inlined into function 'Compress' that is compiled without support for 'ssse3'
hash.c: hash.c:144:14: note: expanded from macro 'AES_SHIFT_ROWS'
hash.c:   144 |                         s[0][3] = _mm_shuffle_epi8(s[0][3], M128(shiftrowsslice));\
hash.c:       |                                   ^
hash.c: hash.c:468:4: error: always_inline function '_mm_shuffle_epi8' requires target feature 'ssse3', but would be inlined into function 'Compress' that is compiled without support for 'ssse3'
hash.c: hash.c:145:14: note: expanded from macro 'AES_SHIFT_ROWS'
hash.c:   145 |                         s[1][0] = _mm_shuffle_epi8(s[1][0], M128(shiftrowsslice));\
hash.c:       |                                   ^
hash.c: hash.c:468:4: error: always_inline function '_mm_shuffle_epi8' requires target feature 'ssse3', but would be inlined into function 'Compress' that is compiled without support for 'ssse3'
hash.c: hash.c:146:14: note: expanded from macro 'AES_SHIFT_ROWS'
hash.c:   146 |                         s[1][1] = _mm_shuffle_epi8(s[1][1], M128(shiftrowsslice));\
hash.c: ...

Number of similar (implementation,compiler) pairs: 1, namely:
ImplementationCompiler
T:ccalik/bitslicedclang -mcpu=native -O3 -fwrapv -Qunused-arguments -fPIC -fPIE -gdwarf-4 -Wall (Debian_Clang_19.1.7_(3+b1))

Compiler output


echo64.S: echo64.S:224:2: error: invalid instruction mnemonic 'movzbl'
echo64.S:  movzbl ebp, ah
echo64.S:  ^~~~~~
echo64.S: echo64.S:230:2: error: invalid instruction mnemonic 'movzbl'
echo64.S:  movzbl esi, al
echo64.S:  ^~~~~~
echo64.S: echo64.S:239:2: error: invalid instruction mnemonic 'movzbl'
echo64.S:  movzbl ebp, bl
echo64.S:  ^~~~~~
echo64.S: echo64.S:245:2: error: invalid instruction mnemonic 'movzbl'
echo64.S:  movzbl esi, bh
echo64.S:  ^~~~~~
echo64.S: echo64.S:254:2: error: invalid instruction mnemonic 'movzbl'
echo64.S:  movzbl ebp, al
echo64.S:  ^~~~~~
echo64.S: echo64.S:260:2: error: invalid instruction mnemonic 'movzbl'
echo64.S:  movzbl esi, ah
echo64.S:  ^~~~~~
echo64.S: echo64.S:269:2: error: invalid instruction mnemonic 'movzbl'
echo64.S:  movzbl ebp, bh
echo64.S:  ^~~~~~
echo64.S: echo64.S:275:2: error: invalid instruction mnemonic 'movzbl'
echo64.S:  movzbl esi, bl
echo64.S:  ^~~~~~
echo64.S: echo64.S:284:2: error: invalid instruction mnemonic 'movzbl'
echo64.S: ...

Number of similar (implementation,compiler) pairs: 5, namely:
ImplementationCompiler
T:core2/core2v64clang -march=native -O2 -fwrapv -Qunused-arguments -fPIC -fPIE -gdwarf-4 -Wall (Debian_Clang_19.1.7_(3+b1))
T:core2/core2v64clang -march=native -O3 -fwrapv -Qunused-arguments -fPIC -fPIE -gdwarf-4 -Wall (Debian_Clang_19.1.7_(3+b1))
T:core2/core2v64clang -march=native -O -fwrapv -Qunused-arguments -fPIC -fPIE -gdwarf-4 -Wall (Debian_Clang_19.1.7_(3+b1))
T:core2/core2v64clang -march=native -Os -fwrapv -Qunused-arguments -fPIC -fPIE -gdwarf-4 -Wall (Debian_Clang_19.1.7_(3+b1))
T:core2/core2v64clang -mcpu=native -O3 -fwrapv -Qunused-arguments -fPIC -fPIE -gdwarf-4 -Wall (Debian_Clang_19.1.7_(3+b1))

Compiler output


echo64.S: echo64.c: Assembler messages:
echo64.S: echo64.c:473: Error: no such instruction: `movzbl ebp,ah'
echo64.S: echo64.c:473: Error: no such instruction: `movzbl esi,al'
echo64.S: echo64.c:473: Error: no such instruction: `movzbl ebp,bl'
echo64.S: echo64.c:473: Error: no such instruction: `movzbl esi,bh'
echo64.S: echo64.c:473: Error: no such instruction: `movzbl ebp,al'
echo64.S: echo64.c:473: Error: no such instruction: `movzbl esi,ah'
echo64.S: echo64.c:473: Error: no such instruction: `movzbl ebp,bh'
echo64.S: echo64.c:473: Error: no such instruction: `movzbl esi,bl'
echo64.S: echo64.c:473: Error: no such instruction: `movzbl ebp,ah'
echo64.S: echo64.c:473: Error: no such instruction: `movzbl esi,al'
echo64.S: echo64.c:473: Error: no such instruction: `movzbl ebp,bl'
echo64.S: echo64.c:473: Error: no such instruction: `movzbl esi,bh'
echo64.S: echo64.c:473: Error: no such instruction: `movzbl ebp,al'
echo64.S: echo64.c:473: Error: no such instruction: `movzbl esi,ah'
echo64.S: echo64.c:473: Error: no such instruction: `movzbl ebp,bl'
echo64.S: echo64.c:473: Error: no such instruction: `movzbl esi,bh'
echo64.S: echo64.c:473: Error: no such instruction: `movzbl ebp,dl'
echo64.S: echo64.c:473: Error: no such instruction: `movzbl esi,dh'
echo64.S: echo64.c:473: Error: no such instruction: `movzbl ebp,ch'
echo64.S: echo64.c:473: Error: no such instruction: `movzbl esi,cl'
echo64.S: echo64.c:473: Error: no such instruction: `movzbl ebp,cl'
echo64.S: echo64.c:473: Error: no such instruction: `movzbl esi,ch'
echo64.S: echo64.c:473: Error: no such instruction: `movzbl ebp,dh'
echo64.S: echo64.c:473: Error: no such instruction: `movzbl esi,dl'
echo64.S: ...

Number of similar (implementation,compiler) pairs: 4, namely:
ImplementationCompiler
T:core2/core2v64gcc -march=native -mtune=native -O2 -fwrapv -fPIC -fPIE -gdwarf-4 -Wall (14.2.0)
T:core2/core2v64gcc -march=native -mtune=native -O3 -fwrapv -fPIC -fPIE -gdwarf-4 -Wall (14.2.0)
T:core2/core2v64gcc -march=native -mtune=native -O -fwrapv -fPIC -fPIE -gdwarf-4 -Wall (14.2.0)
T:core2/core2v64gcc -march=native -mtune=native -Os -fwrapv -fPIC -fPIE -gdwarf-4 -Wall (14.2.0)

Compiler output


echo32.c: echo32.c:105:18: warning: unused variable 'j' [-Wunused-variable]
echo32.c:   105 |         unsigned int i, j;
echo32.c:       |                         ^
echo32.c: echo32.c:106:16: warning: unused variable 'endianess' [-Wunused-variable]
echo32.c:   106 |         unsigned char endianess;
echo32.c:       |                       ^~~~~~~~~
echo32.c: echo32.c:337:15: warning: unused variable 'i' [-Wunused-variable]
echo32.c:   337 |         unsigned int i;
echo32.c:       |                      ^
echo32.c: echo32.c:338:21: warning: unused variable 'c0' [-Wunused-variable]
echo32.c:   338 |         unsigned long long c0, c1;
echo32.c:       |                            ^~
echo32.c: echo32.c:338:25: warning: unused variable 'c1' [-Wunused-variable]
echo32.c:   338 |         unsigned long long c0, c1;
echo32.c:       |                                ^~
echo32.c: echo32.c:436:21: warning: unused variable 'hashlen' [-Wunused-variable]
echo32.c:   436 |         unsigned short int hashlen = 0;
echo32.c:       |                            ^~~~~~~
echo32.c: echo32.c:437:21: warning: unused variable 'messlen_l' [-Wunused-variable]
echo32.c:   437 |         unsigned long long messlen_l = 0;
echo32.c:       |                            ^~~~~~~~~
echo32.c: echo32.c:438:21: warning: unused variable 'messlen_h' [-Wunused-variable]
echo32.c:   438 |         unsigned long long messlen_h = 0;
echo32.c:       |                            ^~~~~~~~~
echo32.c: 8 warnings generated.

Number of similar (implementation,compiler) pairs: 5, namely:
ImplementationCompiler
T:generic/opt32clang -march=native -O2 -fwrapv -Qunused-arguments -fPIC -fPIE -gdwarf-4 -Wall (Debian_Clang_19.1.7_(3+b1))
T:generic/opt32clang -march=native -O3 -fwrapv -Qunused-arguments -fPIC -fPIE -gdwarf-4 -Wall (Debian_Clang_19.1.7_(3+b1))
T:generic/opt32clang -march=native -O -fwrapv -Qunused-arguments -fPIC -fPIE -gdwarf-4 -Wall (Debian_Clang_19.1.7_(3+b1))
T:generic/opt32clang -march=native -Os -fwrapv -Qunused-arguments -fPIC -fPIE -gdwarf-4 -Wall (Debian_Clang_19.1.7_(3+b1))
T:generic/opt32clang -mcpu=native -O3 -fwrapv -Qunused-arguments -fPIC -fPIE -gdwarf-4 -Wall (Debian_Clang_19.1.7_(3+b1))

Compiler output


echo32.c: echo32.c: In function 'Init':
echo32.c: echo32.c:106:23: warning: unused variable 'endianess' [-Wunused-variable]
echo32.c:   106 |         unsigned char endianess;
echo32.c:       |                       ^~~~~~~~~
echo32.c: echo32.c:105:25: warning: unused variable 'j' [-Wunused-variable]
echo32.c:   105 |         unsigned int i, j;
echo32.c:       |                         ^
echo32.c: echo32.c: In function 'Compress':
echo32.c: echo32.c:338:32: warning: unused variable 'c1' [-Wunused-variable]
echo32.c:   338 |         unsigned long long c0, c1;
echo32.c:       |                                ^~
echo32.c: echo32.c:338:28: warning: unused variable 'c0' [-Wunused-variable]
echo32.c:   338 |         unsigned long long c0, c1;
echo32.c:       |                            ^~
echo32.c: echo32.c:337:22: warning: unused variable 'i' [-Wunused-variable]
echo32.c:   337 |         unsigned int i;
echo32.c:       |                      ^
echo32.c: echo32.c: In function 'Final':
echo32.c: echo32.c:438:28: warning: unused variable 'messlen_h' [-Wunused-variable]
echo32.c:   438 |         unsigned long long messlen_h = 0;
echo32.c:       |                            ^~~~~~~~~
echo32.c: echo32.c:437:28: warning: unused variable 'messlen_l' [-Wunused-variable]
echo32.c:   437 |         unsigned long long messlen_l = 0;
echo32.c:       |                            ^~~~~~~~~
echo32.c: echo32.c:436:28: warning: unused variable 'hashlen' [-Wunused-variable]
echo32.c: ...

Number of similar (implementation,compiler) pairs: 4, namely:
ImplementationCompiler
T:generic/opt32gcc -march=native -mtune=native -O2 -fwrapv -fPIC -fPIE -gdwarf-4 -Wall (14.2.0)
T:generic/opt32gcc -march=native -mtune=native -O3 -fwrapv -fPIC -fPIE -gdwarf-4 -Wall (14.2.0)
T:generic/opt32gcc -march=native -mtune=native -O -fwrapv -fPIC -fPIE -gdwarf-4 -Wall (14.2.0)
T:generic/opt32gcc -march=native -mtune=native -Os -fwrapv -fPIC -fPIE -gdwarf-4 -Wall (14.2.0)

Compiler output


echo64.c: echo64.c:290:30: warning: unused variable 'WT5' [-Wunused-variable]
echo64.c:   290 |     WT0, WT1, WT2, WT3, WT4, WT5;
echo64.c:       |                              ^~~
echo64.c: echo64.c:432:16: warning: unused variable 'i' [-Wunused-variable]
echo64.c:   432 |   unsigned int i;
echo64.c:       |                ^
echo64.c: echo64.c:501:29: warning: passing 'const unsigned char *' to parameter of type 'BitSequence *' (aka 'unsigned char *') discards qualifiers [-Wincompatible-pointer-types-discards-qualifiers]
echo64.c:   501 |   if (Hash(CRYPTO_BYTES * 8,in,inlen * 8,out) == SUCCESS) return 0;
echo64.c:       |                             ^~
echo64.c: echo64.c:488:46: note: passing argument to parameter 'data' here
echo64.c:   488 | HashReturn Hash(int hashbitlen, BitSequence *data, DataLength databitlen, BitSequence *hashval)
echo64.c:       |                                              ^
echo64.c: 3 warnings generated.

Number of similar (implementation,compiler) pairs: 5, namely:
ImplementationCompiler
T:generic/opt64clang -march=native -O2 -fwrapv -Qunused-arguments -fPIC -fPIE -gdwarf-4 -Wall (Debian_Clang_19.1.7_(3+b1))
T:generic/opt64clang -march=native -O3 -fwrapv -Qunused-arguments -fPIC -fPIE -gdwarf-4 -Wall (Debian_Clang_19.1.7_(3+b1))
T:generic/opt64clang -march=native -O -fwrapv -Qunused-arguments -fPIC -fPIE -gdwarf-4 -Wall (Debian_Clang_19.1.7_(3+b1))
T:generic/opt64clang -march=native -Os -fwrapv -Qunused-arguments -fPIC -fPIE -gdwarf-4 -Wall (Debian_Clang_19.1.7_(3+b1))
T:generic/opt64clang -mcpu=native -O3 -fwrapv -Qunused-arguments -fPIC -fPIE -gdwarf-4 -Wall (Debian_Clang_19.1.7_(3+b1))

Compiler output


echo64.c: echo64.c: In function 'Compress':
echo64.c: echo64.c:290:30: warning: unused variable 'WT5' [-Wunused-variable]
echo64.c:   290 |     WT0, WT1, WT2, WT3, WT4, WT5;
echo64.c:       |                              ^~~
echo64.c: echo64.c: In function 'Final':
echo64.c: echo64.c:432:16: warning: unused variable 'i' [-Wunused-variable]
echo64.c:   432 |   unsigned int i;
echo64.c:       |                ^
echo64.c: echo64.c: In function 'crypto_hash_echo512_generic_opt64_timingleaks':
echo64.c: echo64.c:501:29: warning: passing argument 2 of 'Hash' discards 'const' qualifier from pointer target type [-Wdiscarded-qualifiers]
echo64.c:   501 |   if (Hash(CRYPTO_BYTES * 8,in,inlen * 8,out) == SUCCESS) return 0;
echo64.c:       |                             ^~
echo64.c: echo64.c:488:46: note: expected 'BitSequence *' {aka 'unsigned char *'} but argument is of type 'const unsigned char *'
echo64.c:   488 | HashReturn Hash(int hashbitlen, BitSequence *data, DataLength databitlen, BitSequence *hashval)
echo64.c:       |                                 ~~~~~~~~~~~~~^~~~

Number of similar (implementation,compiler) pairs: 4, namely:
ImplementationCompiler
T:generic/opt64gcc -march=native -mtune=native -O2 -fwrapv -fPIC -fPIE -gdwarf-4 -Wall (14.2.0)
T:generic/opt64gcc -march=native -mtune=native -O3 -fwrapv -fPIC -fPIE -gdwarf-4 -Wall (14.2.0)
T:generic/opt64gcc -march=native -mtune=native -O -fwrapv -fPIC -fPIE -gdwarf-4 -Wall (14.2.0)
T:generic/opt64gcc -march=native -mtune=native -Os -fwrapv -fPIC -fPIE -gdwarf-4 -Wall (14.2.0)

Compiler output


echo32.S: echo32.S:323:2: error: invalid instruction mnemonic 'addd'
echo32.S:  addd [SHA3_CNT], 1
echo32.S:  ^~~~
echo32.S: echo32.S:587:2: error: invalid instruction mnemonic 'addd'
echo32.S:  addd [SHA3_CNT], 1
echo32.S:  ^~~~
echo32.S: echo32.S:851:2: error: invalid instruction mnemonic 'addd'
echo32.S:  addd [SHA3_CNT], 1
echo32.S:  ^~~~
echo32.S: echo32.S:1115:2: error: invalid instruction mnemonic 'addd'
echo32.S:  addd [SHA3_CNT], 1
echo32.S:  ^~~~
echo32.S: echo32.S:1379:2: error: invalid instruction mnemonic 'addd'
echo32.S:  addd [SHA3_CNT], 1
echo32.S:  ^~~~
echo32.S: echo32.S:1643:2: error: invalid instruction mnemonic 'addd'
echo32.S:  addd [SHA3_CNT], 1
echo32.S:  ^~~~
echo32.S: echo32.S:1907:2: error: invalid instruction mnemonic 'addd'
echo32.S:  addd [SHA3_CNT], 1
echo32.S:  ^~~~
echo32.S: echo32.S:2171:2: error: invalid instruction mnemonic 'addd'
echo32.S:  addd [SHA3_CNT], 1
echo32.S:  ^~~~
echo32.S: echo32.S:2435:2: error: invalid instruction mnemonic 'addd'
echo32.S: ...

Number of similar (implementation,compiler) pairs: 5, namely:
ImplementationCompiler
T:pentium/pentium4v64v1clang -march=native -O2 -fwrapv -Qunused-arguments -fPIC -fPIE -gdwarf-4 -Wall (Debian_Clang_19.1.7_(3+b1))
T:pentium/pentium4v64v1clang -march=native -O3 -fwrapv -Qunused-arguments -fPIC -fPIE -gdwarf-4 -Wall (Debian_Clang_19.1.7_(3+b1))
T:pentium/pentium4v64v1clang -march=native -O -fwrapv -Qunused-arguments -fPIC -fPIE -gdwarf-4 -Wall (Debian_Clang_19.1.7_(3+b1))
T:pentium/pentium4v64v1clang -march=native -Os -fwrapv -Qunused-arguments -fPIC -fPIE -gdwarf-4 -Wall (Debian_Clang_19.1.7_(3+b1))
T:pentium/pentium4v64v1clang -mcpu=native -O3 -fwrapv -Qunused-arguments -fPIC -fPIE -gdwarf-4 -Wall (Debian_Clang_19.1.7_(3+b1))

Compiler output


echo32.S: echo32.c: Assembler messages:
echo32.S: echo32.c:545: Warning: mnemonic suffix used with `add'
echo32.S: echo32.c:545: Warning: NOTE: Such forms are deprecated and will be rejected by a future version of the assembler
echo32.S: echo32.c:545: Warning: mnemonic suffix used with `add'
echo32.S: echo32.c:545: Warning: mnemonic suffix used with `add'
echo32.S: echo32.c:545: Warning: mnemonic suffix used with `add'
echo32.S: echo32.c:546: Warning: mnemonic suffix used with `add'
echo32.S: echo32.c:546: Warning: mnemonic suffix used with `add'
echo32.S: echo32.c:546: Warning: mnemonic suffix used with `add'
echo32.S: echo32.c:546: Warning: mnemonic suffix used with `add'
echo32.S: echo32.c:547: Warning: mnemonic suffix used with `add'
echo32.S: echo32.c:547: Warning: mnemonic suffix used with `add'
echo32.S: echo32.c:547: Warning: mnemonic suffix used with `add'
echo32.S: echo32.c:547: Warning: mnemonic suffix used with `add'
echo32.S: echo32.c:548: Warning: mnemonic suffix used with `add'
echo32.S: echo32.c:548: Warning: mnemonic suffix used with `add'
echo32.S: echo32.c:548: Warning: mnemonic suffix used with `add'
echo32.S: echo32.c:548: Warning: mnemonic suffix used with `add'
echo32.S: echo32.c:550: Warning: mnemonic suffix used with `sub'
echo32.S: echo32.c:577: Warning: mnemonic suffix used with `add'
echo32.S: echo32.c:577: Warning: mnemonic suffix used with `add'
echo32.S: echo32.c:577: Warning: mnemonic suffix used with `add'
echo32.S: echo32.c:577: Warning: mnemonic suffix used with `add'
echo32.S: echo32.c:577: Warning: mnemonic suffix used with `add'
echo32.S: echo32.c:577: Warning: mnemonic suffix used with `add'
echo32.S: ...
try.c: /usr/bin/ld: libcrypto_hash_echo512.a(echo32.o): relocation R_X86_64_32S against symbol `SHA3_R' can not be used when making a PIE object; recompile with -fPIE
try.c: /usr/bin/ld: failed to set dynamic section sizes: bad value
try.c: collect2: error: ld returned 1 exit status

Number of similar (implementation,compiler) pairs: 4, namely:
ImplementationCompiler
T:pentium/pentium4v64v1gcc -march=native -mtune=native -O2 -fwrapv -fPIC -fPIE -gdwarf-4 -Wall (14.2.0)
T:pentium/pentium4v64v1gcc -march=native -mtune=native -O3 -fwrapv -fPIC -fPIE -gdwarf-4 -Wall (14.2.0)
T:pentium/pentium4v64v1gcc -march=native -mtune=native -O -fwrapv -fPIC -fPIE -gdwarf-4 -Wall (14.2.0)
T:pentium/pentium4v64v1gcc -march=native -mtune=native -Os -fwrapv -fPIC -fPIE -gdwarf-4 -Wall (14.2.0)

Compiler output


echo64.S: echo64.S:371:2: error: invalid instruction mnemonic 'addd'
echo64.S:  addd [SHA3_CNT], 1
echo64.S:  ^~~~
echo64.S: echo64.S:635:2: error: invalid instruction mnemonic 'addd'
echo64.S:  addd [SHA3_CNT], 1
echo64.S:  ^~~~
echo64.S: echo64.S:899:2: error: invalid instruction mnemonic 'addd'
echo64.S:  addd [SHA3_CNT], 1
echo64.S:  ^~~~
echo64.S: echo64.S:1163:2: error: invalid instruction mnemonic 'addd'
echo64.S:  addd [SHA3_CNT], 1
echo64.S:  ^~~~
echo64.S: echo64.S:1427:2: error: invalid instruction mnemonic 'addd'
echo64.S:  addd [SHA3_CNT], 1
echo64.S:  ^~~~
echo64.S: echo64.S:1691:2: error: invalid instruction mnemonic 'addd'
echo64.S:  addd [SHA3_CNT], 1
echo64.S:  ^~~~
echo64.S: echo64.S:1955:2: error: invalid instruction mnemonic 'addd'
echo64.S:  addd [SHA3_CNT], 1
echo64.S:  ^~~~
echo64.S: echo64.S:2219:2: error: invalid instruction mnemonic 'addd'
echo64.S:  addd [SHA3_CNT], 1
echo64.S:  ^~~~
echo64.S: echo64.S:2483:2: error: invalid instruction mnemonic 'addd'
echo64.S: ...

Number of similar (implementation,compiler) pairs: 5, namely:
ImplementationCompiler
T:pentium/pentium4v64v2clang -march=native -O2 -fwrapv -Qunused-arguments -fPIC -fPIE -gdwarf-4 -Wall (Debian_Clang_19.1.7_(3+b1))
T:pentium/pentium4v64v2clang -march=native -O3 -fwrapv -Qunused-arguments -fPIC -fPIE -gdwarf-4 -Wall (Debian_Clang_19.1.7_(3+b1))
T:pentium/pentium4v64v2clang -march=native -O -fwrapv -Qunused-arguments -fPIC -fPIE -gdwarf-4 -Wall (Debian_Clang_19.1.7_(3+b1))
T:pentium/pentium4v64v2clang -march=native -Os -fwrapv -Qunused-arguments -fPIC -fPIE -gdwarf-4 -Wall (Debian_Clang_19.1.7_(3+b1))
T:pentium/pentium4v64v2clang -mcpu=native -O3 -fwrapv -Qunused-arguments -fPIC -fPIE -gdwarf-4 -Wall (Debian_Clang_19.1.7_(3+b1))

Compiler output


echo64.S: echo64.c: Assembler messages:
echo64.S: echo64.c:571: Warning: mnemonic suffix used with `add'
echo64.S: echo64.c:571: Warning: NOTE: Such forms are deprecated and will be rejected by a future version of the assembler
echo64.S: echo64.c:571: Warning: mnemonic suffix used with `add'
echo64.S: echo64.c:571: Warning: mnemonic suffix used with `add'
echo64.S: echo64.c:571: Warning: mnemonic suffix used with `add'
echo64.S: echo64.c:572: Warning: mnemonic suffix used with `add'
echo64.S: echo64.c:572: Warning: mnemonic suffix used with `add'
echo64.S: echo64.c:572: Warning: mnemonic suffix used with `add'
echo64.S: echo64.c:572: Warning: mnemonic suffix used with `add'
echo64.S: echo64.c:573: Warning: mnemonic suffix used with `add'
echo64.S: echo64.c:573: Warning: mnemonic suffix used with `add'
echo64.S: echo64.c:573: Warning: mnemonic suffix used with `add'
echo64.S: echo64.c:573: Warning: mnemonic suffix used with `add'
echo64.S: echo64.c:574: Warning: mnemonic suffix used with `add'
echo64.S: echo64.c:574: Warning: mnemonic suffix used with `add'
echo64.S: echo64.c:574: Warning: mnemonic suffix used with `add'
echo64.S: echo64.c:574: Warning: mnemonic suffix used with `add'
echo64.S: echo64.c:576: Warning: mnemonic suffix used with `sub'
echo64.S: echo64.c:604: Warning: mnemonic suffix used with `add'
echo64.S: echo64.c:604: Warning: mnemonic suffix used with `add'
echo64.S: echo64.c:604: Warning: mnemonic suffix used with `add'
echo64.S: echo64.c:604: Warning: mnemonic suffix used with `add'
echo64.S: echo64.c:604: Warning: mnemonic suffix used with `add'
echo64.S: echo64.c:604: Warning: mnemonic suffix used with `add'
echo64.S: ...
try.c: /usr/bin/ld: libcrypto_hash_echo512.a(echo64.o): relocation R_X86_64_32S against symbol `SHA3_R' can not be used when making a PIE object; recompile with -fPIE
try.c: /usr/bin/ld: failed to set dynamic section sizes: bad value
try.c: collect2: error: ld returned 1 exit status

Number of similar (implementation,compiler) pairs: 4, namely:
ImplementationCompiler
T:pentium/pentium4v64v2gcc -march=native -mtune=native -O2 -fwrapv -fPIC -fPIE -gdwarf-4 -Wall (14.2.0)
T:pentium/pentium4v64v2gcc -march=native -mtune=native -O3 -fwrapv -fPIC -fPIE -gdwarf-4 -Wall (14.2.0)
T:pentium/pentium4v64v2gcc -march=native -mtune=native -O -fwrapv -fPIC -fPIE -gdwarf-4 -Wall (14.2.0)
T:pentium/pentium4v64v2gcc -march=native -mtune=native -Os -fwrapv -fPIC -fPIE -gdwarf-4 -Wall (14.2.0)

Compiler output


echo32.c: echo32.c:106:18: warning: unused variable 'j' [-Wunused-variable]
echo32.c:   106 |         unsigned int i, j;
echo32.c:       |                         ^
echo32.c: echo32.c:107:16: warning: unused variable 'endianess' [-Wunused-variable]
echo32.c:   107 |         unsigned char endianess;
echo32.c:       |                       ^~~~~~~~~
echo32.c: echo32.c:472:21: warning: unused variable 'c0' [-Wunused-variable]
echo32.c:   472 |         unsigned long long c0, c1;
echo32.c:       |                            ^~
echo32.c: echo32.c:472:25: warning: unused variable 'c1' [-Wunused-variable]
echo32.c:   472 |         unsigned long long c0, c1;
echo32.c:       |                                ^~
echo32.c: echo32.c:599:21: warning: unused variable 'hashlen' [-Wunused-variable]
echo32.c:   599 |         unsigned short int hashlen = 0;
echo32.c:       |                            ^~~~~~~
echo32.c: echo32.c:600:21: warning: unused variable 'messlen_l' [-Wunused-variable]
echo32.c:   600 |         unsigned long long messlen_l = 0;
echo32.c:       |                            ^~~~~~~~~
echo32.c: echo32.c:601:21: warning: unused variable 'messlen_h' [-Wunused-variable]
echo32.c:   601 |         unsigned long long messlen_h = 0;
echo32.c:       |                            ^~~~~~~~~
echo32.c: 7 warnings generated.

Number of similar (implementation,compiler) pairs: 5, namely:
ImplementationCompiler
T:powerpc/pp32cv1clang -march=native -O2 -fwrapv -Qunused-arguments -fPIC -fPIE -gdwarf-4 -Wall (Debian_Clang_19.1.7_(3+b1))
T:powerpc/pp32cv1clang -march=native -O3 -fwrapv -Qunused-arguments -fPIC -fPIE -gdwarf-4 -Wall (Debian_Clang_19.1.7_(3+b1))
T:powerpc/pp32cv1clang -march=native -O -fwrapv -Qunused-arguments -fPIC -fPIE -gdwarf-4 -Wall (Debian_Clang_19.1.7_(3+b1))
T:powerpc/pp32cv1clang -march=native -Os -fwrapv -Qunused-arguments -fPIC -fPIE -gdwarf-4 -Wall (Debian_Clang_19.1.7_(3+b1))
T:powerpc/pp32cv1clang -mcpu=native -O3 -fwrapv -Qunused-arguments -fPIC -fPIE -gdwarf-4 -Wall (Debian_Clang_19.1.7_(3+b1))

Compiler output


echo32.c: echo32.c: In function 'Init':
echo32.c: echo32.c:107:23: warning: unused variable 'endianess' [-Wunused-variable]
echo32.c:   107 |         unsigned char endianess;
echo32.c:       |                       ^~~~~~~~~
echo32.c: echo32.c:106:25: warning: unused variable 'j' [-Wunused-variable]
echo32.c:   106 |         unsigned int i, j;
echo32.c:       |                         ^
echo32.c: echo32.c: In function 'Compress':
echo32.c: echo32.c:472:32: warning: unused variable 'c1' [-Wunused-variable]
echo32.c:   472 |         unsigned long long c0, c1;
echo32.c:       |                                ^~
echo32.c: echo32.c:472:28: warning: unused variable 'c0' [-Wunused-variable]
echo32.c:   472 |         unsigned long long c0, c1;
echo32.c:       |                            ^~
echo32.c: echo32.c: In function 'Final':
echo32.c: echo32.c:601:28: warning: unused variable 'messlen_h' [-Wunused-variable]
echo32.c:   601 |         unsigned long long messlen_h = 0;
echo32.c:       |                            ^~~~~~~~~
echo32.c: echo32.c:600:28: warning: unused variable 'messlen_l' [-Wunused-variable]
echo32.c:   600 |         unsigned long long messlen_l = 0;
echo32.c:       |                            ^~~~~~~~~
echo32.c: echo32.c:599:28: warning: unused variable 'hashlen' [-Wunused-variable]
echo32.c:   599 |         unsigned short int hashlen = 0;
echo32.c:       |                            ^~~~~~~

Number of similar (implementation,compiler) pairs: 4, namely:
ImplementationCompiler
T:powerpc/pp32cv1gcc -march=native -mtune=native -O2 -fwrapv -fPIC -fPIE -gdwarf-4 -Wall (14.2.0)
T:powerpc/pp32cv1gcc -march=native -mtune=native -O3 -fwrapv -fPIC -fPIE -gdwarf-4 -Wall (14.2.0)
T:powerpc/pp32cv1gcc -march=native -mtune=native -O -fwrapv -fPIC -fPIE -gdwarf-4 -Wall (14.2.0)
T:powerpc/pp32cv1gcc -march=native -mtune=native -Os -fwrapv -fPIC -fPIE -gdwarf-4 -Wall (14.2.0)

Compiler output


echo32.c: echo32.c:106:18: warning: unused variable 'j' [-Wunused-variable]
echo32.c:   106 |         unsigned int i, j;
echo32.c:       |                         ^
echo32.c: echo32.c:107:16: warning: unused variable 'endianess' [-Wunused-variable]
echo32.c:   107 |         unsigned char endianess;
echo32.c:       |                       ^~~~~~~~~
echo32.c: echo32.c:440:21: warning: unused variable 'c0' [-Wunused-variable]
echo32.c:   440 |         unsigned long long c0, c1;
echo32.c:       |                            ^~
echo32.c: echo32.c:440:25: warning: unused variable 'c1' [-Wunused-variable]
echo32.c:   440 |         unsigned long long c0, c1;
echo32.c:       |                                ^~
echo32.c: echo32.c:567:21: warning: unused variable 'hashlen' [-Wunused-variable]
echo32.c:   567 |         unsigned short int hashlen = 0;
echo32.c:       |                            ^~~~~~~
echo32.c: echo32.c:568:21: warning: unused variable 'messlen_l' [-Wunused-variable]
echo32.c:   568 |         unsigned long long messlen_l = 0;
echo32.c:       |                            ^~~~~~~~~
echo32.c: echo32.c:569:21: warning: unused variable 'messlen_h' [-Wunused-variable]
echo32.c:   569 |         unsigned long long messlen_h = 0;
echo32.c:       |                            ^~~~~~~~~
echo32.c: 7 warnings generated.

Number of similar (implementation,compiler) pairs: 5, namely:
ImplementationCompiler
T:powerpc/pp32cv2clang -march=native -O2 -fwrapv -Qunused-arguments -fPIC -fPIE -gdwarf-4 -Wall (Debian_Clang_19.1.7_(3+b1))
T:powerpc/pp32cv2clang -march=native -O3 -fwrapv -Qunused-arguments -fPIC -fPIE -gdwarf-4 -Wall (Debian_Clang_19.1.7_(3+b1))
T:powerpc/pp32cv2clang -march=native -O -fwrapv -Qunused-arguments -fPIC -fPIE -gdwarf-4 -Wall (Debian_Clang_19.1.7_(3+b1))
T:powerpc/pp32cv2clang -march=native -Os -fwrapv -Qunused-arguments -fPIC -fPIE -gdwarf-4 -Wall (Debian_Clang_19.1.7_(3+b1))
T:powerpc/pp32cv2clang -mcpu=native -O3 -fwrapv -Qunused-arguments -fPIC -fPIE -gdwarf-4 -Wall (Debian_Clang_19.1.7_(3+b1))

Compiler output


echo32.c: echo32.c: In function 'Init':
echo32.c: echo32.c:107:23: warning: unused variable 'endianess' [-Wunused-variable]
echo32.c:   107 |         unsigned char endianess;
echo32.c:       |                       ^~~~~~~~~
echo32.c: echo32.c:106:25: warning: unused variable 'j' [-Wunused-variable]
echo32.c:   106 |         unsigned int i, j;
echo32.c:       |                         ^
echo32.c: echo32.c: In function 'Compress':
echo32.c: echo32.c:440:32: warning: unused variable 'c1' [-Wunused-variable]
echo32.c:   440 |         unsigned long long c0, c1;
echo32.c:       |                                ^~
echo32.c: echo32.c:440:28: warning: unused variable 'c0' [-Wunused-variable]
echo32.c:   440 |         unsigned long long c0, c1;
echo32.c:       |                            ^~
echo32.c: echo32.c: In function 'Final':
echo32.c: echo32.c:569:28: warning: unused variable 'messlen_h' [-Wunused-variable]
echo32.c:   569 |         unsigned long long messlen_h = 0;
echo32.c:       |                            ^~~~~~~~~
echo32.c: echo32.c:568:28: warning: unused variable 'messlen_l' [-Wunused-variable]
echo32.c:   568 |         unsigned long long messlen_l = 0;
echo32.c:       |                            ^~~~~~~~~
echo32.c: echo32.c:567:28: warning: unused variable 'hashlen' [-Wunused-variable]
echo32.c:   567 |         unsigned short int hashlen = 0;
echo32.c:       |                            ^~~~~~~

Number of similar (implementation,compiler) pairs: 4, namely:
ImplementationCompiler
T:powerpc/pp32cv2gcc -march=native -mtune=native -O2 -fwrapv -fPIC -fPIE -gdwarf-4 -Wall (14.2.0)
T:powerpc/pp32cv2gcc -march=native -mtune=native -O3 -fwrapv -fPIC -fPIE -gdwarf-4 -Wall (14.2.0)
T:powerpc/pp32cv2gcc -march=native -mtune=native -O -fwrapv -fPIC -fPIE -gdwarf-4 -Wall (14.2.0)
T:powerpc/pp32cv2gcc -march=native -mtune=native -Os -fwrapv -fPIC -fPIE -gdwarf-4 -Wall (14.2.0)

Namespace violations


hash.o Compress T
hash.o Final T
hash.o Hash T
hash.o Init T
hash.o Update T
hash.o _k_aesmix1 R
hash.o _k_aesmix2 R
hash.o _k_aesmix3 R
hash.o _k_aesmix4 R
hash.o _k_h0e R
hash.o _k_h15 R
hash.o _k_h4e R
hash.o _k_h5b R
hash.o _k_h63 R
hash.o _k_hc6 R
hash.o _k_inv R
hash.o _k_ipt R
hash.o _k_opt R
hash.o _k_s0F R
hash.o _k_sb1 R
hash.o _k_sb2 R
hash.o _k_sb3 R
hash.o _k_sb4 R
hash.o _k_sb5 R
hash.o _k_sb7 R
hash.o _k_sbo R
hash.o const1 R
hash.o invshiftrows R
hash.o lsbmask R
hash.o mul2ipt R
hash.o mul2mask R
hash.o zero R

Number of similar (implementation,compiler) pairs: 16, namely:
ImplementationCompiler
T:ccalik/aesniclang -march=native -O2 -fwrapv -Qunused-arguments -fPIC -fPIE -gdwarf-4 -Wall (Debian_Clang_19.1.7_(3+b1))
T:ccalik/aesniclang -march=native -O3 -fwrapv -Qunused-arguments -fPIC -fPIE -gdwarf-4 -Wall (Debian_Clang_19.1.7_(3+b1))
T:ccalik/aesniclang -march=native -O -fwrapv -Qunused-arguments -fPIC -fPIE -gdwarf-4 -Wall (Debian_Clang_19.1.7_(3+b1))
T:ccalik/aesniclang -march=native -Os -fwrapv -Qunused-arguments -fPIC -fPIE -gdwarf-4 -Wall (Debian_Clang_19.1.7_(3+b1))
T:ccalik/aesnigcc -march=native -mtune=native -O2 -fwrapv -fPIC -fPIE -gdwarf-4 -Wall (14.2.0)
T:ccalik/aesnigcc -march=native -mtune=native -O3 -fwrapv -fPIC -fPIE -gdwarf-4 -Wall (14.2.0)
T:ccalik/aesnigcc -march=native -mtune=native -O -fwrapv -fPIC -fPIE -gdwarf-4 -Wall (14.2.0)
T:ccalik/aesnigcc -march=native -mtune=native -Os -fwrapv -fPIC -fPIE -gdwarf-4 -Wall (14.2.0)
T:ccalik/vpermclang -march=native -O2 -fwrapv -Qunused-arguments -fPIC -fPIE -gdwarf-4 -Wall (Debian_Clang_19.1.7_(3+b1))
T:ccalik/vpermclang -march=native -O3 -fwrapv -Qunused-arguments -fPIC -fPIE -gdwarf-4 -Wall (Debian_Clang_19.1.7_(3+b1))
T:ccalik/vpermclang -march=native -O -fwrapv -Qunused-arguments -fPIC -fPIE -gdwarf-4 -Wall (Debian_Clang_19.1.7_(3+b1))
T:ccalik/vpermclang -march=native -Os -fwrapv -Qunused-arguments -fPIC -fPIE -gdwarf-4 -Wall (Debian_Clang_19.1.7_(3+b1))
T:ccalik/vpermgcc -march=native -mtune=native -O2 -fwrapv -fPIC -fPIE -gdwarf-4 -Wall (14.2.0)
T:ccalik/vpermgcc -march=native -mtune=native -O3 -fwrapv -fPIC -fPIE -gdwarf-4 -Wall (14.2.0)
T:ccalik/vpermgcc -march=native -mtune=native -O -fwrapv -fPIC -fPIE -gdwarf-4 -Wall (14.2.0)
T:ccalik/vpermgcc -march=native -mtune=native -Os -fwrapv -fPIC -fPIE -gdwarf-4 -Wall (14.2.0)

Namespace violations


hash.o Compress T
hash.o Final T
hash.o Hash T
hash.o Init T
hash.o Update T
hash.o _BS0 R
hash.o _BS1 R
hash.o _BS2 R
hash.o _ONE R
hash.o bigshiftrows1 R
hash.o bigshiftrows2 R
hash.o bigshiftrows3 R
hash.o const1 R
hash.o lownibblemask R
hash.o mixcol1 R
hash.o mixcol2 R
hash.o mixcol3 R
hash.o shiftrowsslice R

Number of similar (implementation,compiler) pairs: 8, namely:
ImplementationCompiler
T:ccalik/bitslicedclang -march=native -O2 -fwrapv -Qunused-arguments -fPIC -fPIE -gdwarf-4 -Wall (Debian_Clang_19.1.7_(3+b1))
T:ccalik/bitslicedclang -march=native -O3 -fwrapv -Qunused-arguments -fPIC -fPIE -gdwarf-4 -Wall (Debian_Clang_19.1.7_(3+b1))
T:ccalik/bitslicedclang -march=native -O -fwrapv -Qunused-arguments -fPIC -fPIE -gdwarf-4 -Wall (Debian_Clang_19.1.7_(3+b1))
T:ccalik/bitslicedclang -march=native -Os -fwrapv -Qunused-arguments -fPIC -fPIE -gdwarf-4 -Wall (Debian_Clang_19.1.7_(3+b1))
T:ccalik/bitslicedgcc -march=native -mtune=native -O2 -fwrapv -fPIC -fPIE -gdwarf-4 -Wall (14.2.0)
T:ccalik/bitslicedgcc -march=native -mtune=native -O3 -fwrapv -fPIC -fPIE -gdwarf-4 -Wall (14.2.0)
T:ccalik/bitslicedgcc -march=native -mtune=native -O -fwrapv -fPIC -fPIE -gdwarf-4 -Wall (14.2.0)
T:ccalik/bitslicedgcc -march=native -mtune=native -Os -fwrapv -fPIC -fPIE -gdwarf-4 -Wall (14.2.0)

Namespace violations


echo32.o CNT_r B
echo32.o Compress T
echo32.o Endianess T
echo32.o Final T
echo32.o Hash T
echo32.o Init T
echo32.o PushString T
echo32.o Update T
echo32.o endian B
echo32.o flip_bits T
echo32.o r B

Number of similar (implementation,compiler) pairs: 27, namely:
ImplementationCompiler
T:generic/opt32clang -march=native -O2 -fwrapv -Qunused-arguments -fPIC -fPIE -gdwarf-4 -Wall (Debian_Clang_19.1.7_(3+b1))
T:generic/opt32clang -march=native -O3 -fwrapv -Qunused-arguments -fPIC -fPIE -gdwarf-4 -Wall (Debian_Clang_19.1.7_(3+b1))
T:generic/opt32clang -march=native -O -fwrapv -Qunused-arguments -fPIC -fPIE -gdwarf-4 -Wall (Debian_Clang_19.1.7_(3+b1))
T:generic/opt32clang -march=native -Os -fwrapv -Qunused-arguments -fPIC -fPIE -gdwarf-4 -Wall (Debian_Clang_19.1.7_(3+b1))
T:generic/opt32clang -mcpu=native -O3 -fwrapv -Qunused-arguments -fPIC -fPIE -gdwarf-4 -Wall (Debian_Clang_19.1.7_(3+b1))
T:generic/opt32gcc -march=native -mtune=native -O2 -fwrapv -fPIC -fPIE -gdwarf-4 -Wall (14.2.0)
T:generic/opt32gcc -march=native -mtune=native -O3 -fwrapv -fPIC -fPIE -gdwarf-4 -Wall (14.2.0)
T:generic/opt32gcc -march=native -mtune=native -O -fwrapv -fPIC -fPIE -gdwarf-4 -Wall (14.2.0)
T:generic/opt32gcc -march=native -mtune=native -Os -fwrapv -fPIC -fPIE -gdwarf-4 -Wall (14.2.0)
T:powerpc/pp32cv1clang -march=native -O2 -fwrapv -Qunused-arguments -fPIC -fPIE -gdwarf-4 -Wall (Debian_Clang_19.1.7_(3+b1))
T:powerpc/pp32cv1clang -march=native -O3 -fwrapv -Qunused-arguments -fPIC -fPIE -gdwarf-4 -Wall (Debian_Clang_19.1.7_(3+b1))
T:powerpc/pp32cv1clang -march=native -O -fwrapv -Qunused-arguments -fPIC -fPIE -gdwarf-4 -Wall (Debian_Clang_19.1.7_(3+b1))
T:powerpc/pp32cv1clang -march=native -Os -fwrapv -Qunused-arguments -fPIC -fPIE -gdwarf-4 -Wall (Debian_Clang_19.1.7_(3+b1))
T:powerpc/pp32cv1clang -mcpu=native -O3 -fwrapv -Qunused-arguments -fPIC -fPIE -gdwarf-4 -Wall (Debian_Clang_19.1.7_(3+b1))
T:powerpc/pp32cv1gcc -march=native -mtune=native -O2 -fwrapv -fPIC -fPIE -gdwarf-4 -Wall (14.2.0)
T:powerpc/pp32cv1gcc -march=native -mtune=native -O3 -fwrapv -fPIC -fPIE -gdwarf-4 -Wall (14.2.0)
T:powerpc/pp32cv1gcc -march=native -mtune=native -O -fwrapv -fPIC -fPIE -gdwarf-4 -Wall (14.2.0)
T:powerpc/pp32cv1gcc -march=native -mtune=native -Os -fwrapv -fPIC -fPIE -gdwarf-4 -Wall (14.2.0)
T:powerpc/pp32cv2clang -march=native -O2 -fwrapv -Qunused-arguments -fPIC -fPIE -gdwarf-4 -Wall (Debian_Clang_19.1.7_(3+b1))
T:powerpc/pp32cv2clang -march=native -O3 -fwrapv -Qunused-arguments -fPIC -fPIE -gdwarf-4 -Wall (Debian_Clang_19.1.7_(3+b1))
T:powerpc/pp32cv2clang -march=native -O -fwrapv -Qunused-arguments -fPIC -fPIE -gdwarf-4 -Wall (Debian_Clang_19.1.7_(3+b1))
T:powerpc/pp32cv2clang -march=native -Os -fwrapv -Qunused-arguments -fPIC -fPIE -gdwarf-4 -Wall (Debian_Clang_19.1.7_(3+b1))
T:powerpc/pp32cv2clang -mcpu=native -O3 -fwrapv -Qunused-arguments -fPIC -fPIE -gdwarf-4 -Wall (Debian_Clang_19.1.7_(3+b1))
T:powerpc/pp32cv2gcc -march=native -mtune=native -O2 -fwrapv -fPIC -fPIE -gdwarf-4 -Wall (14.2.0)
T:powerpc/pp32cv2gcc -march=native -mtune=native -O3 -fwrapv -fPIC -fPIE -gdwarf-4 -Wall (14.2.0)
T:powerpc/pp32cv2gcc -march=native -mtune=native -O -fwrapv -fPIC -fPIE -gdwarf-4 -Wall (14.2.0)
T:powerpc/pp32cv2gcc -march=native -mtune=native -Os -fwrapv -fPIC -fPIE -gdwarf-4 -Wall (14.2.0)

Namespace violations


echo64.o Compress T
echo64.o Endianess T
echo64.o Final T
echo64.o Hash T
echo64.o Init T
echo64.o PushString T
echo64.o Update T
echo64.o endian B

Number of similar (implementation,compiler) pairs: 9, namely:
ImplementationCompiler
T:generic/opt64clang -march=native -O2 -fwrapv -Qunused-arguments -fPIC -fPIE -gdwarf-4 -Wall (Debian_Clang_19.1.7_(3+b1))
T:generic/opt64clang -march=native -O3 -fwrapv -Qunused-arguments -fPIC -fPIE -gdwarf-4 -Wall (Debian_Clang_19.1.7_(3+b1))
T:generic/opt64clang -march=native -O -fwrapv -Qunused-arguments -fPIC -fPIE -gdwarf-4 -Wall (Debian_Clang_19.1.7_(3+b1))
T:generic/opt64clang -march=native -Os -fwrapv -Qunused-arguments -fPIC -fPIE -gdwarf-4 -Wall (Debian_Clang_19.1.7_(3+b1))
T:generic/opt64clang -mcpu=native -O3 -fwrapv -Qunused-arguments -fPIC -fPIE -gdwarf-4 -Wall (Debian_Clang_19.1.7_(3+b1))
T:generic/opt64gcc -march=native -mtune=native -O2 -fwrapv -fPIC -fPIE -gdwarf-4 -Wall (14.2.0)
T:generic/opt64gcc -march=native -mtune=native -O3 -fwrapv -fPIC -fPIE -gdwarf-4 -Wall (14.2.0)
T:generic/opt64gcc -march=native -mtune=native -O -fwrapv -fPIC -fPIE -gdwarf-4 -Wall (14.2.0)
T:generic/opt64gcc -march=native -mtune=native -Os -fwrapv -fPIC -fPIE -gdwarf-4 -Wall (14.2.0)

Namespace violations


echo.o sph_echo224 T
echo.o sph_echo224_addbits_and_close T
echo.o sph_echo224_close T
echo.o sph_echo224_init T
echo.o sph_echo256 T
echo.o sph_echo256_addbits_and_close T
echo.o sph_echo256_close T
echo.o sph_echo256_init T
echo.o sph_echo384 T
echo.o sph_echo384_addbits_and_close T
echo.o sph_echo384_close T
echo.o sph_echo384_init T
echo.o sph_echo512 T
echo.o sph_echo512_addbits_and_close T
echo.o sph_echo512_close T
echo.o sph_echo512_init T

Number of similar (implementation,compiler) pairs: 18, namely:
ImplementationCompiler
T:sphlibclang -march=native -O2 -fwrapv -Qunused-arguments -fPIC -fPIE -gdwarf-4 -Wall (Debian_Clang_19.1.7_(3+b1))
T:sphlibclang -march=native -O3 -fwrapv -Qunused-arguments -fPIC -fPIE -gdwarf-4 -Wall (Debian_Clang_19.1.7_(3+b1))
T:sphlibclang -march=native -O -fwrapv -Qunused-arguments -fPIC -fPIE -gdwarf-4 -Wall (Debian_Clang_19.1.7_(3+b1))
T:sphlibclang -march=native -Os -fwrapv -Qunused-arguments -fPIC -fPIE -gdwarf-4 -Wall (Debian_Clang_19.1.7_(3+b1))
T:sphlibclang -mcpu=native -O3 -fwrapv -Qunused-arguments -fPIC -fPIE -gdwarf-4 -Wall (Debian_Clang_19.1.7_(3+b1))
T:sphlibgcc -march=native -mtune=native -O2 -fwrapv -fPIC -fPIE -gdwarf-4 -Wall (14.2.0)
T:sphlibgcc -march=native -mtune=native -O3 -fwrapv -fPIC -fPIE -gdwarf-4 -Wall (14.2.0)
T:sphlibgcc -march=native -mtune=native -O -fwrapv -fPIC -fPIE -gdwarf-4 -Wall (14.2.0)
T:sphlibgcc -march=native -mtune=native -Os -fwrapv -fPIC -fPIE -gdwarf-4 -Wall (14.2.0)
T:sphlib-smallclang -march=native -O2 -fwrapv -Qunused-arguments -fPIC -fPIE -gdwarf-4 -Wall (Debian_Clang_19.1.7_(3+b1))
T:sphlib-smallclang -march=native -O3 -fwrapv -Qunused-arguments -fPIC -fPIE -gdwarf-4 -Wall (Debian_Clang_19.1.7_(3+b1))
T:sphlib-smallclang -march=native -O -fwrapv -Qunused-arguments -fPIC -fPIE -gdwarf-4 -Wall (Debian_Clang_19.1.7_(3+b1))
T:sphlib-smallclang -march=native -Os -fwrapv -Qunused-arguments -fPIC -fPIE -gdwarf-4 -Wall (Debian_Clang_19.1.7_(3+b1))
T:sphlib-smallclang -mcpu=native -O3 -fwrapv -Qunused-arguments -fPIC -fPIE -gdwarf-4 -Wall (Debian_Clang_19.1.7_(3+b1))
T:sphlib-smallgcc -march=native -mtune=native -O2 -fwrapv -fPIC -fPIE -gdwarf-4 -Wall (14.2.0)
T:sphlib-smallgcc -march=native -mtune=native -O3 -fwrapv -fPIC -fPIE -gdwarf-4 -Wall (14.2.0)
T:sphlib-smallgcc -march=native -mtune=native -O -fwrapv -fPIC -fPIE -gdwarf-4 -Wall (14.2.0)
T:sphlib-smallgcc -march=native -mtune=native -Os -fwrapv -fPIC -fPIE -gdwarf-4 -Wall (14.2.0)