Test results for amd64, hertz, crypto_kem/ntruplus576

[Page version: 20250310 13:41:42]

Measurements for amd64, hertz, crypto_kem Test results for amd64, hertz, crypto_kem Test results for crypto_kem/ntruplus576
Computer: hertz
Microarchitecture: amd64; Zen 4 (a60f12)
Architecture: amd64
CPU ID: AuthenticAMD-00a60f12-178bfbff
SUPERCOP version: 20250307
Operation: crypto_kem
Primitive: ntruplus576
TimeObject sizeTest sizeImplementationCompilerBenchmark dateSUPERCOP version
2951922596 0 044218 844 1864avx2gcc -march=native -mtune=native -O3 -fwrapv -fPIC -fPIE -gdwarf-4 -Wall2025030820250307
2996421783 0 041626 844 1864avx2gcc -march=native -mtune=native -O2 -fwrapv -fPIC -fPIE -gdwarf-4 -Wall2025030820250307
3456621559 0 045216 852 1832avx2clang -march=native -O3 -fwrapv -Qunused-arguments -fPIC -fPIE -gdwarf-4 -Wall2025030820250307
3458321559 0 045216 852 1832avx2clang -march=native -O2 -fwrapv -Qunused-arguments -fPIC -fPIE -gdwarf-4 -Wall2025030820250307
3519520373 0 040458 844 1832avx2clang -march=native -Os -fwrapv -Qunused-arguments -fPIC -fPIE -gdwarf-4 -Wall2025030820250307
4227020408 0 038682 836 1768avx2gcc -march=native -mtune=native -Os -fwrapv -fPIC -fPIE -gdwarf-4 -Wall2025030820250307
16537080070 0 0103761 868 1832refclang -march=native -O3 -fwrapv -Qunused-arguments -fPIC -fPIE -gdwarf-4 -Wall2025030820250307
17502170526 0 094265 868 1832refclang -march=native -O2 -fwrapv -Qunused-arguments -fPIC -fPIE -gdwarf-4 -Wall2025030820250307
18141347326 0 067859 860 1832refclang -march=native -Os -fwrapv -Qunused-arguments -fPIC -fPIE -gdwarf-4 -Wall2025030820250307
20179269738 0 091844 836 1864refgcc -march=native -mtune=native -O3 -fwrapv -fPIC -fPIE -gdwarf-4 -Wall2025030820250307
20415950824 0 071060 836 1864refgcc -march=native -mtune=native -O2 -fwrapv -fPIC -fPIE -gdwarf-4 -Wall2025030820250307
23206049930 0 068580 828 1768refgcc -march=native -mtune=native -Os -fwrapv -fPIC -fPIE -gdwarf-4 -Wall2025030820250307

Compiler output


try.c: /usr/bin/ld: warning: KeccakP-1600-AVX2.o: missing .note.GNU-stack section implies executable stack
try.c: /usr/bin/ld: NOTE: This behaviour is deprecated and will be removed in a future version of the linker
try.c: /usr/bin/ld: warning: KeccakP-1600-AVX2.o: missing .note.GNU-stack section implies executable stack
try.c: /usr/bin/ld: NOTE: This behaviour is deprecated and will be removed in a future version of the linker
try.c: clang: error: no such file or directory: '.../supercop-data/avx/amd64/lib/timecop/cpucycles.o'
measure.c: /usr/bin/ld: warning: KeccakP-1600-AVX2.o: missing .note.GNU-stack section implies executable stack
measure.c: /usr/bin/ld: NOTE: This behaviour is deprecated and will be removed in a future version of the linker

Number of similar (implementation,compiler) pairs: 3, namely:
ImplementationCompiler
avx2clang -march=native -O2 -fwrapv -Qunused-arguments -fPIC -fPIE -gdwarf-4 -Wall (Ubuntu_Clang_19.1.1_(1ubuntu1))
avx2clang -march=native -O3 -fwrapv -Qunused-arguments -fPIC -fPIE -gdwarf-4 -Wall (Ubuntu_Clang_19.1.1_(1ubuntu1))
avx2clang -march=native -Os -fwrapv -Qunused-arguments -fPIC -fPIE -gdwarf-4 -Wall (Ubuntu_Clang_19.1.1_(1ubuntu1))

Compiler output


try.c: /usr/bin/ld: warning: KeccakP-1600-AVX2.o: missing .note.GNU-stack section implies executable stack
try.c: /usr/bin/ld: NOTE: This behaviour is deprecated and will be removed in a future version of the linker
try.c: /usr/bin/ld: warning: KeccakP-1600-AVX2.o: missing .note.GNU-stack section implies executable stack
try.c: /usr/bin/ld: NOTE: This behaviour is deprecated and will be removed in a future version of the linker
try.c: In file included from try-anything-timecop.c:3:
try.c: try-anything.c:17:10: fatal error: cpucycles.h: No such file or directory
try.c:    17 | #include "cpucycles.h"
try.c:       |          ^~~~~~~~~~~~~
try.c: compilation terminated.
measure.c: /usr/bin/ld: warning: KeccakP-1600-AVX2.o: missing .note.GNU-stack section implies executable stack
measure.c: /usr/bin/ld: NOTE: This behaviour is deprecated and will be removed in a future version of the linker

Number of similar (implementation,compiler) pairs: 3, namely:
ImplementationCompiler
avx2gcc -march=native -mtune=native -O2 -fwrapv -fPIC -fPIE -gdwarf-4 -Wall (14.2.0)
avx2gcc -march=native -mtune=native -O3 -fwrapv -fPIC -fPIE -gdwarf-4 -Wall (14.2.0)
avx2gcc -march=native -mtune=native -Os -fwrapv -fPIC -fPIE -gdwarf-4 -Wall (14.2.0)

Compiler output


try.c: clang: error: no such file or directory: '.../supercop-data/avx/amd64/lib/timecop/cpucycles.o'

Number of similar (implementation,compiler) pairs: 3, namely:
ImplementationCompiler
refclang -march=native -O2 -fwrapv -Qunused-arguments -fPIC -fPIE -gdwarf-4 -Wall (Ubuntu_Clang_19.1.1_(1ubuntu1))
refclang -march=native -O3 -fwrapv -Qunused-arguments -fPIC -fPIE -gdwarf-4 -Wall (Ubuntu_Clang_19.1.1_(1ubuntu1))
refclang -march=native -Os -fwrapv -Qunused-arguments -fPIC -fPIE -gdwarf-4 -Wall (Ubuntu_Clang_19.1.1_(1ubuntu1))

Compiler output


try.c: In file included from try-anything-timecop.c:3:
try.c: try-anything.c:17:10: fatal error: cpucycles.h: No such file or directory
try.c:    17 | #include "cpucycles.h"
try.c:       |          ^~~~~~~~~~~~~
try.c: compilation terminated.

Number of similar (implementation,compiler) pairs: 3, namely:
ImplementationCompiler
refgcc -march=native -mtune=native -O2 -fwrapv -fPIC -fPIE -gdwarf-4 -Wall (14.2.0)
refgcc -march=native -mtune=native -O3 -fwrapv -fPIC -fPIE -gdwarf-4 -Wall (14.2.0)
refgcc -march=native -mtune=native -Os -fwrapv -fPIC -fPIE -gdwarf-4 -Wall (14.2.0)

Namespace violations


KeccakP-1600-AVX2.o ALLON a
KeccakP-1600-AVX2.o KeccakF1600_FastLoop_Absorb T
KeccakP-1600-AVX2.o KeccakP1600_12rounds_FastLoop_Absorb T
KeccakP-1600-AVX2.o KeccakP1600_AddByte T
KeccakP-1600-AVX2.o KeccakP1600_AddBytes T
KeccakP-1600-AVX2.o KeccakP1600_ExtractAndAddBytes T
KeccakP-1600-AVX2.o KeccakP1600_ExtractBytes T
KeccakP-1600-AVX2.o KeccakP1600_Initialize T
KeccakP-1600-AVX2.o KeccakP1600_OverwriteBytes T
KeccakP-1600-AVX2.o KeccakP1600_OverwriteWithZeroes T
KeccakP-1600-AVX2.o KeccakP1600_Permute_12rounds T
KeccakP-1600-AVX2.o KeccakP1600_Permute_24rounds T
KeccakP-1600-AVX2.o KeccakP1600_Permute_Nrounds T
KeccakP-1600-AVX2.o _KeccakF1600_FastLoop_Absorb T
KeccakP-1600-AVX2.o _KeccakP1600_12rounds_FastLoop_Absorb T
KeccakP-1600-AVX2.o _KeccakP1600_AddByte T
KeccakP-1600-AVX2.o _KeccakP1600_AddBytes T
KeccakP-1600-AVX2.o _KeccakP1600_ExtractAndAddBytes T
KeccakP-1600-AVX2.o _KeccakP1600_ExtractBytes T
KeccakP-1600-AVX2.o _KeccakP1600_Initialize T
KeccakP-1600-AVX2.o _KeccakP1600_OverwriteBytes T
KeccakP-1600-AVX2.o _KeccakP1600_OverwriteWithZeroes T
KeccakP-1600-AVX2.o _KeccakP1600_Permute_12rounds T
KeccakP-1600-AVX2.o _KeccakP1600_Permute_24rounds T
KeccakP-1600-AVX2.o _KeccakP1600_Permute_Nrounds T
add.o poly_add T
add.o poly_sub T
add.o poly_triple T
baseinv.o poly_baseinv T
basemul.o poly_basemul T
cbd.o poly_cbd1 T
cbd.o poly_sotp T
cbd.o poly_sotp_inv T
consts.o _16x1 R
consts.o _16xq R
consts.o _16xqinv R
consts.o _16xv R
consts.o _16xw R
consts.o _16xwqinv R
consts.o _4x01 R
consts.o _4x1 R
consts.o _8x1 R
consts.o _low_mask R
consts.o zetas R
consts.o zetas_inv R
consts.o zetas_mul R
fips202.o fips202avx_sha3_256 T
fips202.o fips202avx_sha3_256_absorb T
fips202.o fips202avx_sha3_256_finalize T
fips202.o fips202avx_sha3_256_init T
fips202.o fips202avx_shake128 T
fips202.o fips202avx_shake128_absorb T
fips202.o fips202avx_shake128_finalize T
fips202.o fips202avx_shake128_init T
fips202.o fips202avx_shake128_squeeze T
fips202.o fips202avx_shake256 T
fips202.o fips202avx_shake256_absorb T
fips202.o fips202avx_shake256_finalize T
fips202.o fips202avx_shake256_init T
fips202.o fips202avx_shake256_squeeze T
invntt.o poly_invntt T
ntt.o poly_ntt T
pack.o poly_frombytes T
pack.o poly_tobytes T
poly.o poly_crepmod3 T
symmetric.o hash_f T
symmetric.o hash_g T
symmetric.o hash_h_kem T
verify.o verify T

Number of similar (implementation,compiler) pairs: 6, namely:
ImplementationCompiler
avx2clang -march=native -O2 -fwrapv -Qunused-arguments -fPIC -fPIE -gdwarf-4 -Wall (Ubuntu_Clang_19.1.1_(1ubuntu1))
avx2clang -march=native -O3 -fwrapv -Qunused-arguments -fPIC -fPIE -gdwarf-4 -Wall (Ubuntu_Clang_19.1.1_(1ubuntu1))
avx2clang -march=native -Os -fwrapv -Qunused-arguments -fPIC -fPIE -gdwarf-4 -Wall (Ubuntu_Clang_19.1.1_(1ubuntu1))
avx2gcc -march=native -mtune=native -O2 -fwrapv -fPIC -fPIE -gdwarf-4 -Wall (14.2.0)
avx2gcc -march=native -mtune=native -O3 -fwrapv -fPIC -fPIE -gdwarf-4 -Wall (14.2.0)
avx2gcc -march=native -mtune=native -Os -fwrapv -fPIC -fPIE -gdwarf-4 -Wall (14.2.0)

Namespace violations


fips202.o sha3_256 T
fips202.o sha3_256_inc_absorb T
fips202.o sha3_256_inc_ctx_clone T
fips202.o sha3_256_inc_ctx_release T
fips202.o sha3_256_inc_finalize T
fips202.o sha3_256_inc_init T
fips202.o sha3_384 T
fips202.o sha3_384_inc_absorb T
fips202.o sha3_384_inc_ctx_clone T
fips202.o sha3_384_inc_ctx_release T
fips202.o sha3_384_inc_finalize T
fips202.o sha3_384_inc_init T
fips202.o sha3_512 T
fips202.o sha3_512_inc_absorb T
fips202.o sha3_512_inc_ctx_clone T
fips202.o sha3_512_inc_ctx_release T
fips202.o sha3_512_inc_finalize T
fips202.o sha3_512_inc_init T
fips202.o shake128 T
fips202.o shake128_absorb T
fips202.o shake128_ctx_clone T
fips202.o shake128_ctx_release T
fips202.o shake128_inc_absorb T
fips202.o shake128_inc_ctx_clone T
fips202.o shake128_inc_ctx_release T
fips202.o shake128_inc_finalize T
fips202.o shake128_inc_init T
fips202.o shake128_inc_squeeze T
fips202.o shake128_squeezeblocks T
fips202.o shake256 T
fips202.o shake256_absorb T
fips202.o shake256_ctx_clone T
fips202.o shake256_ctx_release T
fips202.o shake256_inc_absorb T
fips202.o shake256_inc_ctx_clone T
fips202.o shake256_inc_ctx_release T
fips202.o shake256_inc_finalize T
fips202.o shake256_inc_init T
fips202.o shake256_inc_squeeze T
fips202.o shake256_squeezeblocks T
ntt.o baseinv T
ntt.o basemul T
ntt.o basemul_add T
ntt.o invntt T
ntt.o ntt T
ntt.o zetas R
poly.o poly_baseinv T
poly.o poly_basemul T
poly.o poly_basemul_add T
poly.o poly_cbd1 T
poly.o poly_crepmod3 T
poly.o poly_frombytes T
poly.o poly_invntt T
poly.o poly_ntt T
poly.o poly_sotp T
poly.o poly_sotp_inv T
poly.o poly_sub T
poly.o poly_tobytes T
poly.o poly_triple T
reduce.o barrett_reduce T
reduce.o montgomery_reduce T
sha2.o sha224 T
sha2.o sha224_inc_blocks T
sha2.o sha224_inc_ctx_clone T
sha2.o sha224_inc_ctx_release T
sha2.o sha224_inc_finalize T
sha2.o sha224_inc_init T
sha2.o sha256 T
sha2.o sha256_inc_blocks T
sha2.o sha256_inc_ctx_clone T
sha2.o sha256_inc_ctx_release T
sha2.o sha256_inc_finalize T
sha2.o sha256_inc_init T
sha2.o sha384 T
sha2.o sha384_inc_blocks T
sha2.o sha384_inc_ctx_clone T
sha2.o sha384_inc_ctx_release T
sha2.o sha384_inc_finalize T
sha2.o sha384_inc_init T
sha2.o sha512 T
sha2.o sha512_inc_blocks T
sha2.o sha512_inc_ctx_clone T
sha2.o sha512_inc_ctx_release T
sha2.o sha512_inc_finalize T
sha2.o sha512_inc_init T
symmetric.o hash_f T
symmetric.o hash_g T
symmetric.o hash_h_kem T
verify.o verify T

Number of similar (implementation,compiler) pairs: 6, namely:
ImplementationCompiler
refclang -march=native -O2 -fwrapv -Qunused-arguments -fPIC -fPIE -gdwarf-4 -Wall (Ubuntu_Clang_19.1.1_(1ubuntu1))
refclang -march=native -O3 -fwrapv -Qunused-arguments -fPIC -fPIE -gdwarf-4 -Wall (Ubuntu_Clang_19.1.1_(1ubuntu1))
refclang -march=native -Os -fwrapv -Qunused-arguments -fPIC -fPIE -gdwarf-4 -Wall (Ubuntu_Clang_19.1.1_(1ubuntu1))
refgcc -march=native -mtune=native -O2 -fwrapv -fPIC -fPIE -gdwarf-4 -Wall (14.2.0)
refgcc -march=native -mtune=native -O3 -fwrapv -fPIC -fPIE -gdwarf-4 -Wall (14.2.0)
refgcc -march=native -mtune=native -Os -fwrapv -fPIC -fPIE -gdwarf-4 -Wall (14.2.0)

TIMECOP error (can be valgrind bug)


error 127
timeout: failed to run command 'valgrind': No such file or directory

Number of similar (implementation,compiler) pairs: 12, namely:
ImplementationCompiler
avx2clang -march=native -O2 -fwrapv -Qunused-arguments -fPIC -fPIE -gdwarf-4 -Wall (Ubuntu_Clang_19.1.1_(1ubuntu1))
avx2clang -march=native -O3 -fwrapv -Qunused-arguments -fPIC -fPIE -gdwarf-4 -Wall (Ubuntu_Clang_19.1.1_(1ubuntu1))
avx2clang -march=native -Os -fwrapv -Qunused-arguments -fPIC -fPIE -gdwarf-4 -Wall (Ubuntu_Clang_19.1.1_(1ubuntu1))
avx2gcc -march=native -mtune=native -O2 -fwrapv -fPIC -fPIE -gdwarf-4 -Wall (14.2.0)
avx2gcc -march=native -mtune=native -O3 -fwrapv -fPIC -fPIE -gdwarf-4 -Wall (14.2.0)
avx2gcc -march=native -mtune=native -Os -fwrapv -fPIC -fPIE -gdwarf-4 -Wall (14.2.0)
refclang -march=native -O2 -fwrapv -Qunused-arguments -fPIC -fPIE -gdwarf-4 -Wall (Ubuntu_Clang_19.1.1_(1ubuntu1))
refclang -march=native -O3 -fwrapv -Qunused-arguments -fPIC -fPIE -gdwarf-4 -Wall (Ubuntu_Clang_19.1.1_(1ubuntu1))
refclang -march=native -Os -fwrapv -Qunused-arguments -fPIC -fPIE -gdwarf-4 -Wall (Ubuntu_Clang_19.1.1_(1ubuntu1))
refgcc -march=native -mtune=native -O2 -fwrapv -fPIC -fPIE -gdwarf-4 -Wall (14.2.0)
refgcc -march=native -mtune=native -O3 -fwrapv -fPIC -fPIE -gdwarf-4 -Wall (14.2.0)
refgcc -march=native -mtune=native -Os -fwrapv -fPIC -fPIE -gdwarf-4 -Wall (14.2.0)