Test results for amd64, hertz, crypto_hashblocks/sha512

[Page version: 20261022 14:52:12]

Measurements for amd64, hertz, crypto_hashblocks Test results for amd64, hertz, crypto_hashblocks Test results for crypto_hashblocks/sha512
Computer: hertz
Microarchitecture: amd64; Zen 4 (a60f12)
Architecture: amd64
CPU ID: AuthenticAMD-00a60f12-178bfbff
SUPERCOP version: 20261018
Operation: crypto_hashblocks
Primitive: sha512
TimeObject sizeTest sizeImplementationCompilerBenchmark dateSUPERCOP version
75195385 0 026665 1232 1568avx2gcc -march=native -mtune=native -Os -fwrapv -fPIC -fPIE -gdwarf-4 -Wall2026101920261018
75235356 0 033827 1288 1568avx2clang -march=native -O2 -fwrapv -Qunused-arguments -fPIC -fPIE -gdwarf-4 -Wall2026101920261018
75255447 0 028198 1256 1664avx2gcc -march=native -mtune=native -O2 -fwrapv -fPIC -fPIE -gdwarf-4 -Wall2026101920261018
75445356 0 035171 1288 1568avx2clang -march=native -O3 -fwrapv -Qunused-arguments -fPIC -fPIE -gdwarf-4 -Wall2026101920261018
75445341 0 028173 1280 1568avx2clang -march=native -Os -fwrapv -Qunused-arguments -fPIC -fPIE -gdwarf-4 -Wall2026101920261018
75795447 0 031750 1256 1664avx2gcc -march=native -mtune=native -O3 -fwrapv -fPIC -fPIE -gdwarf-4 -Wall2026101920261018
78705563 0 032470 1256 1664avxgcc -march=native -mtune=native -O3 -fwrapv -fPIC -fPIE -gdwarf-4 -Wall2026101920261018
79465688 0 028982 1256 1664avxgcc -march=native -mtune=native -O2 -fwrapv -fPIC -fPIE -gdwarf-4 -Wall2026101920261018
80175625 0 035459 1288 1568compactclang -march=native -O3 -fwrapv -Qunused-arguments -fPIC -fPIE -gdwarf-4 -Wall2026101920261018
80476727 0 029317 1280 1568avxclang -march=native -Os -fwrapv -Qunused-arguments -fPIC -fPIE -gdwarf-4 -Wall2026101920261018
80663971 0 026757 1280 1568compactclang -march=native -Os -fwrapv -Qunused-arguments -fPIC -fPIE -gdwarf-4 -Wall2026101920261018
81867176 0 035483 1288 1568avxclang -march=native -O2 -fwrapv -Qunused-arguments -fPIC -fPIE -gdwarf-4 -Wall2026101920261018
81895609 0 034051 1288 1568compactclang -march=native -O2 -fwrapv -Qunused-arguments -fPIC -fPIE -gdwarf-4 -Wall2026101920261018
82237176 0 036955 1288 1568avxclang -march=native -O3 -fwrapv -Qunused-arguments -fPIC -fPIE -gdwarf-4 -Wall2026101920261018
92245855 0 034099 1288 1568wflipclang -march=native -O2 -fwrapv -Qunused-arguments -fPIC -fPIE -gdwarf-4 -Wall2026101920261018
92275855 0 035571 1288 1568wflipclang -march=native -O3 -fwrapv -Qunused-arguments -fPIC -fPIE -gdwarf-4 -Wall2026101920261018
92324694 0 026513 1232 1568compactgcc -march=native -mtune=native -Os -fwrapv -fPIC -fPIE -gdwarf-4 -Wall2026101920261018
92794854 0 027485 1280 1568wflipclang -march=native -Os -fwrapv -Qunused-arguments -fPIC -fPIE -gdwarf-4 -Wall2026101920261018
952714719 0 041678 1256 1664refgcc -march=native -mtune=native -O3 -fwrapv -fPIC -fPIE -gdwarf-4 -Wall2026101920261018
968414968 0 038278 1256 1664refgcc -march=native -mtune=native -O2 -fwrapv -fPIC -fPIE -gdwarf-4 -Wall2026101920261018
97463341 0 030262 1256 1664wflipgcc -march=native -mtune=native -O3 -fwrapv -fPIC -fPIE -gdwarf-4 -Wall2026101920261018
980817050 0 046819 1288 1568inplaceclang -march=native -O3 -fwrapv -Qunused-arguments -fPIC -fPIE -gdwarf-4 -Wall2026101920261018
981217050 0 045411 1288 1568inplaceclang -march=native -O2 -fwrapv -Qunused-arguments -fPIC -fPIE -gdwarf-4 -Wall2026101920261018
990014872 0 041806 1256 1664inplacegcc -march=native -mtune=native -O3 -fwrapv -fPIC -fPIE -gdwarf-4 -Wall2026101920261018
997217042 0 039781 1280 1568refclang -march=native -Os -fwrapv -Qunused-arguments -fPIC -fPIE -gdwarf-4 -Wall2026101920261018
1003117021 0 039781 1280 1568inplaceclang -march=native -Os -fwrapv -Qunused-arguments -fPIC -fPIE -gdwarf-4 -Wall2026101920261018
1010715289 0 038598 1256 1664inplacegcc -march=native -mtune=native -O2 -fwrapv -fPIC -fPIE -gdwarf-4 -Wall2026101920261018
1013417079 0 046883 1288 1568refclang -march=native -O3 -fwrapv -Qunused-arguments -fPIC -fPIE -gdwarf-4 -Wall2026101920261018
101443819 0 027126 1256 1664wflipgcc -march=native -mtune=native -O2 -fwrapv -fPIC -fPIE -gdwarf-4 -Wall2026101920261018
1014817079 0 045475 1288 1568refclang -march=native -O2 -fwrapv -Qunused-arguments -fPIC -fPIE -gdwarf-4 -Wall2026101920261018
103074438 0 031422 1256 1664compactgcc -march=native -mtune=native -O3 -fwrapv -fPIC -fPIE -gdwarf-4 -Wall2026101920261018
107604398 0 027742 1256 1664compactgcc -march=native -mtune=native -O2 -fwrapv -fPIC -fPIE -gdwarf-4 -Wall2026101920261018
1116119730 0 041545 1232 1568inplacegcc -march=native -mtune=native -Os -fwrapv -fPIC -fPIE -gdwarf-4 -Wall2026101920261018
1128519526 0 041353 1232 1568refgcc -march=native -mtune=native -Os -fwrapv -fPIC -fPIE -gdwarf-4 -Wall2026101920261018
113951623 0 028590 1256 1664compact4gcc -march=native -mtune=native -O3 -fwrapv -fPIC -fPIE -gdwarf-4 -Wall2026101920261018
115153185 0 031587 1288 1568compact4clang -march=native -O2 -fwrapv -Qunused-arguments -fPIC -fPIE -gdwarf-4 -Wall2026101920261018
116581631 0 024942 1256 1664compact4gcc -march=native -mtune=native -O2 -fwrapv -fPIC -fPIE -gdwarf-4 -Wall2026101920261018
122051390 0 023209 1232 1568compact4gcc -march=native -mtune=native -Os -fwrapv -fPIC -fPIE -gdwarf-4 -Wall2026101920261018
122091631 0 024421 1280 1568compact4clang -march=native -Os -fwrapv -Qunused-arguments -fPIC -fPIE -gdwarf-4 -Wall2026101920261018
122353299 0 033123 1288 1568compact4clang -march=native -O3 -fwrapv -Qunused-arguments -fPIC -fPIE -gdwarf-4 -Wall2026101920261018
132886882 0 028577 1232 1568avxgcc -march=native -mtune=native -Os -fwrapv -fPIC -fPIE -gdwarf-4 -Wall2026101920261018
173601757 0 024565 1280 1568compact2clang -march=native -Os -fwrapv -Qunused-arguments -fPIC -fPIE -gdwarf-4 -Wall2026101920261018
174414060 0 032467 1288 1568compact2clang -march=native -O2 -fwrapv -Qunused-arguments -fPIC -fPIE -gdwarf-4 -Wall2026101920261018
178791532 0 024293 1280 1568compact3clang -march=native -Os -fwrapv -Qunused-arguments -fPIC -fPIE -gdwarf-4 -Wall2026101920261018
179193181 0 032995 1288 1568compact3clang -march=native -O3 -fwrapv -Qunused-arguments -fPIC -fPIE -gdwarf-4 -Wall2026101920261018
179863140 0 031523 1288 1568compact3clang -march=native -O2 -fwrapv -Qunused-arguments -fPIC -fPIE -gdwarf-4 -Wall2026101920261018
181494957 0 034779 1288 1568compact2clang -march=native -O3 -fwrapv -Qunused-arguments -fPIC -fPIE -gdwarf-4 -Wall2026101920261018
182854074 0 025793 1232 1568wflipgcc -march=native -mtune=native -Os -fwrapv -fPIC -fPIE -gdwarf-4 -Wall2026101920261018
188721565 0 024878 1256 1664compact3gcc -march=native -mtune=native -O2 -fwrapv -fPIC -fPIE -gdwarf-4 -Wall2026101920261018
189211815 0 028758 1256 1664compact2gcc -march=native -mtune=native -O3 -fwrapv -fPIC -fPIE -gdwarf-4 -Wall2026101920261018
190071764 0 025142 1256 1664compact2gcc -march=native -mtune=native -O2 -fwrapv -fPIC -fPIE -gdwarf-4 -Wall2026101920261018
197701783 0 023569 1232 1568compact2gcc -march=native -mtune=native -Os -fwrapv -fPIC -fPIE -gdwarf-4 -Wall2026101920261018
199761954 0 028910 1256 1664compact3gcc -march=native -mtune=native -O3 -fwrapv -fPIC -fPIE -gdwarf-4 -Wall2026101920261018
223721563 0 023337 1232 1568compact3gcc -march=native -mtune=native -Os -fwrapv -fPIC -fPIE -gdwarf-4 -Wall2026101920261018

Compiler output


try.c: /usr/bin/x86_64-linux-gnu-ld.bfd: libcrypto_hashblocks_sha512.a(blocks.o): in function `crypto_hashblocks_sha512_dolbeau_intelavx2rorxasm_constbranchindex':
try.c: .../supercop-data/hertz/amd64/try/c/clang_-march=native_-O2_-fwrapv_-Qunused-arguments_-fPIC_-fPIE_-gdwarf-4_-Wall/constbranchindex/crypto_hashblocks/sha512/dolbeau/intelavx2rorxasm/work/blocks.c:45:(.text+0x...): undefined reference to `sha512_rorx'
try.c: clang: error: linker command failed with exit code 1 (use -v to see invocation)

Number of similar (implementation,compiler) pairs: 1, namely:
ImplementationCompiler
dolbeau/intelavx2rorxasmclang -march=native -O2 -fwrapv -Qunused-arguments -fPIC -fPIE -gdwarf-4 -Wall (Ubuntu_Clang_21.1.8_(6ubuntu1))

Compiler output


try.c: /usr/bin/x86_64-linux-gnu-ld.bfd: libcrypto_hashblocks_sha512.a(blocks.o): in function `crypto_hashblocks_sha512_dolbeau_intelavx2rorxasm_constbranchindex':
try.c: .../supercop-data/hertz/amd64/try/c/clang_-march=native_-O3_-fwrapv_-Qunused-arguments_-fPIC_-fPIE_-gdwarf-4_-Wall/constbranchindex/crypto_hashblocks/sha512/dolbeau/intelavx2rorxasm/work/blocks.c:45:(.text+0x...): undefined reference to `sha512_rorx'
try.c: clang: error: linker command failed with exit code 1 (use -v to see invocation)

Number of similar (implementation,compiler) pairs: 1, namely:
ImplementationCompiler
dolbeau/intelavx2rorxasmclang -march=native -O3 -fwrapv -Qunused-arguments -fPIC -fPIE -gdwarf-4 -Wall (Ubuntu_Clang_21.1.8_(6ubuntu1))

Compiler output


try.c: /usr/bin/x86_64-linux-gnu-ld.bfd: libcrypto_hashblocks_sha512.a(blocks.o): in function `crypto_hashblocks_sha512_dolbeau_intelavx2rorxasm_constbranchindex':
try.c: .../supercop-data/hertz/amd64/try/c/clang_-march=native_-Os_-fwrapv_-Qunused-arguments_-fPIC_-fPIE_-gdwarf-4_-Wall/constbranchindex/crypto_hashblocks/sha512/dolbeau/intelavx2rorxasm/work/blocks.c:45:(.text+0x...): undefined reference to `sha512_rorx'
try.c: clang: error: linker command failed with exit code 1 (use -v to see invocation)

Number of similar (implementation,compiler) pairs: 1, namely:
ImplementationCompiler
dolbeau/intelavx2rorxasmclang -march=native -Os -fwrapv -Qunused-arguments -fPIC -fPIE -gdwarf-4 -Wall (Ubuntu_Clang_21.1.8_(6ubuntu1))

Compiler output


try.c: /usr/bin/x86_64-linux-gnu-ld.bfd: libcrypto_hashblocks_sha512.a(blocks.o): in function `crypto_hashblocks_sha512_dolbeau_intelavx2rorxasm_constbranchindex':
try.c: .../supercop-data/hertz/amd64/try/c/gcc_-march=native_-mtune=native_-O2_-fwrapv_-fPIC_-fPIE_-gdwarf-4_-Wall/constbranchindex/crypto_hashblocks/sha512/dolbeau/intelavx2rorxasm/work/blocks.c:45:(.text+0x...): undefined reference to `sha512_rorx'
try.c: collect2: error: ld returned 1 exit status

Number of similar (implementation,compiler) pairs: 1, namely:
ImplementationCompiler
dolbeau/intelavx2rorxasmgcc -march=native -mtune=native -O2 -fwrapv -fPIC -fPIE -gdwarf-4 -Wall (15.2.0)

Compiler output


try.c: /usr/bin/x86_64-linux-gnu-ld.bfd: libcrypto_hashblocks_sha512.a(blocks.o): in function `crypto_hashblocks_sha512_dolbeau_intelavx2rorxasm_constbranchindex':
try.c: .../supercop-data/hertz/amd64/try/c/gcc_-march=native_-mtune=native_-O3_-fwrapv_-fPIC_-fPIE_-gdwarf-4_-Wall/constbranchindex/crypto_hashblocks/sha512/dolbeau/intelavx2rorxasm/work/blocks.c:45:(.text+0x...): undefined reference to `sha512_rorx'
try.c: collect2: error: ld returned 1 exit status

Number of similar (implementation,compiler) pairs: 1, namely:
ImplementationCompiler
dolbeau/intelavx2rorxasmgcc -march=native -mtune=native -O3 -fwrapv -fPIC -fPIE -gdwarf-4 -Wall (15.2.0)

Compiler output


try.c: /usr/bin/x86_64-linux-gnu-ld.bfd: libcrypto_hashblocks_sha512.a(blocks.o): in function `crypto_hashblocks_sha512_dolbeau_intelavx2rorxasm_constbranchindex':
try.c: .../supercop-data/hertz/amd64/try/c/gcc_-march=native_-mtune=native_-Os_-fwrapv_-fPIC_-fPIE_-gdwarf-4_-Wall/constbranchindex/crypto_hashblocks/sha512/dolbeau/intelavx2rorxasm/work/blocks.c:45:(.text+0x...): undefined reference to `sha512_rorx'
try.c: collect2: error: ld returned 1 exit status

Number of similar (implementation,compiler) pairs: 1, namely:
ImplementationCompiler
dolbeau/intelavx2rorxasmgcc -march=native -mtune=native -Os -fwrapv -fPIC -fPIE -gdwarf-4 -Wall (15.2.0)

Compiler output


try.c: /usr/bin/x86_64-linux-gnu-ld.bfd: libcrypto_hashblocks_sha512.a(blocks.o): in function `crypto_hashblocks_sha512_dolbeau_intelavxasm_constbranchindex':
try.c: .../supercop-data/hertz/amd64/try/c/clang_-march=native_-O2_-fwrapv_-Qunused-arguments_-fPIC_-fPIE_-gdwarf-4_-Wall/constbranchindex/crypto_hashblocks/sha512/dolbeau/intelavxasm/work/blocks.c:45:(.text+0x...): undefined reference to `sha512_avx'
try.c: clang: error: linker command failed with exit code 1 (use -v to see invocation)

Number of similar (implementation,compiler) pairs: 1, namely:
ImplementationCompiler
dolbeau/intelavxasmclang -march=native -O2 -fwrapv -Qunused-arguments -fPIC -fPIE -gdwarf-4 -Wall (Ubuntu_Clang_21.1.8_(6ubuntu1))

Compiler output


try.c: /usr/bin/x86_64-linux-gnu-ld.bfd: libcrypto_hashblocks_sha512.a(blocks.o): in function `crypto_hashblocks_sha512_dolbeau_intelavxasm_constbranchindex':
try.c: .../supercop-data/hertz/amd64/try/c/clang_-march=native_-O3_-fwrapv_-Qunused-arguments_-fPIC_-fPIE_-gdwarf-4_-Wall/constbranchindex/crypto_hashblocks/sha512/dolbeau/intelavxasm/work/blocks.c:45:(.text+0x...): undefined reference to `sha512_avx'
try.c: clang: error: linker command failed with exit code 1 (use -v to see invocation)

Number of similar (implementation,compiler) pairs: 1, namely:
ImplementationCompiler
dolbeau/intelavxasmclang -march=native -O3 -fwrapv -Qunused-arguments -fPIC -fPIE -gdwarf-4 -Wall (Ubuntu_Clang_21.1.8_(6ubuntu1))

Compiler output


try.c: /usr/bin/x86_64-linux-gnu-ld.bfd: libcrypto_hashblocks_sha512.a(blocks.o): in function `crypto_hashblocks_sha512_dolbeau_intelavxasm_constbranchindex':
try.c: .../supercop-data/hertz/amd64/try/c/clang_-march=native_-Os_-fwrapv_-Qunused-arguments_-fPIC_-fPIE_-gdwarf-4_-Wall/constbranchindex/crypto_hashblocks/sha512/dolbeau/intelavxasm/work/blocks.c:45:(.text+0x...): undefined reference to `sha512_avx'
try.c: clang: error: linker command failed with exit code 1 (use -v to see invocation)

Number of similar (implementation,compiler) pairs: 1, namely:
ImplementationCompiler
dolbeau/intelavxasmclang -march=native -Os -fwrapv -Qunused-arguments -fPIC -fPIE -gdwarf-4 -Wall (Ubuntu_Clang_21.1.8_(6ubuntu1))

Compiler output


try.c: /usr/bin/x86_64-linux-gnu-ld.bfd: libcrypto_hashblocks_sha512.a(blocks.o): in function `crypto_hashblocks_sha512_dolbeau_intelavxasm_constbranchindex':
try.c: .../supercop-data/hertz/amd64/try/c/gcc_-march=native_-mtune=native_-O2_-fwrapv_-fPIC_-fPIE_-gdwarf-4_-Wall/constbranchindex/crypto_hashblocks/sha512/dolbeau/intelavxasm/work/blocks.c:45:(.text+0x...): undefined reference to `sha512_avx'
try.c: collect2: error: ld returned 1 exit status

Number of similar (implementation,compiler) pairs: 1, namely:
ImplementationCompiler
dolbeau/intelavxasmgcc -march=native -mtune=native -O2 -fwrapv -fPIC -fPIE -gdwarf-4 -Wall (15.2.0)

Compiler output


try.c: /usr/bin/x86_64-linux-gnu-ld.bfd: libcrypto_hashblocks_sha512.a(blocks.o): in function `crypto_hashblocks_sha512_dolbeau_intelavxasm_constbranchindex':
try.c: .../supercop-data/hertz/amd64/try/c/gcc_-march=native_-mtune=native_-O3_-fwrapv_-fPIC_-fPIE_-gdwarf-4_-Wall/constbranchindex/crypto_hashblocks/sha512/dolbeau/intelavxasm/work/blocks.c:45:(.text+0x...): undefined reference to `sha512_avx'
try.c: collect2: error: ld returned 1 exit status

Number of similar (implementation,compiler) pairs: 1, namely:
ImplementationCompiler
dolbeau/intelavxasmgcc -march=native -mtune=native -O3 -fwrapv -fPIC -fPIE -gdwarf-4 -Wall (15.2.0)

Compiler output


try.c: /usr/bin/x86_64-linux-gnu-ld.bfd: libcrypto_hashblocks_sha512.a(blocks.o): in function `crypto_hashblocks_sha512_dolbeau_intelavxasm_constbranchindex':
try.c: .../supercop-data/hertz/amd64/try/c/gcc_-march=native_-mtune=native_-Os_-fwrapv_-fPIC_-fPIE_-gdwarf-4_-Wall/constbranchindex/crypto_hashblocks/sha512/dolbeau/intelavxasm/work/blocks.c:45:(.text+0x...): undefined reference to `sha512_avx'
try.c: collect2: error: ld returned 1 exit status

Number of similar (implementation,compiler) pairs: 1, namely:
ImplementationCompiler
dolbeau/intelavxasmgcc -march=native -mtune=native -Os -fwrapv -fPIC -fPIE -gdwarf-4 -Wall (15.2.0)

Compiler output


try.c: /usr/bin/x86_64-linux-gnu-ld.bfd: libcrypto_hashblocks_sha512.a(blocks.o): in function `crypto_hashblocks_sha512_dolbeau_intelsse4asm_constbranchindex':
try.c: .../supercop-data/hertz/amd64/try/c/clang_-march=native_-O2_-fwrapv_-Qunused-arguments_-fPIC_-fPIE_-gdwarf-4_-Wall/constbranchindex/crypto_hashblocks/sha512/dolbeau/intelsse4asm/work/blocks.c:45:(.text+0x...): undefined reference to `sha512_sse4'
try.c: clang: error: linker command failed with exit code 1 (use -v to see invocation)

Number of similar (implementation,compiler) pairs: 1, namely:
ImplementationCompiler
dolbeau/intelsse4asmclang -march=native -O2 -fwrapv -Qunused-arguments -fPIC -fPIE -gdwarf-4 -Wall (Ubuntu_Clang_21.1.8_(6ubuntu1))

Compiler output


try.c: /usr/bin/x86_64-linux-gnu-ld.bfd: libcrypto_hashblocks_sha512.a(blocks.o): in function `crypto_hashblocks_sha512_dolbeau_intelsse4asm_constbranchindex':
try.c: .../supercop-data/hertz/amd64/try/c/clang_-march=native_-O3_-fwrapv_-Qunused-arguments_-fPIC_-fPIE_-gdwarf-4_-Wall/constbranchindex/crypto_hashblocks/sha512/dolbeau/intelsse4asm/work/blocks.c:45:(.text+0x...): undefined reference to `sha512_sse4'
try.c: clang: error: linker command failed with exit code 1 (use -v to see invocation)

Number of similar (implementation,compiler) pairs: 1, namely:
ImplementationCompiler
dolbeau/intelsse4asmclang -march=native -O3 -fwrapv -Qunused-arguments -fPIC -fPIE -gdwarf-4 -Wall (Ubuntu_Clang_21.1.8_(6ubuntu1))

Compiler output


try.c: /usr/bin/x86_64-linux-gnu-ld.bfd: libcrypto_hashblocks_sha512.a(blocks.o): in function `crypto_hashblocks_sha512_dolbeau_intelsse4asm_constbranchindex':
try.c: .../supercop-data/hertz/amd64/try/c/clang_-march=native_-Os_-fwrapv_-Qunused-arguments_-fPIC_-fPIE_-gdwarf-4_-Wall/constbranchindex/crypto_hashblocks/sha512/dolbeau/intelsse4asm/work/blocks.c:45:(.text+0x...): undefined reference to `sha512_sse4'
try.c: clang: error: linker command failed with exit code 1 (use -v to see invocation)

Number of similar (implementation,compiler) pairs: 1, namely:
ImplementationCompiler
dolbeau/intelsse4asmclang -march=native -Os -fwrapv -Qunused-arguments -fPIC -fPIE -gdwarf-4 -Wall (Ubuntu_Clang_21.1.8_(6ubuntu1))

Compiler output


try.c: /usr/bin/x86_64-linux-gnu-ld.bfd: libcrypto_hashblocks_sha512.a(blocks.o): in function `crypto_hashblocks_sha512_dolbeau_intelsse4asm_constbranchindex':
try.c: .../supercop-data/hertz/amd64/try/c/gcc_-march=native_-mtune=native_-O2_-fwrapv_-fPIC_-fPIE_-gdwarf-4_-Wall/constbranchindex/crypto_hashblocks/sha512/dolbeau/intelsse4asm/work/blocks.c:45:(.text+0x...): undefined reference to `sha512_sse4'
try.c: collect2: error: ld returned 1 exit status

Number of similar (implementation,compiler) pairs: 1, namely:
ImplementationCompiler
dolbeau/intelsse4asmgcc -march=native -mtune=native -O2 -fwrapv -fPIC -fPIE -gdwarf-4 -Wall (15.2.0)

Compiler output


try.c: /usr/bin/x86_64-linux-gnu-ld.bfd: libcrypto_hashblocks_sha512.a(blocks.o): in function `crypto_hashblocks_sha512_dolbeau_intelsse4asm_constbranchindex':
try.c: .../supercop-data/hertz/amd64/try/c/gcc_-march=native_-mtune=native_-O3_-fwrapv_-fPIC_-fPIE_-gdwarf-4_-Wall/constbranchindex/crypto_hashblocks/sha512/dolbeau/intelsse4asm/work/blocks.c:45:(.text+0x...): undefined reference to `sha512_sse4'
try.c: collect2: error: ld returned 1 exit status

Number of similar (implementation,compiler) pairs: 1, namely:
ImplementationCompiler
dolbeau/intelsse4asmgcc -march=native -mtune=native -O3 -fwrapv -fPIC -fPIE -gdwarf-4 -Wall (15.2.0)

Compiler output


try.c: /usr/bin/x86_64-linux-gnu-ld.bfd: libcrypto_hashblocks_sha512.a(blocks.o): in function `crypto_hashblocks_sha512_dolbeau_intelsse4asm_constbranchindex':
try.c: .../supercop-data/hertz/amd64/try/c/gcc_-march=native_-mtune=native_-Os_-fwrapv_-fPIC_-fPIE_-gdwarf-4_-Wall/constbranchindex/crypto_hashblocks/sha512/dolbeau/intelsse4asm/work/blocks.c:45:(.text+0x...): undefined reference to `sha512_sse4'
try.c: collect2: error: ld returned 1 exit status

Number of similar (implementation,compiler) pairs: 1, namely:
ImplementationCompiler
dolbeau/intelsse4asmgcc -march=native -mtune=native -Os -fwrapv -fPIC -fPIE -gdwarf-4 -Wall (15.2.0)

TIMECOP error (can be valgrind bug)


error 132

Process terminating with default action of signal 4 (SIGILL)
 Illegal opcode at address 0x4006298
   at 0x...: memset (string_fortified.h:59)
   by 0x...: cpucycles_works (wrapper.c:59)
   by 0x...: supercop_cpucycles_ticks_amd64_tsc_setup (amd64-tsc.c:28)
   by 0x...: cpucycles_init (wrapper.c:314)
   by 0x...: main (try-anything.c:330)
Illegal instruction (core dumped)

Number of similar (implementation,compiler) pairs: 1, namely:
ImplementationCompiler
avxclang -march=native -O2 -fwrapv -Qunused-arguments -fPIC -fPIE -gdwarf-4 -Wall (Ubuntu_Clang_21.1.8_(6ubuntu1))

TIMECOP error (can be valgrind bug)


error 132

Process terminating with default action of signal 4 (SIGILL)
 Illegal opcode at address 0x4006458
   at 0x...: memset (string_fortified.h:59)
   by 0x...: cpucycles_works (wrapper.c:59)
   by 0x...: supercop_cpucycles_ticks_amd64_tsc_setup (amd64-tsc.c:28)
   by 0x...: cpucycles_init (wrapper.c:314)
   by 0x...: main (try-anything.c:330)
Illegal instruction (core dumped)

Number of similar (implementation,compiler) pairs: 1, namely:
ImplementationCompiler
avxclang -march=native -O3 -fwrapv -Qunused-arguments -fPIC -fPIE -gdwarf-4 -Wall (Ubuntu_Clang_21.1.8_(6ubuntu1))

TIMECOP error (can be valgrind bug)


error 132

Process terminating with default action of signal 4 (SIGILL)
 Illegal opcode at address 0x40059D8
   at 0x...: memset (string_fortified.h:59)
   by 0x...: cpucycles_works (wrapper.c:59)
   by 0x...: supercop_cpucycles_ticks_amd64_tsc_setup (amd64-tsc.c:28)
   by 0x...: cpucycles_init (wrapper.c:314)
   by 0x...: main (try-anything.c:330)
Illegal instruction (core dumped)

Number of similar (implementation,compiler) pairs: 1, namely:
ImplementationCompiler
avxclang -march=native -Os -fwrapv -Qunused-arguments -fPIC -fPIE -gdwarf-4 -Wall (Ubuntu_Clang_21.1.8_(6ubuntu1))

TIMECOP error (can be valgrind bug)


error 132

Process terminating with default action of signal 4 (SIGILL)
 Illegal opcode at address 0x4005B18
   at 0x...: memset (string_fortified.h:59)
   by 0x...: cpucycles_works (wrapper.c:59)
   by 0x...: supercop_cpucycles_ticks_amd64_tsc_setup (amd64-tsc.c:28)
   by 0x...: cpucycles_init (wrapper.c:314)
   by 0x...: main (try-anything.c:330)
Illegal instruction (core dumped)

Number of similar (implementation,compiler) pairs: 1, namely:
ImplementationCompiler
avxgcc -march=native -mtune=native -O2 -fwrapv -fPIC -fPIE -gdwarf-4 -Wall (15.2.0)

TIMECOP error (can be valgrind bug)


error 132

Process terminating with default action of signal 4 (SIGILL)
 Illegal opcode at address 0x4005FD8
   at 0x...: memset (string_fortified.h:59)
   by 0x...: cpucycles_works (wrapper.c:59)
   by 0x...: supercop_cpucycles_ticks_amd64_tsc_setup (amd64-tsc.c:28)
   by 0x...: cpucycles_init (wrapper.c:314)
   by 0x...: main (try-anything.c:330)
Illegal instruction (core dumped)

Number of similar (implementation,compiler) pairs: 1, namely:
ImplementationCompiler
avxgcc -march=native -mtune=native -O3 -fwrapv -fPIC -fPIE -gdwarf-4 -Wall (15.2.0)

TIMECOP error (can be valgrind bug)


error 132

Process terminating with default action of signal 4 (SIGILL)
 Illegal opcode at address 0x4005A18
   at 0x...: memset (string_fortified.h:59)
   by 0x...: cpucycles_works (wrapper.c:59)
   by 0x...: supercop_cpucycles_ticks_amd64_tsc_setup (amd64-tsc.c:28)
   by 0x...: cpucycles_init (wrapper.c:314)
   by 0x...: main (try-anything.c:330)
Illegal instruction (core dumped)

Number of similar (implementation,compiler) pairs: 1, namely:
ImplementationCompiler
avxgcc -march=native -mtune=native -Os -fwrapv -fPIC -fPIE -gdwarf-4 -Wall (15.2.0)

TIMECOP error (can be valgrind bug)


error 132

Process terminating with default action of signal 4 (SIGILL)
 Illegal opcode at address 0x4006018
   at 0x...: memset (string_fortified.h:59)
   by 0x...: cpucycles_works (wrapper.c:59)
   by 0x...: supercop_cpucycles_ticks_amd64_tsc_setup (amd64-tsc.c:28)
   by 0x...: cpucycles_init (wrapper.c:314)
   by 0x...: main (try-anything.c:330)
Illegal instruction (core dumped)

Number of similar (implementation,compiler) pairs: 1, namely:
ImplementationCompiler
avx2clang -march=native -O2 -fwrapv -Qunused-arguments -fPIC -fPIE -gdwarf-4 -Wall (Ubuntu_Clang_21.1.8_(6ubuntu1))

TIMECOP error (can be valgrind bug)


error 132

Process terminating with default action of signal 4 (SIGILL)
 Illegal opcode at address 0x4006198
   at 0x...: memset (string_fortified.h:59)
   by 0x...: cpucycles_works (wrapper.c:59)
   by 0x...: supercop_cpucycles_ticks_amd64_tsc_setup (amd64-tsc.c:28)
   by 0x...: cpucycles_init (wrapper.c:314)
   by 0x...: main (try-anything.c:330)
Illegal instruction (core dumped)

Number of similar (implementation,compiler) pairs: 1, namely:
ImplementationCompiler
avx2clang -march=native -O3 -fwrapv -Qunused-arguments -fPIC -fPIE -gdwarf-4 -Wall (Ubuntu_Clang_21.1.8_(6ubuntu1))

TIMECOP error (can be valgrind bug)


error 132

Process terminating with default action of signal 4 (SIGILL)
 Illegal opcode at address 0x4005798
   at 0x...: memset (string_fortified.h:59)
   by 0x...: cpucycles_works (wrapper.c:59)
   by 0x...: supercop_cpucycles_ticks_amd64_tsc_setup (amd64-tsc.c:28)
   by 0x...: cpucycles_init (wrapper.c:314)
   by 0x...: main (try-anything.c:330)
Illegal instruction (core dumped)

Number of similar (implementation,compiler) pairs: 1, namely:
ImplementationCompiler
avx2clang -march=native -Os -fwrapv -Qunused-arguments -fPIC -fPIE -gdwarf-4 -Wall (Ubuntu_Clang_21.1.8_(6ubuntu1))

TIMECOP error (can be valgrind bug)


error 132

Process terminating with default action of signal 4 (SIGILL)
 Illegal opcode at address 0x4005918
   at 0x...: memset (string_fortified.h:59)
   by 0x...: cpucycles_works (wrapper.c:59)
   by 0x...: supercop_cpucycles_ticks_amd64_tsc_setup (amd64-tsc.c:28)
   by 0x...: cpucycles_init (wrapper.c:314)
   by 0x...: main (try-anything.c:330)
Illegal instruction (core dumped)

Number of similar (implementation,compiler) pairs: 1, namely:
ImplementationCompiler
avx2gcc -march=native -mtune=native -O2 -fwrapv -fPIC -fPIE -gdwarf-4 -Wall (15.2.0)

TIMECOP error (can be valgrind bug)


error 132

Process terminating with default action of signal 4 (SIGILL)
 Illegal opcode at address 0x4005E18
   at 0x...: memset (string_fortified.h:59)
   by 0x...: cpucycles_works (wrapper.c:59)
   by 0x...: supercop_cpucycles_ticks_amd64_tsc_setup (amd64-tsc.c:28)
   by 0x...: cpucycles_init (wrapper.c:314)
   by 0x...: main (try-anything.c:330)
Illegal instruction (core dumped)

Number of similar (implementation,compiler) pairs: 1, namely:
ImplementationCompiler
avx2gcc -march=native -mtune=native -O3 -fwrapv -fPIC -fPIE -gdwarf-4 -Wall (15.2.0)

TIMECOP error (can be valgrind bug)


error 132

Process terminating with default action of signal 4 (SIGILL)
 Illegal opcode at address 0x4005318
   at 0x...: memset (string_fortified.h:59)
   by 0x...: cpucycles_works (wrapper.c:59)
   by 0x...: supercop_cpucycles_ticks_amd64_tsc_setup (amd64-tsc.c:28)
   by 0x...: cpucycles_init (wrapper.c:314)
   by 0x...: main (try-anything.c:330)
Illegal instruction (core dumped)

Number of similar (implementation,compiler) pairs: 1, namely:
ImplementationCompiler
avx2gcc -march=native -mtune=native -Os -fwrapv -fPIC -fPIE -gdwarf-4 -Wall (15.2.0)

TIMECOP error (can be valgrind bug)


error 132

Process terminating with default action of signal 4 (SIGILL)
 Illegal opcode at address 0x4005D58
   at 0x...: memset (string_fortified.h:59)
   by 0x...: cpucycles_works (wrapper.c:59)
   by 0x...: supercop_cpucycles_ticks_amd64_tsc_setup (amd64-tsc.c:28)
   by 0x...: cpucycles_init (wrapper.c:314)
   by 0x...: main (try-anything.c:330)
Illegal instruction (core dumped)

Number of similar (implementation,compiler) pairs: 1, namely:
ImplementationCompiler
compactclang -march=native -O2 -fwrapv -Qunused-arguments -fPIC -fPIE -gdwarf-4 -Wall (Ubuntu_Clang_21.1.8_(6ubuntu1))

TIMECOP error (can be valgrind bug)


error 132

Process terminating with default action of signal 4 (SIGILL)
 Illegal opcode at address 0x4005E58
   at 0x...: memset (string_fortified.h:59)
   by 0x...: cpucycles_works (wrapper.c:59)
   by 0x...: supercop_cpucycles_ticks_amd64_tsc_setup (amd64-tsc.c:28)
   by 0x...: cpucycles_init (wrapper.c:314)
   by 0x...: main (try-anything.c:330)
Illegal instruction (core dumped)

Number of similar (implementation,compiler) pairs: 1, namely:
ImplementationCompiler
compactclang -march=native -O3 -fwrapv -Qunused-arguments -fPIC -fPIE -gdwarf-4 -Wall (Ubuntu_Clang_21.1.8_(6ubuntu1))

TIMECOP error (can be valgrind bug)


error 132

Process terminating with default action of signal 4 (SIGILL)
 Illegal opcode at address 0x4005198
   at 0x...: memset (string_fortified.h:59)
   by 0x...: cpucycles_works (wrapper.c:59)
   by 0x...: supercop_cpucycles_ticks_amd64_tsc_setup (amd64-tsc.c:28)
   by 0x...: cpucycles_init (wrapper.c:314)
   by 0x...: main (try-anything.c:330)
Illegal instruction (core dumped)

Number of similar (implementation,compiler) pairs: 1, namely:
ImplementationCompiler
compactclang -march=native -Os -fwrapv -Qunused-arguments -fPIC -fPIE -gdwarf-4 -Wall (Ubuntu_Clang_21.1.8_(6ubuntu1))

TIMECOP error (can be valgrind bug)


error 132

Process terminating with default action of signal 4 (SIGILL)
 Illegal opcode at address 0x4005618
   at 0x...: memset (string_fortified.h:59)
   by 0x...: cpucycles_works (wrapper.c:59)
   by 0x...: supercop_cpucycles_ticks_amd64_tsc_setup (amd64-tsc.c:28)
   by 0x...: cpucycles_init (wrapper.c:314)
   by 0x...: main (try-anything.c:330)
Illegal instruction (core dumped)

Number of similar (implementation,compiler) pairs: 1, namely:
ImplementationCompiler
compactgcc -march=native -mtune=native -O2 -fwrapv -fPIC -fPIE -gdwarf-4 -Wall (15.2.0)

TIMECOP error (can be valgrind bug)


error 132

Process terminating with default action of signal 4 (SIGILL)
 Illegal opcode at address 0x4005B58
   at 0x...: memset (string_fortified.h:59)
   by 0x...: cpucycles_works (wrapper.c:59)
   by 0x...: supercop_cpucycles_ticks_amd64_tsc_setup (amd64-tsc.c:28)
   by 0x...: cpucycles_init (wrapper.c:314)
   by 0x...: main (try-anything.c:330)
Illegal instruction (core dumped)

Number of similar (implementation,compiler) pairs: 1, namely:
ImplementationCompiler
compactgcc -march=native -mtune=native -O3 -fwrapv -fPIC -fPIE -gdwarf-4 -Wall (15.2.0)

TIMECOP error (can be valgrind bug)


error 132

Process terminating with default action of signal 4 (SIGILL)
 Illegal opcode at address 0x40051D8
   at 0x...: memset (string_fortified.h:59)
   by 0x...: cpucycles_works (wrapper.c:59)
   by 0x...: supercop_cpucycles_ticks_amd64_tsc_setup (amd64-tsc.c:28)
   by 0x...: cpucycles_init (wrapper.c:314)
   by 0x...: main (try-anything.c:330)
Illegal instruction (core dumped)

Number of similar (implementation,compiler) pairs: 1, namely:
ImplementationCompiler
compactgcc -march=native -mtune=native -Os -fwrapv -fPIC -fPIE -gdwarf-4 -Wall (15.2.0)

TIMECOP error (can be valgrind bug)


error 132

Process terminating with default action of signal 4 (SIGILL)
 Illegal opcode at address 0x4005758
   at 0x...: memset (string_fortified.h:59)
   by 0x...: cpucycles_works (wrapper.c:59)
   by 0x...: supercop_cpucycles_ticks_amd64_tsc_setup (amd64-tsc.c:28)
   by 0x...: cpucycles_init (wrapper.c:314)
   by 0x...: main (try-anything.c:330)
Illegal instruction (core dumped)

Number of similar (implementation,compiler) pairs: 1, namely:
ImplementationCompiler
compact2clang -march=native -O2 -fwrapv -Qunused-arguments -fPIC -fPIE -gdwarf-4 -Wall (Ubuntu_Clang_21.1.8_(6ubuntu1))

TIMECOP error (can be valgrind bug)


error 132

Process terminating with default action of signal 4 (SIGILL)
 Illegal opcode at address 0x4005C18
   at 0x...: memset (string_fortified.h:59)
   by 0x...: cpucycles_works (wrapper.c:59)
   by 0x...: supercop_cpucycles_ticks_amd64_tsc_setup (amd64-tsc.c:28)
   by 0x...: cpucycles_init (wrapper.c:314)
   by 0x...: main (try-anything.c:330)
Illegal instruction (core dumped)

Number of similar (implementation,compiler) pairs: 1, namely:
ImplementationCompiler
compact2clang -march=native -O3 -fwrapv -Qunused-arguments -fPIC -fPIE -gdwarf-4 -Wall (Ubuntu_Clang_21.1.8_(6ubuntu1))

TIMECOP error (can be valgrind bug)


error 132

Process terminating with default action of signal 4 (SIGILL)
 Illegal opcode at address 0x40048D8
   at 0x...: memset (string_fortified.h:59)
   by 0x...: cpucycles_works (wrapper.c:59)
   by 0x...: supercop_cpucycles_ticks_amd64_tsc_setup (amd64-tsc.c:28)
   by 0x...: cpucycles_init (wrapper.c:314)
   by 0x...: main (try-anything.c:330)
Illegal instruction (core dumped)

Number of similar (implementation,compiler) pairs: 1, namely:
ImplementationCompiler
compact2clang -march=native -Os -fwrapv -Qunused-arguments -fPIC -fPIE -gdwarf-4 -Wall (Ubuntu_Clang_21.1.8_(6ubuntu1))

TIMECOP error (can be valgrind bug)


error 132

Process terminating with default action of signal 4 (SIGILL)
 Illegal opcode at address 0x4004BD8
   at 0x...: memset (string_fortified.h:59)
   by 0x...: cpucycles_works (wrapper.c:59)
   by 0x...: supercop_cpucycles_ticks_amd64_tsc_setup (amd64-tsc.c:28)
   by 0x...: cpucycles_init (wrapper.c:314)
   by 0x...: main (try-anything.c:330)
Illegal instruction (core dumped)

Number of similar (implementation,compiler) pairs: 1, namely:
ImplementationCompiler
compact2gcc -march=native -mtune=native -O2 -fwrapv -fPIC -fPIE -gdwarf-4 -Wall (15.2.0)

TIMECOP error (can be valgrind bug)


error 132

Process terminating with default action of signal 4 (SIGILL)
 Illegal opcode at address 0x4005118
   at 0x...: memset (string_fortified.h:59)
   by 0x...: cpucycles_works (wrapper.c:59)
   by 0x...: supercop_cpucycles_ticks_amd64_tsc_setup (amd64-tsc.c:28)
   by 0x...: cpucycles_init (wrapper.c:314)
   by 0x...: main (try-anything.c:330)
Illegal instruction (core dumped)

Number of similar (implementation,compiler) pairs: 1, namely:
ImplementationCompiler
compact2gcc -march=native -mtune=native -O3 -fwrapv -fPIC -fPIE -gdwarf-4 -Wall (15.2.0)

TIMECOP error (can be valgrind bug)


error 132

Process terminating with default action of signal 4 (SIGILL)
 Illegal opcode at address 0x4004698
   at 0x...: memset (string_fortified.h:59)
   by 0x...: cpucycles_works (wrapper.c:59)
   by 0x...: supercop_cpucycles_ticks_amd64_tsc_setup (amd64-tsc.c:28)
   by 0x...: cpucycles_init (wrapper.c:314)
   by 0x...: main (try-anything.c:330)
Illegal instruction (core dumped)

Number of similar (implementation,compiler) pairs: 1, namely:
ImplementationCompiler
compact2gcc -march=native -mtune=native -Os -fwrapv -fPIC -fPIE -gdwarf-4 -Wall (15.2.0)

TIMECOP error (can be valgrind bug)


error 132

Process terminating with default action of signal 4 (SIGILL)
 Illegal opcode at address 0x4005418
   at 0x...: memset (string_fortified.h:59)
   by 0x...: cpucycles_works (wrapper.c:59)
   by 0x...: supercop_cpucycles_ticks_amd64_tsc_setup (amd64-tsc.c:28)
   by 0x...: cpucycles_init (wrapper.c:314)
   by 0x...: main (try-anything.c:330)
Illegal instruction (core dumped)

Number of similar (implementation,compiler) pairs: 2, namely:
ImplementationCompiler
compact3clang -march=native -O2 -fwrapv -Qunused-arguments -fPIC -fPIE -gdwarf-4 -Wall (Ubuntu_Clang_21.1.8_(6ubuntu1))
compact4clang -march=native -O2 -fwrapv -Qunused-arguments -fPIC -fPIE -gdwarf-4 -Wall (Ubuntu_Clang_21.1.8_(6ubuntu1))

TIMECOP error (can be valgrind bug)


error 132

Process terminating with default action of signal 4 (SIGILL)
 Illegal opcode at address 0x4005518
   at 0x...: memset (string_fortified.h:59)
   by 0x...: cpucycles_works (wrapper.c:59)
   by 0x...: supercop_cpucycles_ticks_amd64_tsc_setup (amd64-tsc.c:28)
   by 0x...: cpucycles_init (wrapper.c:314)
   by 0x...: main (try-anything.c:330)
Illegal instruction (core dumped)

Number of similar (implementation,compiler) pairs: 1, namely:
ImplementationCompiler
compact3clang -march=native -O3 -fwrapv -Qunused-arguments -fPIC -fPIE -gdwarf-4 -Wall (Ubuntu_Clang_21.1.8_(6ubuntu1))

TIMECOP error (can be valgrind bug)


error 132

Process terminating with default action of signal 4 (SIGILL)
 Illegal opcode at address 0x4004858
   at 0x...: memset (string_fortified.h:59)
   by 0x...: cpucycles_works (wrapper.c:59)
   by 0x...: supercop_cpucycles_ticks_amd64_tsc_setup (amd64-tsc.c:28)
   by 0x...: cpucycles_init (wrapper.c:314)
   by 0x...: main (try-anything.c:330)
Illegal instruction (core dumped)

Number of similar (implementation,compiler) pairs: 2, namely:
ImplementationCompiler
compact3clang -march=native -Os -fwrapv -Qunused-arguments -fPIC -fPIE -gdwarf-4 -Wall (Ubuntu_Clang_21.1.8_(6ubuntu1))
compact4clang -march=native -Os -fwrapv -Qunused-arguments -fPIC -fPIE -gdwarf-4 -Wall (Ubuntu_Clang_21.1.8_(6ubuntu1))

TIMECOP error (can be valgrind bug)


error 132

Process terminating with default action of signal 4 (SIGILL)
 Illegal opcode at address 0x4004B98
   at 0x...: memset (string_fortified.h:59)
   by 0x...: cpucycles_works (wrapper.c:59)
   by 0x...: supercop_cpucycles_ticks_amd64_tsc_setup (amd64-tsc.c:28)
   by 0x...: cpucycles_init (wrapper.c:314)
   by 0x...: main (try-anything.c:330)
Illegal instruction (core dumped)

Number of similar (implementation,compiler) pairs: 2, namely:
ImplementationCompiler
compact3gcc -march=native -mtune=native -O2 -fwrapv -fPIC -fPIE -gdwarf-4 -Wall (15.2.0)
compact4gcc -march=native -mtune=native -O2 -fwrapv -fPIC -fPIE -gdwarf-4 -Wall (15.2.0)

TIMECOP error (can be valgrind bug)


error 132

Process terminating with default action of signal 4 (SIGILL)
 Illegal opcode at address 0x4005218
   at 0x...: memset (string_fortified.h:59)
   by 0x...: cpucycles_works (wrapper.c:59)
   by 0x...: supercop_cpucycles_ticks_amd64_tsc_setup (amd64-tsc.c:28)
   by 0x...: cpucycles_init (wrapper.c:314)
   by 0x...: main (try-anything.c:330)
Illegal instruction (core dumped)

Number of similar (implementation,compiler) pairs: 1, namely:
ImplementationCompiler
compact3gcc -march=native -mtune=native -O3 -fwrapv -fPIC -fPIE -gdwarf-4 -Wall (15.2.0)

TIMECOP error (can be valgrind bug)


error 132

Process terminating with default action of signal 4 (SIGILL)
 Illegal opcode at address 0x40045D8
   at 0x...: memset (string_fortified.h:59)
   by 0x...: cpucycles_works (wrapper.c:59)
   by 0x...: supercop_cpucycles_ticks_amd64_tsc_setup (amd64-tsc.c:28)
   by 0x...: cpucycles_init (wrapper.c:314)
   by 0x...: main (try-anything.c:330)
Illegal instruction (core dumped)

Number of similar (implementation,compiler) pairs: 1, namely:
ImplementationCompiler
compact3gcc -march=native -mtune=native -Os -fwrapv -fPIC -fPIE -gdwarf-4 -Wall (15.2.0)

TIMECOP error (can be valgrind bug)


error 132

Process terminating with default action of signal 4 (SIGILL)
 Illegal opcode at address 0x4005558
   at 0x...: memset (string_fortified.h:59)
   by 0x...: cpucycles_works (wrapper.c:59)
   by 0x...: supercop_cpucycles_ticks_amd64_tsc_setup (amd64-tsc.c:28)
   by 0x...: cpucycles_init (wrapper.c:314)
   by 0x...: main (try-anything.c:330)
Illegal instruction (core dumped)

Number of similar (implementation,compiler) pairs: 1, namely:
ImplementationCompiler
compact4clang -march=native -O3 -fwrapv -Qunused-arguments -fPIC -fPIE -gdwarf-4 -Wall (Ubuntu_Clang_21.1.8_(6ubuntu1))

TIMECOP error (can be valgrind bug)


error 132

Process terminating with default action of signal 4 (SIGILL)
 Illegal opcode at address 0x4005098
   at 0x...: memset (string_fortified.h:59)
   by 0x...: cpucycles_works (wrapper.c:59)
   by 0x...: supercop_cpucycles_ticks_amd64_tsc_setup (amd64-tsc.c:28)
   by 0x...: cpucycles_init (wrapper.c:314)
   by 0x...: main (try-anything.c:330)
Illegal instruction (core dumped)

Number of similar (implementation,compiler) pairs: 1, namely:
ImplementationCompiler
compact4gcc -march=native -mtune=native -O3 -fwrapv -fPIC -fPIE -gdwarf-4 -Wall (15.2.0)

TIMECOP error (can be valgrind bug)


error 132

Process terminating with default action of signal 4 (SIGILL)
 Illegal opcode at address 0x4004558
   at 0x...: memset (string_fortified.h:59)
   by 0x...: cpucycles_works (wrapper.c:59)
   by 0x...: supercop_cpucycles_ticks_amd64_tsc_setup (amd64-tsc.c:28)
   by 0x...: cpucycles_init (wrapper.c:314)
   by 0x...: main (try-anything.c:330)
Illegal instruction (core dumped)

Number of similar (implementation,compiler) pairs: 1, namely:
ImplementationCompiler
compact4gcc -march=native -mtune=native -Os -fwrapv -fPIC -fPIE -gdwarf-4 -Wall (15.2.0)

TIMECOP error (can be valgrind bug)


error 132

Process terminating with default action of signal 4 (SIGILL)
 Illegal opcode at address 0x4008B58
   at 0x...: memset (string_fortified.h:59)
   by 0x...: cpucycles_works (wrapper.c:59)
   by 0x...: supercop_cpucycles_ticks_amd64_tsc_setup (amd64-tsc.c:28)
   by 0x...: cpucycles_init (wrapper.c:314)
   by 0x...: main (try-anything.c:330)
Illegal instruction (core dumped)

Number of similar (implementation,compiler) pairs: 2, namely:
ImplementationCompiler
inplaceclang -march=native -O2 -fwrapv -Qunused-arguments -fPIC -fPIE -gdwarf-4 -Wall (Ubuntu_Clang_21.1.8_(6ubuntu1))
refclang -march=native -O2 -fwrapv -Qunused-arguments -fPIC -fPIE -gdwarf-4 -Wall (Ubuntu_Clang_21.1.8_(6ubuntu1))

TIMECOP error (can be valgrind bug)


error 132

Process terminating with default action of signal 4 (SIGILL)
 Illegal opcode at address 0x4008D18
   at 0x...: memset (string_fortified.h:59)
   by 0x...: cpucycles_works (wrapper.c:59)
   by 0x...: supercop_cpucycles_ticks_amd64_tsc_setup (amd64-tsc.c:28)
   by 0x...: cpucycles_init (wrapper.c:314)
   by 0x...: main (try-anything.c:330)
Illegal instruction (core dumped)

Number of similar (implementation,compiler) pairs: 2, namely:
ImplementationCompiler
inplaceclang -march=native -O3 -fwrapv -Qunused-arguments -fPIC -fPIE -gdwarf-4 -Wall (Ubuntu_Clang_21.1.8_(6ubuntu1))
refclang -march=native -O3 -fwrapv -Qunused-arguments -fPIC -fPIE -gdwarf-4 -Wall (Ubuntu_Clang_21.1.8_(6ubuntu1))

TIMECOP error (can be valgrind bug)


error 132

Process terminating with default action of signal 4 (SIGILL)
 Illegal opcode at address 0x40082D8
   at 0x...: memset (string_fortified.h:59)
   by 0x...: cpucycles_works (wrapper.c:59)
   by 0x...: supercop_cpucycles_ticks_amd64_tsc_setup (amd64-tsc.c:28)
   by 0x...: cpucycles_init (wrapper.c:314)
   by 0x...: main (try-anything.c:330)
Illegal instruction (core dumped)

Number of similar (implementation,compiler) pairs: 2, namely:
ImplementationCompiler
inplaceclang -march=native -Os -fwrapv -Qunused-arguments -fPIC -fPIE -gdwarf-4 -Wall (Ubuntu_Clang_21.1.8_(6ubuntu1))
refclang -march=native -Os -fwrapv -Qunused-arguments -fPIC -fPIE -gdwarf-4 -Wall (Ubuntu_Clang_21.1.8_(6ubuntu1))

TIMECOP error (can be valgrind bug)


error 132

Process terminating with default action of signal 4 (SIGILL)
 Illegal opcode at address 0x4008398
   at 0x...: memset (string_fortified.h:59)
   by 0x...: cpucycles_works (wrapper.c:59)
   by 0x...: supercop_cpucycles_ticks_amd64_tsc_setup (amd64-tsc.c:28)
   by 0x...: cpucycles_init (wrapper.c:314)
   by 0x...: main (try-anything.c:330)
Illegal instruction (core dumped)

Number of similar (implementation,compiler) pairs: 1, namely:
ImplementationCompiler
inplacegcc -march=native -mtune=native -O2 -fwrapv -fPIC -fPIE -gdwarf-4 -Wall (15.2.0)

TIMECOP error (can be valgrind bug)


error 132

Process terminating with default action of signal 4 (SIGILL)
 Illegal opcode at address 0x4008718
   at 0x...: memset (string_fortified.h:59)
   by 0x...: cpucycles_works (wrapper.c:59)
   by 0x...: supercop_cpucycles_ticks_amd64_tsc_setup (amd64-tsc.c:28)
   by 0x...: cpucycles_init (wrapper.c:314)
   by 0x...: main (try-anything.c:330)
Illegal instruction (core dumped)

Number of similar (implementation,compiler) pairs: 1, namely:
ImplementationCompiler
inplacegcc -march=native -mtune=native -O3 -fwrapv -fPIC -fPIE -gdwarf-4 -Wall (15.2.0)

TIMECOP error (can be valgrind bug)


error 132

Process terminating with default action of signal 4 (SIGILL)
 Illegal opcode at address 0x4008A58
   at 0x...: memset (string_fortified.h:59)
   by 0x...: cpucycles_works (wrapper.c:59)
   by 0x...: supercop_cpucycles_ticks_amd64_tsc_setup (amd64-tsc.c:28)
   by 0x...: cpucycles_init (wrapper.c:314)
   by 0x...: main (try-anything.c:330)
Illegal instruction (core dumped)

Number of similar (implementation,compiler) pairs: 1, namely:
ImplementationCompiler
inplacegcc -march=native -mtune=native -Os -fwrapv -fPIC -fPIE -gdwarf-4 -Wall (15.2.0)

TIMECOP error (can be valgrind bug)


error 132

Process terminating with default action of signal 4 (SIGILL)
 Illegal opcode at address 0x4008258
   at 0x...: memset (string_fortified.h:59)
   by 0x...: cpucycles_works (wrapper.c:59)
   by 0x...: supercop_cpucycles_ticks_amd64_tsc_setup (amd64-tsc.c:28)
   by 0x...: cpucycles_init (wrapper.c:314)
   by 0x...: main (try-anything.c:330)
Illegal instruction (core dumped)

Number of similar (implementation,compiler) pairs: 1, namely:
ImplementationCompiler
refgcc -march=native -mtune=native -O2 -fwrapv -fPIC -fPIE -gdwarf-4 -Wall (15.2.0)

TIMECOP error (can be valgrind bug)


error 132

Process terminating with default action of signal 4 (SIGILL)
 Illegal opcode at address 0x4008698
   at 0x...: memset (string_fortified.h:59)
   by 0x...: cpucycles_works (wrapper.c:59)
   by 0x...: supercop_cpucycles_ticks_amd64_tsc_setup (amd64-tsc.c:28)
   by 0x...: cpucycles_init (wrapper.c:314)
   by 0x...: main (try-anything.c:330)
Illegal instruction (core dumped)

Number of similar (implementation,compiler) pairs: 1, namely:
ImplementationCompiler
refgcc -march=native -mtune=native -O3 -fwrapv -fPIC -fPIE -gdwarf-4 -Wall (15.2.0)

TIMECOP error (can be valgrind bug)


error 132

Process terminating with default action of signal 4 (SIGILL)
 Illegal opcode at address 0x4008998
   at 0x...: memset (string_fortified.h:59)
   by 0x...: cpucycles_works (wrapper.c:59)
   by 0x...: supercop_cpucycles_ticks_amd64_tsc_setup (amd64-tsc.c:28)
   by 0x...: cpucycles_init (wrapper.c:314)
   by 0x...: main (try-anything.c:330)
Illegal instruction (core dumped)

Number of similar (implementation,compiler) pairs: 1, namely:
ImplementationCompiler
refgcc -march=native -mtune=native -Os -fwrapv -fPIC -fPIE -gdwarf-4 -Wall (15.2.0)

TIMECOP error (can be valgrind bug)


error 132

Process terminating with default action of signal 4 (SIGILL)
 Illegal opcode at address 0x4005AD8
   at 0x...: memset (string_fortified.h:59)
   by 0x...: cpucycles_works (wrapper.c:59)
   by 0x...: supercop_cpucycles_ticks_amd64_tsc_setup (amd64-tsc.c:28)
   by 0x...: cpucycles_init (wrapper.c:314)
   by 0x...: main (try-anything.c:330)
Illegal instruction (core dumped)

Number of similar (implementation,compiler) pairs: 1, namely:
ImplementationCompiler
wflipclang -march=native -O2 -fwrapv -Qunused-arguments -fPIC -fPIE -gdwarf-4 -Wall (Ubuntu_Clang_21.1.8_(6ubuntu1))

TIMECOP error (can be valgrind bug)


error 132

Process terminating with default action of signal 4 (SIGILL)
 Illegal opcode at address 0x4005C98
   at 0x...: memset (string_fortified.h:59)
   by 0x...: cpucycles_works (wrapper.c:59)
   by 0x...: supercop_cpucycles_ticks_amd64_tsc_setup (amd64-tsc.c:28)
   by 0x...: cpucycles_init (wrapper.c:314)
   by 0x...: main (try-anything.c:330)
Illegal instruction (core dumped)

Number of similar (implementation,compiler) pairs: 1, namely:
ImplementationCompiler
wflipclang -march=native -O3 -fwrapv -Qunused-arguments -fPIC -fPIE -gdwarf-4 -Wall (Ubuntu_Clang_21.1.8_(6ubuntu1))

TIMECOP error (can be valgrind bug)


error 132

Process terminating with default action of signal 4 (SIGILL)
 Illegal opcode at address 0x4005258
   at 0x...: memset (string_fortified.h:59)
   by 0x...: cpucycles_works (wrapper.c:59)
   by 0x...: supercop_cpucycles_ticks_amd64_tsc_setup (amd64-tsc.c:28)
   by 0x...: cpucycles_init (wrapper.c:314)
   by 0x...: main (try-anything.c:330)
Illegal instruction (core dumped)

Number of similar (implementation,compiler) pairs: 1, namely:
ImplementationCompiler
wflipclang -march=native -Os -fwrapv -Qunused-arguments -fPIC -fPIE -gdwarf-4 -Wall (Ubuntu_Clang_21.1.8_(6ubuntu1))

TIMECOP error (can be valgrind bug)


error 132

Process terminating with default action of signal 4 (SIGILL)
 Illegal opcode at address 0x40053D8
   at 0x...: memset (string_fortified.h:59)
   by 0x...: cpucycles_works (wrapper.c:59)
   by 0x...: supercop_cpucycles_ticks_amd64_tsc_setup (amd64-tsc.c:28)
   by 0x...: cpucycles_init (wrapper.c:314)
   by 0x...: main (try-anything.c:330)
Illegal instruction (core dumped)

Number of similar (implementation,compiler) pairs: 1, namely:
ImplementationCompiler
wflipgcc -march=native -mtune=native -O2 -fwrapv -fPIC -fPIE -gdwarf-4 -Wall (15.2.0)

TIMECOP error (can be valgrind bug)


error 132

Process terminating with default action of signal 4 (SIGILL)
 Illegal opcode at address 0x4005718
   at 0x...: memset (string_fortified.h:59)
   by 0x...: cpucycles_works (wrapper.c:59)
   by 0x...: supercop_cpucycles_ticks_amd64_tsc_setup (amd64-tsc.c:28)
   by 0x...: cpucycles_init (wrapper.c:314)
   by 0x...: main (try-anything.c:330)
Illegal instruction (core dumped)

Number of similar (implementation,compiler) pairs: 1, namely:
ImplementationCompiler
wflipgcc -march=native -mtune=native -O3 -fwrapv -fPIC -fPIE -gdwarf-4 -Wall (15.2.0)

TIMECOP error (can be valgrind bug)


error 132

Process terminating with default action of signal 4 (SIGILL)
 Illegal opcode at address 0x4004F58
   at 0x...: memset (string_fortified.h:59)
   by 0x...: cpucycles_works (wrapper.c:59)
   by 0x...: supercop_cpucycles_ticks_amd64_tsc_setup (amd64-tsc.c:28)
   by 0x...: cpucycles_init (wrapper.c:314)
   by 0x...: main (try-anything.c:330)
Illegal instruction (core dumped)

Number of similar (implementation,compiler) pairs: 1, namely:
ImplementationCompiler
wflipgcc -march=native -mtune=native -Os -fwrapv -fPIC -fPIE -gdwarf-4 -Wall (15.2.0)