Test results for amd64, hertz, crypto_hash/sha3512
[Page version: 20261007 20:07:58]
Measurements for amd64, hertz, crypto_hash
Test results for amd64, hertz, crypto_hash
Test results for crypto_hash/sha3512
Computer: hertz
Microarchitecture: amd64; Zen 4 (a60f12)
Architecture: amd64
CPU ID: AuthenticAMD-00a60f12-178bfbff
SUPERCOP version: 20261004
Operation: crypto_hash
Primitive: sha3512
| Time | Object size | Test size | Implementation | Compiler | Benchmark date | SUPERCOP version |
| 19511 | 540 0 0 | 99644 1288 1568 | oncore64bits | clang -march=native -Os -fwrapv -Qunused-arguments -fPIC -fPIE -gdwarf-4 -Wall | 20261006 | 20261004 |
| 19526 | 1079 0 0 | 105866 1296 1568 | oncore64bits | clang -march=native -O2 -fwrapv -Qunused-arguments -fPIC -fPIE -gdwarf-4 -Wall | 20261006 | 20261004 |
| 19549 | 902 0 0 | 100781 1264 1664 | oncore64bits | gcc -march=native -mtune=native -O2 -fwrapv -fPIC -fPIE -gdwarf-4 -Wall | 20261006 | 20261004 |
| 19562 | 1211 0 0 | 107442 1296 1568 | oncore64bits | clang -march=native -O3 -fwrapv -Qunused-arguments -fPIC -fPIE -gdwarf-4 -Wall | 20261006 | 20261004 |
| 19581 | 568 0 0 | 98978 1296 1504 | oncore64bits | clang -march=native -O -fwrapv -Qunused-arguments -fPIC -fPIE -gdwarf-4 -Wall | 20261006 | 20261004 |
| 19587 | 1191 0 0 | 104717 1264 1664 | oncore64bits | gcc -march=native -mtune=native -O3 -fwrapv -fPIC -fPIE -gdwarf-4 -Wall | 20261006 | 20261004 |
| 19653 | 797 0 0 | 100549 1264 1600 | oncore64bits | gcc -march=native -mtune=native -O -fwrapv -fPIC -fPIE -gdwarf-4 -Wall | 20261006 | 20261004 |
| 19679 | 611 0 0 | 99045 1256 1568 | oncore64bits | gcc -march=native -mtune=native -Os -fwrapv -fPIC -fPIE -gdwarf-4 -Wall | 20261006 | 20261004 |
| 22227 | 317 0 0 | 24712 1328 1664 | openssl | gcc -march=native -mtune=native -O2 -fwrapv -fPIC -fPIE -gdwarf-4 -Wall | 20261006 | 20261004 |
| 22236 | 317 0 0 | 28392 1328 1664 | openssl | gcc -march=native -mtune=native -O3 -fwrapv -fPIC -fPIE -gdwarf-4 -Wall | 20261006 | 20261004 |
| 22243 | 295 0 0 | 23011 1304 1568 | openssl | gcc -march=native -mtune=native -Os -fwrapv -fPIC -fPIE -gdwarf-4 -Wall | 20261006 | 20261004 |
| 22249 | 327 0 0 | 24519 1320 1600 | openssl | gcc -march=native -mtune=native -O -fwrapv -fPIC -fPIE -gdwarf-4 -Wall | 20261006 | 20261004 |
| 22263 | 245 0 0 | 23784 1336 1568 | openssl | clang -march=native -Os -fwrapv -Qunused-arguments -fPIC -fPIE -gdwarf-4 -Wall | 20261006 | 20261004 |
| 22302 | 245 0 0 | 30910 1344 1568 | openssl | clang -march=native -O3 -fwrapv -Qunused-arguments -fPIC -fPIE -gdwarf-4 -Wall | 20261006 | 20261004 |
| 22380 | 245 0 0 | 29438 1344 1568 | openssl | clang -march=native -O2 -fwrapv -Qunused-arguments -fPIC -fPIE -gdwarf-4 -Wall | 20261006 | 20261004 |
| 22770 | 243 0 0 | 22990 1344 1504 | openssl | clang -march=native -O -fwrapv -Qunused-arguments -fPIC -fPIE -gdwarf-4 -Wall | 20261006 | 20261004 |
| 24599 | 133 0 0 | 28737 1232 1568 | usekcp | gcc -march=native -mtune=native -Os -fwrapv -fPIC -fPIE -gdwarf-4 -Wall | 20261006 | 20261004 |
| 24907 | 89 0 0 | 30237 1280 1568 | usekcp | clang -march=native -Os -fwrapv -Qunused-arguments -fPIC -fPIE -gdwarf-4 -Wall | 20261006 | 20261004 |
| 25020 | 89 0 0 | 35891 1288 1568 | usekcp | clang -march=native -O2 -fwrapv -Qunused-arguments -fPIC -fPIE -gdwarf-4 -Wall | 20261006 | 20261004 |
| 25020 | 133 0 0 | 34062 1256 1664 | usekcp | gcc -march=native -mtune=native -O3 -fwrapv -fPIC -fPIE -gdwarf-4 -Wall | 20261006 | 20261004 |
| 25047 | 89 0 0 | 29443 1288 1504 | usekcp | clang -march=native -O -fwrapv -Qunused-arguments -fPIC -fPIE -gdwarf-4 -Wall | 20261006 | 20261004 |
| 25073 | 133 0 0 | 30382 1256 1664 | usekcp | gcc -march=native -mtune=native -O2 -fwrapv -fPIC -fPIE -gdwarf-4 -Wall | 20261006 | 20261004 |
| 25095 | 89 0 0 | 37363 1288 1568 | usekcp | clang -march=native -O3 -fwrapv -Qunused-arguments -fPIC -fPIE -gdwarf-4 -Wall | 20261006 | 20261004 |
| 25479 | 133 0 0 | 30205 1248 1600 | usekcp | gcc -march=native -mtune=native -O -fwrapv -fPIC -fPIE -gdwarf-4 -Wall | 20261006 | 20261004 |
| 29222 | 32366 0 0 | 62555 1288 1568 | kcp/optimized1600AVX512 | clang -march=native -O3 -fwrapv -Qunused-arguments -fPIC -fPIE -gdwarf-4 -Wall | 20261006 | 20261004 |
| 29296 | 28195 0 0 | 50749 1280 1568 | kcp/optimized1600AVX512 | clang -march=native -Os -fwrapv -Qunused-arguments -fPIC -fPIE -gdwarf-4 -Wall | 20261006 | 20261004 |
| 29664 | 28235 0 0 | 50547 1288 1504 | kcp/optimized1600AVX512 | clang -march=native -O -fwrapv -Qunused-arguments -fPIC -fPIE -gdwarf-4 -Wall | 20261006 | 20261004 |
| 30031 | 26137 0 0 | 53598 1256 1664 | kcp/optimized1600AVX512 | gcc -march=native -mtune=native -O3 -fwrapv -fPIC -fPIE -gdwarf-4 -Wall | 20261006 | 20261004 |
| 30119 | 25378 0 0 | 49174 1256 1664 | kcp/optimized1600AVX512 | gcc -march=native -mtune=native -O2 -fwrapv -fPIC -fPIE -gdwarf-4 -Wall | 20261006 | 20261004 |
| 30211 | 25757 0 0 | 49470 1256 1600 | kcp/optimized1600AVX512 | gcc -march=native -mtune=native -O -fwrapv -fPIC -fPIE -gdwarf-4 -Wall | 20261006 | 20261004 |
| 30342 | 31565 0 0 | 60331 1288 1568 | kcp/optimized1600AVX512 | clang -march=native -O2 -fwrapv -Qunused-arguments -fPIC -fPIE -gdwarf-4 -Wall | 20261006 | 20261004 |
| 30459 | 23670 0 0 | 45713 1232 1568 | kcp/optimized1600AVX512 | gcc -march=native -mtune=native -Os -fwrapv -fPIC -fPIE -gdwarf-4 -Wall | 20261006 | 20261004 |
| 52453 | 6773 0 0 | 56606 1256 1664 | oncore32bits | gcc -march=native -mtune=native -O3 -fwrapv -fPIC -fPIE -gdwarf-4 -Wall | 20261006 | 20261004 |
| 53815 | 1925 0 0 | 48126 1256 1664 | oncore32bits | gcc -march=native -mtune=native -O2 -fwrapv -fPIC -fPIE -gdwarf-4 -Wall | 20261006 | 20261004 |
| 54970 | 1490 0 0 | 47493 1280 1568 | oncore32bits | clang -march=native -Os -fwrapv -Qunused-arguments -fPIC -fPIE -gdwarf-4 -Wall | 20261006 | 20261004 |
| 55100 | 1299 0 0 | 46635 1288 1504 | oncore32bits | clang -march=native -O -fwrapv -Qunused-arguments -fPIC -fPIE -gdwarf-4 -Wall | 20261006 | 20261004 |
| 55104 | 1503 0 0 | 53275 1288 1568 | oncore32bits | clang -march=native -O2 -fwrapv -Qunused-arguments -fPIC -fPIE -gdwarf-4 -Wall | 20261006 | 20261004 |
| 55153 | 2383 0 0 | 55515 1288 1568 | oncore32bits | clang -march=native -O3 -fwrapv -Qunused-arguments -fPIC -fPIE -gdwarf-4 -Wall | 20261006 | 20261004 |
| 55486 | 1920 0 0 | 48181 1264 1600 | oncore32bits | gcc -march=native -mtune=native -O -fwrapv -fPIC -fPIE -gdwarf-4 -Wall | 20261006 | 20261004 |
| 55631 | 1662 0 0 | 46414 1248 1568 | oncore32bits | gcc -march=native -mtune=native -Os -fwrapv -fPIC -fPIE -gdwarf-4 -Wall | 20261006 | 20261004 |
Compiler output
KeccakP-1600-AVX2.c: KeccakP-1600-AVX2.c:28:17: warning: unknown pragma ignored [-Wunknown-pragmas]
KeccakP-1600-AVX2.c: 28 | #pragma GCC optimize("2")
KeccakP-1600-AVX2.c: | ^
KeccakP-1600-AVX2.c: KeccakP-1600-AVX2.c:637:5: warning: unused variable 'SLLV_A0' [-Wunused-variable]
KeccakP-1600-AVX2.c: 637 | KECCAK_CONSTANTS
KeccakP-1600-AVX2.c: | ^~~~~~~~~~~~~~~~
KeccakP-1600-AVX2.c: KeccakP-1600-AVX2.c:94:32: note: expanded from macro 'KECCAK_CONSTANTS'
KeccakP-1600-AVX2.c: 94 | ROLV_CONST(C4, 27, 20, 39, 8) \
KeccakP-1600-AVX2.c: | ^
KeccakP-1600-AVX2.c: 95 | _ROLV_CONST(_A0, 0, 1, 62, 28) \
KeccakP-1600-AVX2.c: | ~~~~~~~~~~~~~~~~~~~~~~~~~~~~~~~~
KeccakP-1600-AVX2.c: KeccakP-1600-AVX2.c:85:17: note: expanded from macro '\
KeccakP-1600-AVX2.c: _ROLV_CONST'
KeccakP-1600-AVX2.c: 85 | _ROLV_TYPE SLLV##name = SET(i0, i1, i2, i3); \
KeccakP-1600-AVX2.c: | ^~~~~~~~~~
KeccakP-1600-AVX2.c: <scratch space>:153:1: note: expanded from here
KeccakP-1600-AVX2.c: 153 | SLLV_A0
KeccakP-1600-AVX2.c: | ^~~~~~~
KeccakP-1600-AVX2.c: KeccakP-1600-AVX2.c:637:5: warning: unused variable 'SRLV_A0' [-Wunused-variable]
KeccakP-1600-AVX2.c: 637 | KECCAK_CONSTANTS
KeccakP-1600-AVX2.c: | ^~~~~~~~~~~~~~~~
KeccakP-1600-AVX2.c: KeccakP-1600-AVX2.c:94:32: note: expanded from macro 'KECCAK_CONSTANTS'
KeccakP-1600-AVX2.c: 94 | ROLV_CONST(C4, 27, 20, 39, 8) \
KeccakP-1600-AVX2.c: | ^
KeccakP-1600-AVX2.c: 95 | _ROLV_CONST(_A0, 0, 1, 62, 28) \
KeccakP-1600-AVX2.c: ...
try.c: /usr/bin/x86_64-linux-gnu-ld.bfd: libcrypto_hash_sha3512.a(SHA3-512.o): in function `crypto_hash_sha3512_kcp_optimized1600AVX2_constbranchindex':
try.c: .../supercop-data/hertz/amd64/try/c/clang_-march=native_-O2_-fwrapv_-Qunused-arguments_-fPIC_-fPIE_-gdwarf-4_-Wall/constbranchindex/crypto_hash/sha3512/kcp/optimized1600AVX2/work/SHA3-512.c:24:(.text+0x...): undefined reference to `KeccakWidth1600_Sponge'
try.c: clang: error: linker command failed with exit code 1 (use -v to see invocation)
Number of similar (implementation,compiler) pairs: 1, namely:
| Implementation | Compiler |
| kcp/optimized1600AVX2 | clang -march=native -O2 -fwrapv -Qunused-arguments -fPIC -fPIE -gdwarf-4 -Wall (Ubuntu_Clang_21.1.8_(6ubuntu1)) |
Compiler output
KeccakP-1600-AVX2.c: KeccakP-1600-AVX2.c:28:17: warning: unknown pragma ignored [-Wunknown-pragmas]
KeccakP-1600-AVX2.c: 28 | #pragma GCC optimize("2")
KeccakP-1600-AVX2.c: | ^
KeccakP-1600-AVX2.c: KeccakP-1600-AVX2.c:637:5: warning: unused variable 'SLLV_A0' [-Wunused-variable]
KeccakP-1600-AVX2.c: 637 | KECCAK_CONSTANTS
KeccakP-1600-AVX2.c: | ^~~~~~~~~~~~~~~~
KeccakP-1600-AVX2.c: KeccakP-1600-AVX2.c:94:32: note: expanded from macro 'KECCAK_CONSTANTS'
KeccakP-1600-AVX2.c: 94 | ROLV_CONST(C4, 27, 20, 39, 8) \
KeccakP-1600-AVX2.c: | ^
KeccakP-1600-AVX2.c: 95 | _ROLV_CONST(_A0, 0, 1, 62, 28) \
KeccakP-1600-AVX2.c: | ~~~~~~~~~~~~~~~~~~~~~~~~~~~~~~~~
KeccakP-1600-AVX2.c: KeccakP-1600-AVX2.c:85:17: note: expanded from macro '\
KeccakP-1600-AVX2.c: _ROLV_CONST'
KeccakP-1600-AVX2.c: 85 | _ROLV_TYPE SLLV##name = SET(i0, i1, i2, i3); \
KeccakP-1600-AVX2.c: | ^~~~~~~~~~
KeccakP-1600-AVX2.c: <scratch space>:153:1: note: expanded from here
KeccakP-1600-AVX2.c: 153 | SLLV_A0
KeccakP-1600-AVX2.c: | ^~~~~~~
KeccakP-1600-AVX2.c: KeccakP-1600-AVX2.c:637:5: warning: unused variable 'SRLV_A0' [-Wunused-variable]
KeccakP-1600-AVX2.c: 637 | KECCAK_CONSTANTS
KeccakP-1600-AVX2.c: | ^~~~~~~~~~~~~~~~
KeccakP-1600-AVX2.c: KeccakP-1600-AVX2.c:94:32: note: expanded from macro 'KECCAK_CONSTANTS'
KeccakP-1600-AVX2.c: 94 | ROLV_CONST(C4, 27, 20, 39, 8) \
KeccakP-1600-AVX2.c: | ^
KeccakP-1600-AVX2.c: 95 | _ROLV_CONST(_A0, 0, 1, 62, 28) \
KeccakP-1600-AVX2.c: ...
try.c: /usr/bin/x86_64-linux-gnu-ld.bfd: libcrypto_hash_sha3512.a(SHA3-512.o): in function `crypto_hash_sha3512_kcp_optimized1600AVX2_constbranchindex':
try.c: .../supercop-data/hertz/amd64/try/c/clang_-march=native_-O3_-fwrapv_-Qunused-arguments_-fPIC_-fPIE_-gdwarf-4_-Wall/constbranchindex/crypto_hash/sha3512/kcp/optimized1600AVX2/work/SHA3-512.c:24:(.text+0x...): undefined reference to `KeccakWidth1600_Sponge'
try.c: clang: error: linker command failed with exit code 1 (use -v to see invocation)
Number of similar (implementation,compiler) pairs: 1, namely:
| Implementation | Compiler |
| kcp/optimized1600AVX2 | clang -march=native -O3 -fwrapv -Qunused-arguments -fPIC -fPIE -gdwarf-4 -Wall (Ubuntu_Clang_21.1.8_(6ubuntu1)) |
Compiler output
KeccakP-1600-AVX2.c: KeccakP-1600-AVX2.c:28:17: warning: unknown pragma ignored [-Wunknown-pragmas]
KeccakP-1600-AVX2.c: 28 | #pragma GCC optimize("2")
KeccakP-1600-AVX2.c: | ^
KeccakP-1600-AVX2.c: KeccakP-1600-AVX2.c:637:5: warning: unused variable 'SLLV_A0' [-Wunused-variable]
KeccakP-1600-AVX2.c: 637 | KECCAK_CONSTANTS
KeccakP-1600-AVX2.c: | ^~~~~~~~~~~~~~~~
KeccakP-1600-AVX2.c: KeccakP-1600-AVX2.c:94:32: note: expanded from macro 'KECCAK_CONSTANTS'
KeccakP-1600-AVX2.c: 94 | ROLV_CONST(C4, 27, 20, 39, 8) \
KeccakP-1600-AVX2.c: | ^
KeccakP-1600-AVX2.c: 95 | _ROLV_CONST(_A0, 0, 1, 62, 28) \
KeccakP-1600-AVX2.c: | ~~~~~~~~~~~~~~~~~~~~~~~~~~~~~~~~
KeccakP-1600-AVX2.c: KeccakP-1600-AVX2.c:85:17: note: expanded from macro '\
KeccakP-1600-AVX2.c: _ROLV_CONST'
KeccakP-1600-AVX2.c: 85 | _ROLV_TYPE SLLV##name = SET(i0, i1, i2, i3); \
KeccakP-1600-AVX2.c: | ^~~~~~~~~~
KeccakP-1600-AVX2.c: <scratch space>:153:1: note: expanded from here
KeccakP-1600-AVX2.c: 153 | SLLV_A0
KeccakP-1600-AVX2.c: | ^~~~~~~
KeccakP-1600-AVX2.c: KeccakP-1600-AVX2.c:637:5: warning: unused variable 'SRLV_A0' [-Wunused-variable]
KeccakP-1600-AVX2.c: 637 | KECCAK_CONSTANTS
KeccakP-1600-AVX2.c: | ^~~~~~~~~~~~~~~~
KeccakP-1600-AVX2.c: KeccakP-1600-AVX2.c:94:32: note: expanded from macro 'KECCAK_CONSTANTS'
KeccakP-1600-AVX2.c: 94 | ROLV_CONST(C4, 27, 20, 39, 8) \
KeccakP-1600-AVX2.c: | ^
KeccakP-1600-AVX2.c: 95 | _ROLV_CONST(_A0, 0, 1, 62, 28) \
KeccakP-1600-AVX2.c: ...
try.c: /usr/bin/x86_64-linux-gnu-ld.bfd: libcrypto_hash_sha3512.a(SHA3-512.o): in function `crypto_hash_sha3512_kcp_optimized1600AVX2_constbranchindex':
try.c: .../supercop-data/hertz/amd64/try/c/clang_-march=native_-O_-fwrapv_-Qunused-arguments_-fPIC_-fPIE_-gdwarf-4_-Wall/constbranchindex/crypto_hash/sha3512/kcp/optimized1600AVX2/work/SHA3-512.c:24:(.text+0x...): undefined reference to `KeccakWidth1600_Sponge'
try.c: clang: error: linker command failed with exit code 1 (use -v to see invocation)
Number of similar (implementation,compiler) pairs: 1, namely:
| Implementation | Compiler |
| kcp/optimized1600AVX2 | clang -march=native -O -fwrapv -Qunused-arguments -fPIC -fPIE -gdwarf-4 -Wall (Ubuntu_Clang_21.1.8_(6ubuntu1)) |
Compiler output
KeccakP-1600-AVX2.c: KeccakP-1600-AVX2.c:28:17: warning: unknown pragma ignored [-Wunknown-pragmas]
KeccakP-1600-AVX2.c: 28 | #pragma GCC optimize("2")
KeccakP-1600-AVX2.c: | ^
KeccakP-1600-AVX2.c: KeccakP-1600-AVX2.c:637:5: warning: unused variable 'SLLV_A0' [-Wunused-variable]
KeccakP-1600-AVX2.c: 637 | KECCAK_CONSTANTS
KeccakP-1600-AVX2.c: | ^~~~~~~~~~~~~~~~
KeccakP-1600-AVX2.c: KeccakP-1600-AVX2.c:94:32: note: expanded from macro 'KECCAK_CONSTANTS'
KeccakP-1600-AVX2.c: 94 | ROLV_CONST(C4, 27, 20, 39, 8) \
KeccakP-1600-AVX2.c: | ^
KeccakP-1600-AVX2.c: 95 | _ROLV_CONST(_A0, 0, 1, 62, 28) \
KeccakP-1600-AVX2.c: | ~~~~~~~~~~~~~~~~~~~~~~~~~~~~~~~~
KeccakP-1600-AVX2.c: KeccakP-1600-AVX2.c:85:17: note: expanded from macro '\
KeccakP-1600-AVX2.c: _ROLV_CONST'
KeccakP-1600-AVX2.c: 85 | _ROLV_TYPE SLLV##name = SET(i0, i1, i2, i3); \
KeccakP-1600-AVX2.c: | ^~~~~~~~~~
KeccakP-1600-AVX2.c: <scratch space>:153:1: note: expanded from here
KeccakP-1600-AVX2.c: 153 | SLLV_A0
KeccakP-1600-AVX2.c: | ^~~~~~~
KeccakP-1600-AVX2.c: KeccakP-1600-AVX2.c:637:5: warning: unused variable 'SRLV_A0' [-Wunused-variable]
KeccakP-1600-AVX2.c: 637 | KECCAK_CONSTANTS
KeccakP-1600-AVX2.c: | ^~~~~~~~~~~~~~~~
KeccakP-1600-AVX2.c: KeccakP-1600-AVX2.c:94:32: note: expanded from macro 'KECCAK_CONSTANTS'
KeccakP-1600-AVX2.c: 94 | ROLV_CONST(C4, 27, 20, 39, 8) \
KeccakP-1600-AVX2.c: | ^
KeccakP-1600-AVX2.c: 95 | _ROLV_CONST(_A0, 0, 1, 62, 28) \
KeccakP-1600-AVX2.c: ...
try.c: /usr/bin/x86_64-linux-gnu-ld.bfd: libcrypto_hash_sha3512.a(SHA3-512.o): in function `crypto_hash_sha3512_kcp_optimized1600AVX2_constbranchindex':
try.c: .../supercop-data/hertz/amd64/try/c/clang_-march=native_-Os_-fwrapv_-Qunused-arguments_-fPIC_-fPIE_-gdwarf-4_-Wall/constbranchindex/crypto_hash/sha3512/kcp/optimized1600AVX2/work/SHA3-512.c:24:(.text+0x...): undefined reference to `KeccakWidth1600_Sponge'
try.c: clang: error: linker command failed with exit code 1 (use -v to see invocation)
Number of similar (implementation,compiler) pairs: 1, namely:
| Implementation | Compiler |
| kcp/optimized1600AVX2 | clang -march=native -Os -fwrapv -Qunused-arguments -fPIC -fPIE -gdwarf-4 -Wall (Ubuntu_Clang_21.1.8_(6ubuntu1)) |
Compiler output
KeccakP-1600-AVX2.c: KeccakP-1600-AVX2.c: In function 'crypto_hash_sha3512_kcp_optimized1600AVX2_constbranchindex_KeccakP1600_Permute_Nrounds':
KeccakP-1600-AVX2.c: KeccakP-1600-AVX2.c:86:17: warning: unused variable 'SRLV_C4' [-Wunused-variable]
KeccakP-1600-AVX2.c: 86 | _ROLV_TYPE SRLV##name = SET(64 - i0, 64 - i1, 64 - i2, 64 - i3);
KeccakP-1600-AVX2.c: | ^~~~
KeccakP-1600-AVX2.c: KeccakP-1600-AVX2.c:100:1: note: in expansion of macro '_ROLV_CONST'
KeccakP-1600-AVX2.c: 100 | _ROLV_CONST(_C4, 27, 20, 39, 8)
KeccakP-1600-AVX2.c: | ^~~~~~~~~~~
KeccakP-1600-AVX2.c: KeccakP-1600-AVX2.c:637:5: note: in expansion of macro 'KECCAK_CONSTANTS'
KeccakP-1600-AVX2.c: 637 | KECCAK_CONSTANTS
KeccakP-1600-AVX2.c: | ^~~~~~~~~~~~~~~~
KeccakP-1600-AVX2.c: KeccakP-1600-AVX2.c:85:17: warning: unused variable 'SLLV_C4' [-Wunused-variable]
KeccakP-1600-AVX2.c: 85 | _ROLV_TYPE SLLV##name = SET(i0, i1, i2, i3); \
KeccakP-1600-AVX2.c: | ^~~~
KeccakP-1600-AVX2.c: KeccakP-1600-AVX2.c:100:1: note: in expansion of macro '_ROLV_CONST'
KeccakP-1600-AVX2.c: 100 | _ROLV_CONST(_C4, 27, 20, 39, 8)
KeccakP-1600-AVX2.c: | ^~~~~~~~~~~
KeccakP-1600-AVX2.c: KeccakP-1600-AVX2.c:637:5: note: in expansion of macro 'KECCAK_CONSTANTS'
KeccakP-1600-AVX2.c: 637 | KECCAK_CONSTANTS
KeccakP-1600-AVX2.c: | ^~~~~~~~~~~~~~~~
KeccakP-1600-AVX2.c: KeccakP-1600-AVX2.c:86:17: warning: unused variable 'SRLV_A4' [-Wunused-variable]
KeccakP-1600-AVX2.c: 86 | _ROLV_TYPE SRLV##name = SET(64 - i0, 64 - i1, 64 - i2, 64 - i3);
KeccakP-1600-AVX2.c: | ^~~~
KeccakP-1600-AVX2.c: KeccakP-1600-AVX2.c:99:1: note: in expansion of macro '_ROLV_CONST'
KeccakP-1600-AVX2.c: 99 | _ROLV_CONST(_A4, 18, 2, 61, 56) \
KeccakP-1600-AVX2.c: | ^~~~~~~~~~~
KeccakP-1600-AVX2.c: ...
try.c: /usr/bin/x86_64-linux-gnu-ld.bfd: libcrypto_hash_sha3512.a(SHA3-512.o): in function `crypto_hash_sha3512_kcp_optimized1600AVX2_constbranchindex':
try.c: .../supercop-data/hertz/amd64/try/c/gcc_-march=native_-mtune=native_-O2_-fwrapv_-fPIC_-fPIE_-gdwarf-4_-Wall/constbranchindex/crypto_hash/sha3512/kcp/optimized1600AVX2/work/SHA3-512.c:24:(.text+0x...): undefined reference to `KeccakWidth1600_Sponge'
try.c: collect2: error: ld returned 1 exit status
Number of similar (implementation,compiler) pairs: 1, namely:
| Implementation | Compiler |
| kcp/optimized1600AVX2 | gcc -march=native -mtune=native -O2 -fwrapv -fPIC -fPIE -gdwarf-4 -Wall (15.2.0) |
Compiler output
KeccakP-1600-AVX2.c: KeccakP-1600-AVX2.c: In function 'crypto_hash_sha3512_kcp_optimized1600AVX2_constbranchindex_KeccakP1600_Permute_Nrounds':
KeccakP-1600-AVX2.c: KeccakP-1600-AVX2.c:86:17: warning: unused variable 'SRLV_C4' [-Wunused-variable]
KeccakP-1600-AVX2.c: 86 | _ROLV_TYPE SRLV##name = SET(64 - i0, 64 - i1, 64 - i2, 64 - i3);
KeccakP-1600-AVX2.c: | ^~~~
KeccakP-1600-AVX2.c: KeccakP-1600-AVX2.c:100:1: note: in expansion of macro '_ROLV_CONST'
KeccakP-1600-AVX2.c: 100 | _ROLV_CONST(_C4, 27, 20, 39, 8)
KeccakP-1600-AVX2.c: | ^~~~~~~~~~~
KeccakP-1600-AVX2.c: KeccakP-1600-AVX2.c:637:5: note: in expansion of macro 'KECCAK_CONSTANTS'
KeccakP-1600-AVX2.c: 637 | KECCAK_CONSTANTS
KeccakP-1600-AVX2.c: | ^~~~~~~~~~~~~~~~
KeccakP-1600-AVX2.c: KeccakP-1600-AVX2.c:85:17: warning: unused variable 'SLLV_C4' [-Wunused-variable]
KeccakP-1600-AVX2.c: 85 | _ROLV_TYPE SLLV##name = SET(i0, i1, i2, i3); \
KeccakP-1600-AVX2.c: | ^~~~
KeccakP-1600-AVX2.c: KeccakP-1600-AVX2.c:100:1: note: in expansion of macro '_ROLV_CONST'
KeccakP-1600-AVX2.c: 100 | _ROLV_CONST(_C4, 27, 20, 39, 8)
KeccakP-1600-AVX2.c: | ^~~~~~~~~~~
KeccakP-1600-AVX2.c: KeccakP-1600-AVX2.c:637:5: note: in expansion of macro 'KECCAK_CONSTANTS'
KeccakP-1600-AVX2.c: 637 | KECCAK_CONSTANTS
KeccakP-1600-AVX2.c: | ^~~~~~~~~~~~~~~~
KeccakP-1600-AVX2.c: KeccakP-1600-AVX2.c:86:17: warning: unused variable 'SRLV_A4' [-Wunused-variable]
KeccakP-1600-AVX2.c: 86 | _ROLV_TYPE SRLV##name = SET(64 - i0, 64 - i1, 64 - i2, 64 - i3);
KeccakP-1600-AVX2.c: | ^~~~
KeccakP-1600-AVX2.c: KeccakP-1600-AVX2.c:99:1: note: in expansion of macro '_ROLV_CONST'
KeccakP-1600-AVX2.c: 99 | _ROLV_CONST(_A4, 18, 2, 61, 56) \
KeccakP-1600-AVX2.c: | ^~~~~~~~~~~
KeccakP-1600-AVX2.c: ...
try.c: /usr/bin/x86_64-linux-gnu-ld.bfd: libcrypto_hash_sha3512.a(SHA3-512.o): in function `crypto_hash_sha3512_kcp_optimized1600AVX2_constbranchindex':
try.c: .../supercop-data/hertz/amd64/try/c/gcc_-march=native_-mtune=native_-O3_-fwrapv_-fPIC_-fPIE_-gdwarf-4_-Wall/constbranchindex/crypto_hash/sha3512/kcp/optimized1600AVX2/work/SHA3-512.c:24:(.text+0x...): undefined reference to `KeccakWidth1600_Sponge'
try.c: collect2: error: ld returned 1 exit status
Number of similar (implementation,compiler) pairs: 1, namely:
| Implementation | Compiler |
| kcp/optimized1600AVX2 | gcc -march=native -mtune=native -O3 -fwrapv -fPIC -fPIE -gdwarf-4 -Wall (15.2.0) |
Compiler output
KeccakP-1600-AVX2.c: KeccakP-1600-AVX2.c: In function 'crypto_hash_sha3512_kcp_optimized1600AVX2_constbranchindex_KeccakP1600_Permute_Nrounds':
KeccakP-1600-AVX2.c: KeccakP-1600-AVX2.c:86:17: warning: unused variable 'SRLV_C4' [-Wunused-variable]
KeccakP-1600-AVX2.c: 86 | _ROLV_TYPE SRLV##name = SET(64 - i0, 64 - i1, 64 - i2, 64 - i3);
KeccakP-1600-AVX2.c: | ^~~~
KeccakP-1600-AVX2.c: KeccakP-1600-AVX2.c:100:1: note: in expansion of macro '_ROLV_CONST'
KeccakP-1600-AVX2.c: 100 | _ROLV_CONST(_C4, 27, 20, 39, 8)
KeccakP-1600-AVX2.c: | ^~~~~~~~~~~
KeccakP-1600-AVX2.c: KeccakP-1600-AVX2.c:637:5: note: in expansion of macro 'KECCAK_CONSTANTS'
KeccakP-1600-AVX2.c: 637 | KECCAK_CONSTANTS
KeccakP-1600-AVX2.c: | ^~~~~~~~~~~~~~~~
KeccakP-1600-AVX2.c: KeccakP-1600-AVX2.c:85:17: warning: unused variable 'SLLV_C4' [-Wunused-variable]
KeccakP-1600-AVX2.c: 85 | _ROLV_TYPE SLLV##name = SET(i0, i1, i2, i3); \
KeccakP-1600-AVX2.c: | ^~~~
KeccakP-1600-AVX2.c: KeccakP-1600-AVX2.c:100:1: note: in expansion of macro '_ROLV_CONST'
KeccakP-1600-AVX2.c: 100 | _ROLV_CONST(_C4, 27, 20, 39, 8)
KeccakP-1600-AVX2.c: | ^~~~~~~~~~~
KeccakP-1600-AVX2.c: KeccakP-1600-AVX2.c:637:5: note: in expansion of macro 'KECCAK_CONSTANTS'
KeccakP-1600-AVX2.c: 637 | KECCAK_CONSTANTS
KeccakP-1600-AVX2.c: | ^~~~~~~~~~~~~~~~
KeccakP-1600-AVX2.c: KeccakP-1600-AVX2.c:86:17: warning: unused variable 'SRLV_A4' [-Wunused-variable]
KeccakP-1600-AVX2.c: 86 | _ROLV_TYPE SRLV##name = SET(64 - i0, 64 - i1, 64 - i2, 64 - i3);
KeccakP-1600-AVX2.c: | ^~~~
KeccakP-1600-AVX2.c: KeccakP-1600-AVX2.c:99:1: note: in expansion of macro '_ROLV_CONST'
KeccakP-1600-AVX2.c: 99 | _ROLV_CONST(_A4, 18, 2, 61, 56) \
KeccakP-1600-AVX2.c: | ^~~~~~~~~~~
KeccakP-1600-AVX2.c: ...
try.c: /usr/bin/x86_64-linux-gnu-ld.bfd: libcrypto_hash_sha3512.a(SHA3-512.o): in function `crypto_hash_sha3512_kcp_optimized1600AVX2_constbranchindex':
try.c: .../supercop-data/hertz/amd64/try/c/gcc_-march=native_-mtune=native_-O_-fwrapv_-fPIC_-fPIE_-gdwarf-4_-Wall/constbranchindex/crypto_hash/sha3512/kcp/optimized1600AVX2/work/SHA3-512.c:24:(.text+0x...): undefined reference to `KeccakWidth1600_Sponge'
try.c: collect2: error: ld returned 1 exit status
Number of similar (implementation,compiler) pairs: 1, namely:
| Implementation | Compiler |
| kcp/optimized1600AVX2 | gcc -march=native -mtune=native -O -fwrapv -fPIC -fPIE -gdwarf-4 -Wall (15.2.0) |
Compiler output
KeccakP-1600-AVX2.c: KeccakP-1600-AVX2.c: In function 'crypto_hash_sha3512_kcp_optimized1600AVX2_constbranchindex_KeccakP1600_Permute_Nrounds':
KeccakP-1600-AVX2.c: KeccakP-1600-AVX2.c:86:17: warning: unused variable 'SRLV_C4' [-Wunused-variable]
KeccakP-1600-AVX2.c: 86 | _ROLV_TYPE SRLV##name = SET(64 - i0, 64 - i1, 64 - i2, 64 - i3);
KeccakP-1600-AVX2.c: | ^~~~
KeccakP-1600-AVX2.c: KeccakP-1600-AVX2.c:100:1: note: in expansion of macro '_ROLV_CONST'
KeccakP-1600-AVX2.c: 100 | _ROLV_CONST(_C4, 27, 20, 39, 8)
KeccakP-1600-AVX2.c: | ^~~~~~~~~~~
KeccakP-1600-AVX2.c: KeccakP-1600-AVX2.c:637:5: note: in expansion of macro 'KECCAK_CONSTANTS'
KeccakP-1600-AVX2.c: 637 | KECCAK_CONSTANTS
KeccakP-1600-AVX2.c: | ^~~~~~~~~~~~~~~~
KeccakP-1600-AVX2.c: KeccakP-1600-AVX2.c:85:17: warning: unused variable 'SLLV_C4' [-Wunused-variable]
KeccakP-1600-AVX2.c: 85 | _ROLV_TYPE SLLV##name = SET(i0, i1, i2, i3); \
KeccakP-1600-AVX2.c: | ^~~~
KeccakP-1600-AVX2.c: KeccakP-1600-AVX2.c:100:1: note: in expansion of macro '_ROLV_CONST'
KeccakP-1600-AVX2.c: 100 | _ROLV_CONST(_C4, 27, 20, 39, 8)
KeccakP-1600-AVX2.c: | ^~~~~~~~~~~
KeccakP-1600-AVX2.c: KeccakP-1600-AVX2.c:637:5: note: in expansion of macro 'KECCAK_CONSTANTS'
KeccakP-1600-AVX2.c: 637 | KECCAK_CONSTANTS
KeccakP-1600-AVX2.c: | ^~~~~~~~~~~~~~~~
KeccakP-1600-AVX2.c: KeccakP-1600-AVX2.c:86:17: warning: unused variable 'SRLV_A4' [-Wunused-variable]
KeccakP-1600-AVX2.c: 86 | _ROLV_TYPE SRLV##name = SET(64 - i0, 64 - i1, 64 - i2, 64 - i3);
KeccakP-1600-AVX2.c: | ^~~~
KeccakP-1600-AVX2.c: KeccakP-1600-AVX2.c:99:1: note: in expansion of macro '_ROLV_CONST'
KeccakP-1600-AVX2.c: 99 | _ROLV_CONST(_A4, 18, 2, 61, 56) \
KeccakP-1600-AVX2.c: | ^~~~~~~~~~~
KeccakP-1600-AVX2.c: ...
try.c: /usr/bin/x86_64-linux-gnu-ld.bfd: libcrypto_hash_sha3512.a(SHA3-512.o): in function `crypto_hash_sha3512_kcp_optimized1600AVX2_constbranchindex':
try.c: .../supercop-data/hertz/amd64/try/c/gcc_-march=native_-mtune=native_-Os_-fwrapv_-fPIC_-fPIE_-gdwarf-4_-Wall/constbranchindex/crypto_hash/sha3512/kcp/optimized1600AVX2/work/SHA3-512.c:24:(.text+0x...): undefined reference to `KeccakWidth1600_Sponge'
try.c: collect2: error: ld returned 1 exit status
Number of similar (implementation,compiler) pairs: 1, namely:
| Implementation | Compiler |
| kcp/optimized1600AVX2 | gcc -march=native -mtune=native -Os -fwrapv -fPIC -fPIE -gdwarf-4 -Wall (15.2.0) |
Compiler output
KeccakP-1600-AVX512.c: KeccakP-1600-AVX512.c:525:18: warning: unused variable 'i' [-Wunused-variable]
KeccakP-1600-AVX512.c: 525 | unsigned int i;
KeccakP-1600-AVX512.c: | ^
KeccakP-1600-AVX512.c: 1 warning generated.
Number of similar (implementation,compiler) pairs: 4, namely:
| Implementation | Compiler |
| kcp/optimized1600AVX512 | clang -march=native -O2 -fwrapv -Qunused-arguments -fPIC -fPIE -gdwarf-4 -Wall (Ubuntu_Clang_21.1.8_(6ubuntu1)) |
| kcp/optimized1600AVX512 | clang -march=native -O3 -fwrapv -Qunused-arguments -fPIC -fPIE -gdwarf-4 -Wall (Ubuntu_Clang_21.1.8_(6ubuntu1)) |
| kcp/optimized1600AVX512 | clang -march=native -O -fwrapv -Qunused-arguments -fPIC -fPIE -gdwarf-4 -Wall (Ubuntu_Clang_21.1.8_(6ubuntu1)) |
| kcp/optimized1600AVX512 | clang -march=native -Os -fwrapv -Qunused-arguments -fPIC -fPIE -gdwarf-4 -Wall (Ubuntu_Clang_21.1.8_(6ubuntu1)) |
Compiler output
KeccakP-1600-AVX512.c: KeccakP-1600-AVX512.c: In function 'KeccakP1600_Permute_12rounds':
KeccakP-1600-AVX512.c: KeccakP-1600-AVX512.c:525:18: warning: unused variable 'i' [-Wunused-variable]
KeccakP-1600-AVX512.c: 525 | unsigned int i;
KeccakP-1600-AVX512.c: | ^
Number of similar (implementation,compiler) pairs: 4, namely:
| Implementation | Compiler |
| kcp/optimized1600AVX512 | gcc -march=native -mtune=native -O2 -fwrapv -fPIC -fPIE -gdwarf-4 -Wall (15.2.0) |
| kcp/optimized1600AVX512 | gcc -march=native -mtune=native -O3 -fwrapv -fPIC -fPIE -gdwarf-4 -Wall (15.2.0) |
| kcp/optimized1600AVX512 | gcc -march=native -mtune=native -O -fwrapv -fPIC -fPIE -gdwarf-4 -Wall (15.2.0) |
| kcp/optimized1600AVX512 | gcc -march=native -mtune=native -Os -fwrapv -fPIC -fPIE -gdwarf-4 -Wall (15.2.0) |
Namespace violations
KeccakP-1600-AVX512.o KeccakF1600_FastLoop_Absorb T
KeccakP-1600-AVX512.o KeccakP1600RoundConstants R
KeccakP-1600-AVX512.o KeccakP1600_12rounds_FastLoop_Absorb T
KeccakP-1600-AVX512.o KeccakP1600_AddBytes T
KeccakP-1600-AVX512.o KeccakP1600_ExtractAndAddBytes T
KeccakP-1600-AVX512.o KeccakP1600_ExtractBytes T
KeccakP-1600-AVX512.o KeccakP1600_Initialize T
KeccakP-1600-AVX512.o KeccakP1600_OverwriteBytes T
KeccakP-1600-AVX512.o KeccakP1600_OverwriteWithZeroes T
KeccakP-1600-AVX512.o KeccakP1600_Permute_12rounds T
KeccakP-1600-AVX512.o KeccakP1600_Permute_24rounds T
KeccakP-1600-AVX512.o KeccakP1600_Permute_Nrounds T
KeccakSpongeWidth1600.o KeccakWidth1600_12rounds_Sponge T
KeccakSpongeWidth1600.o KeccakWidth1600_12rounds_SpongeAbsorb T
KeccakSpongeWidth1600.o KeccakWidth1600_12rounds_SpongeAbsorbLastFewBits T
KeccakSpongeWidth1600.o KeccakWidth1600_12rounds_SpongeInitialize T
KeccakSpongeWidth1600.o KeccakWidth1600_12rounds_SpongeSqueeze T
KeccakSpongeWidth1600.o KeccakWidth1600_Sponge T
KeccakSpongeWidth1600.o KeccakWidth1600_SpongeAbsorb T
KeccakSpongeWidth1600.o KeccakWidth1600_SpongeAbsorbLastFewBits T
KeccakSpongeWidth1600.o KeccakWidth1600_SpongeInitialize T
KeccakSpongeWidth1600.o KeccakWidth1600_SpongeSqueeze T
Number of similar (implementation,compiler) pairs: 8, namely:
| Implementation | Compiler |
| kcp/optimized1600AVX512 | clang -march=native -O2 -fwrapv -Qunused-arguments -fPIC -fPIE -gdwarf-4 -Wall (Ubuntu_Clang_21.1.8_(6ubuntu1)) |
| kcp/optimized1600AVX512 | clang -march=native -O3 -fwrapv -Qunused-arguments -fPIC -fPIE -gdwarf-4 -Wall (Ubuntu_Clang_21.1.8_(6ubuntu1)) |
| kcp/optimized1600AVX512 | clang -march=native -O -fwrapv -Qunused-arguments -fPIC -fPIE -gdwarf-4 -Wall (Ubuntu_Clang_21.1.8_(6ubuntu1)) |
| kcp/optimized1600AVX512 | clang -march=native -Os -fwrapv -Qunused-arguments -fPIC -fPIE -gdwarf-4 -Wall (Ubuntu_Clang_21.1.8_(6ubuntu1)) |
| kcp/optimized1600AVX512 | gcc -march=native -mtune=native -O2 -fwrapv -fPIC -fPIE -gdwarf-4 -Wall (15.2.0) |
| kcp/optimized1600AVX512 | gcc -march=native -mtune=native -O3 -fwrapv -fPIC -fPIE -gdwarf-4 -Wall (15.2.0) |
| kcp/optimized1600AVX512 | gcc -march=native -mtune=native -O -fwrapv -fPIC -fPIE -gdwarf-4 -Wall (15.2.0) |
| kcp/optimized1600AVX512 | gcc -march=native -mtune=native -Os -fwrapv -fPIC -fPIE -gdwarf-4 -Wall (15.2.0) |
TIMECOP error (can be valgrind bug)
error 132
Process terminating with default action of signal 4 (SIGILL)
Illegal opcode at address 0x400AF18
at 0x...: memset (string_fortified.h:59)
by 0x...: cpucycles_works (wrapper.c:59)
by 0x...: supercop_cpucycles_ticks_amd64_tsc_setup (amd64-tsc.c:28)
by 0x...: cpucycles_init (wrapper.c:314)
by 0x...: main (try-anything.c:330)
Illegal instruction (core dumped)
Number of similar (implementation,compiler) pairs: 1, namely:
| Implementation | Compiler |
| kcp/optimized1600AVX512 | clang -march=native -O2 -fwrapv -Qunused-arguments -fPIC -fPIE -gdwarf-4 -Wall (Ubuntu_Clang_21.1.8_(6ubuntu1)) |
TIMECOP error (can be valgrind bug)
error 132
Process terminating with default action of signal 4 (SIGILL)
Illegal opcode at address 0x400B3D8
at 0x...: memset (string_fortified.h:59)
by 0x...: cpucycles_works (wrapper.c:59)
by 0x...: supercop_cpucycles_ticks_amd64_tsc_setup (amd64-tsc.c:28)
by 0x...: cpucycles_init (wrapper.c:314)
by 0x...: main (try-anything.c:330)
Illegal instruction (core dumped)
Number of similar (implementation,compiler) pairs: 1, namely:
| Implementation | Compiler |
| kcp/optimized1600AVX512 | clang -march=native -O3 -fwrapv -Qunused-arguments -fPIC -fPIE -gdwarf-4 -Wall (Ubuntu_Clang_21.1.8_(6ubuntu1)) |
TIMECOP error (can be valgrind bug)
error 132
Process terminating with default action of signal 4 (SIGILL)
Illegal opcode at address 0x40097D8
at 0x...: memset (string_fortified.h:59)
by 0x...: cpucycles_works (wrapper.c:59)
by 0x...: supercop_cpucycles_ticks_amd64_tsc_setup (amd64-tsc.c:28)
by 0x...: cpucycles_init (wrapper.c:314)
by 0x...: main (try-anything.c:330)
Illegal instruction (core dumped)
Number of similar (implementation,compiler) pairs: 1, namely:
| Implementation | Compiler |
| kcp/optimized1600AVX512 | clang -march=native -O -fwrapv -Qunused-arguments -fPIC -fPIE -gdwarf-4 -Wall (Ubuntu_Clang_21.1.8_(6ubuntu1)) |
TIMECOP error (can be valgrind bug)
error 132
Process terminating with default action of signal 4 (SIGILL)
Illegal opcode at address 0x4009758
at 0x...: memset (string_fortified.h:59)
by 0x...: cpucycles_works (wrapper.c:59)
by 0x...: supercop_cpucycles_ticks_amd64_tsc_setup (amd64-tsc.c:28)
by 0x...: cpucycles_init (wrapper.c:314)
by 0x...: main (try-anything.c:330)
Illegal instruction (core dumped)
Number of similar (implementation,compiler) pairs: 1, namely:
| Implementation | Compiler |
| kcp/optimized1600AVX512 | clang -march=native -Os -fwrapv -Qunused-arguments -fPIC -fPIE -gdwarf-4 -Wall (Ubuntu_Clang_21.1.8_(6ubuntu1)) |
TIMECOP error (can be valgrind bug)
error 132
Process terminating with default action of signal 4 (SIGILL)
Illegal opcode at address 0x400A3D8
at 0x...: memset (string_fortified.h:59)
by 0x...: cpucycles_works (wrapper.c:59)
by 0x...: supercop_cpucycles_ticks_amd64_tsc_setup (amd64-tsc.c:28)
by 0x...: cpucycles_init (wrapper.c:314)
by 0x...: main (try-anything.c:330)
Illegal instruction (core dumped)
Number of similar (implementation,compiler) pairs: 1, namely:
| Implementation | Compiler |
| kcp/optimized1600AVX512 | gcc -march=native -mtune=native -O2 -fwrapv -fPIC -fPIE -gdwarf-4 -Wall (15.2.0) |
TIMECOP error (can be valgrind bug)
error 132
Process terminating with default action of signal 4 (SIGILL)
Illegal opcode at address 0x400AC18
at 0x...: memset (string_fortified.h:59)
by 0x...: cpucycles_works (wrapper.c:59)
by 0x...: supercop_cpucycles_ticks_amd64_tsc_setup (amd64-tsc.c:28)
by 0x...: cpucycles_init (wrapper.c:314)
by 0x...: main (try-anything.c:330)
Illegal instruction (core dumped)
Number of similar (implementation,compiler) pairs: 1, namely:
| Implementation | Compiler |
| kcp/optimized1600AVX512 | gcc -march=native -mtune=native -O3 -fwrapv -fPIC -fPIE -gdwarf-4 -Wall (15.2.0) |
TIMECOP error (can be valgrind bug)
error 132
Process terminating with default action of signal 4 (SIGILL)
Illegal opcode at address 0x400A318
at 0x...: memset (string_fortified.h:59)
by 0x...: cpucycles_works (wrapper.c:59)
by 0x...: supercop_cpucycles_ticks_amd64_tsc_setup (amd64-tsc.c:28)
by 0x...: cpucycles_init (wrapper.c:314)
by 0x...: main (try-anything.c:330)
Illegal instruction (core dumped)
Number of similar (implementation,compiler) pairs: 1, namely:
| Implementation | Compiler |
| kcp/optimized1600AVX512 | gcc -march=native -mtune=native -O -fwrapv -fPIC -fPIE -gdwarf-4 -Wall (15.2.0) |
TIMECOP error (can be valgrind bug)
error 132
Process terminating with default action of signal 4 (SIGILL)
Illegal opcode at address 0x40096D8
at 0x...: memset (string_fortified.h:59)
by 0x...: cpucycles_works (wrapper.c:59)
by 0x...: supercop_cpucycles_ticks_amd64_tsc_setup (amd64-tsc.c:28)
by 0x...: cpucycles_init (wrapper.c:314)
by 0x...: main (try-anything.c:330)
Illegal instruction (core dumped)
Number of similar (implementation,compiler) pairs: 1, namely:
| Implementation | Compiler |
| kcp/optimized1600AVX512 | gcc -march=native -mtune=native -Os -fwrapv -fPIC -fPIE -gdwarf-4 -Wall (15.2.0) |
TIMECOP error (can be valgrind bug)
error 132
Process terminating with default action of signal 4 (SIGILL)
Illegal opcode at address 0x400A0D8
at 0x...: memset (string_fortified.h:59)
by 0x...: cpucycles_works (wrapper.c:59)
by 0x...: supercop_cpucycles_ticks_amd64_tsc_setup (amd64-tsc.c:28)
by 0x...: cpucycles_init (wrapper.c:314)
by 0x...: main (try-anything.c:330)
Illegal instruction (core dumped)
Number of similar (implementation,compiler) pairs: 1, namely:
| Implementation | Compiler |
| oncore32bits | clang -march=native -O2 -fwrapv -Qunused-arguments -fPIC -fPIE -gdwarf-4 -Wall (Ubuntu_Clang_21.1.8_(6ubuntu1)) |
TIMECOP error (can be valgrind bug)
error 132
Process terminating with default action of signal 4 (SIGILL)
Illegal opcode at address 0x400A618
at 0x...: memset (string_fortified.h:59)
by 0x...: cpucycles_works (wrapper.c:59)
by 0x...: supercop_cpucycles_ticks_amd64_tsc_setup (amd64-tsc.c:28)
by 0x...: cpucycles_init (wrapper.c:314)
by 0x...: main (try-anything.c:330)
Illegal instruction (core dumped)
Number of similar (implementation,compiler) pairs: 1, namely:
| Implementation | Compiler |
| oncore32bits | clang -march=native -O3 -fwrapv -Qunused-arguments -fPIC -fPIE -gdwarf-4 -Wall (Ubuntu_Clang_21.1.8_(6ubuntu1)) |
TIMECOP error (can be valgrind bug)
error 132
Process terminating with default action of signal 4 (SIGILL)
Illegal opcode at address 0x4009598
at 0x...: memset (string_fortified.h:59)
by 0x...: cpucycles_works (wrapper.c:59)
by 0x...: supercop_cpucycles_ticks_amd64_tsc_setup (amd64-tsc.c:28)
by 0x...: cpucycles_init (wrapper.c:314)
by 0x...: main (try-anything.c:330)
Illegal instruction (core dumped)
Number of similar (implementation,compiler) pairs: 1, namely:
| Implementation | Compiler |
| oncore32bits | clang -march=native -O -fwrapv -Qunused-arguments -fPIC -fPIE -gdwarf-4 -Wall (Ubuntu_Clang_21.1.8_(6ubuntu1)) |
TIMECOP error (can be valgrind bug)
error 132
Process terminating with default action of signal 4 (SIGILL)
Illegal opcode at address 0x4009858
at 0x...: memset (string_fortified.h:59)
by 0x...: cpucycles_works (wrapper.c:59)
by 0x...: supercop_cpucycles_ticks_amd64_tsc_setup (amd64-tsc.c:28)
by 0x...: cpucycles_init (wrapper.c:314)
by 0x...: main (try-anything.c:330)
Illegal instruction (core dumped)
Number of similar (implementation,compiler) pairs: 1, namely:
| Implementation | Compiler |
| oncore32bits | clang -march=native -Os -fwrapv -Qunused-arguments -fPIC -fPIE -gdwarf-4 -Wall (Ubuntu_Clang_21.1.8_(6ubuntu1)) |
TIMECOP error (can be valgrind bug)
error 132
Process terminating with default action of signal 4 (SIGILL)
Illegal opcode at address 0x4009B18
at 0x...: memset (string_fortified.h:59)
by 0x...: cpucycles_works (wrapper.c:59)
by 0x...: supercop_cpucycles_ticks_amd64_tsc_setup (amd64-tsc.c:28)
by 0x...: cpucycles_init (wrapper.c:314)
by 0x...: main (try-anything.c:330)
Illegal instruction (core dumped)
Number of similar (implementation,compiler) pairs: 1, namely:
| Implementation | Compiler |
| oncore32bits | gcc -march=native -mtune=native -O2 -fwrapv -fPIC -fPIE -gdwarf-4 -Wall (15.2.0) |
TIMECOP error (can be valgrind bug)
error 132
Process terminating with default action of signal 4 (SIGILL)
Illegal opcode at address 0x400B218
at 0x...: memset (string_fortified.h:59)
by 0x...: cpucycles_works (wrapper.c:59)
by 0x...: supercop_cpucycles_ticks_amd64_tsc_setup (amd64-tsc.c:28)
by 0x...: cpucycles_init (wrapper.c:314)
by 0x...: main (try-anything.c:330)
Illegal instruction (core dumped)
Number of similar (implementation,compiler) pairs: 1, namely:
| Implementation | Compiler |
| oncore32bits | gcc -march=native -mtune=native -O3 -fwrapv -fPIC -fPIE -gdwarf-4 -Wall (15.2.0) |
TIMECOP error (can be valgrind bug)
error 132
Process terminating with default action of signal 4 (SIGILL)
Illegal opcode at address 0x4009958
at 0x...: memset (string_fortified.h:59)
by 0x...: cpucycles_works (wrapper.c:59)
by 0x...: supercop_cpucycles_ticks_amd64_tsc_setup (amd64-tsc.c:28)
by 0x...: cpucycles_init (wrapper.c:314)
by 0x...: main (try-anything.c:330)
Illegal instruction (core dumped)
Number of similar (implementation,compiler) pairs: 1, namely:
| Implementation | Compiler |
| oncore32bits | gcc -march=native -mtune=native -O -fwrapv -fPIC -fPIE -gdwarf-4 -Wall (15.2.0) |
TIMECOP error (can be valgrind bug)
error 132
Process terminating with default action of signal 4 (SIGILL)
Illegal opcode at address 0x4009518
at 0x...: memset (string_fortified.h:59)
by 0x...: cpucycles_works (wrapper.c:59)
by 0x...: supercop_cpucycles_ticks_amd64_tsc_setup (amd64-tsc.c:28)
by 0x...: cpucycles_init (wrapper.c:314)
by 0x...: main (try-anything.c:330)
Illegal instruction (core dumped)
Number of similar (implementation,compiler) pairs: 1, namely:
| Implementation | Compiler |
| oncore32bits | gcc -march=native -mtune=native -Os -fwrapv -fPIC -fPIE -gdwarf-4 -Wall (15.2.0) |
TIMECOP error (can be valgrind bug)
error 132
Process terminating with default action of signal 4 (SIGILL)
Illegal opcode at address 0x40176D8
at 0x...: memset (string_fortified.h:59)
by 0x...: cpucycles_works (wrapper.c:59)
by 0x...: supercop_cpucycles_ticks_amd64_tsc_setup (amd64-tsc.c:28)
by 0x...: cpucycles_init (wrapper.c:314)
by 0x...: main (try-anything.c:330)
Illegal instruction (core dumped)
Number of similar (implementation,compiler) pairs: 1, namely:
| Implementation | Compiler |
| oncore64bits | clang -march=native -O2 -fwrapv -Qunused-arguments -fPIC -fPIE -gdwarf-4 -Wall (Ubuntu_Clang_21.1.8_(6ubuntu1)) |
TIMECOP error (can be valgrind bug)
error 132
Process terminating with default action of signal 4 (SIGILL)
Illegal opcode at address 0x4017998
at 0x...: memset (string_fortified.h:59)
by 0x...: cpucycles_works (wrapper.c:59)
by 0x...: supercop_cpucycles_ticks_amd64_tsc_setup (amd64-tsc.c:28)
by 0x...: cpucycles_init (wrapper.c:314)
by 0x...: main (try-anything.c:330)
Illegal instruction (core dumped)
Number of similar (implementation,compiler) pairs: 1, namely:
| Implementation | Compiler |
| oncore64bits | clang -march=native -O3 -fwrapv -Qunused-arguments -fPIC -fPIE -gdwarf-4 -Wall (Ubuntu_Clang_21.1.8_(6ubuntu1)) |
TIMECOP error (can be valgrind bug)
error 132
Process terminating with default action of signal 4 (SIGILL)
Illegal opcode at address 0x4016A98
at 0x...: memset (string_fortified.h:59)
by 0x...: cpucycles_works (wrapper.c:59)
by 0x...: supercop_cpucycles_ticks_amd64_tsc_setup (amd64-tsc.c:28)
by 0x...: cpucycles_init (wrapper.c:314)
by 0x...: main (try-anything.c:330)
Illegal instruction (core dumped)
Number of similar (implementation,compiler) pairs: 1, namely:
| Implementation | Compiler |
| oncore64bits | clang -march=native -O -fwrapv -Qunused-arguments -fPIC -fPIE -gdwarf-4 -Wall (Ubuntu_Clang_21.1.8_(6ubuntu1)) |
TIMECOP error (can be valgrind bug)
error 132
Process terminating with default action of signal 4 (SIGILL)
Illegal opcode at address 0x4016CD8
at 0x...: memset (string_fortified.h:59)
by 0x...: cpucycles_works (wrapper.c:59)
by 0x...: supercop_cpucycles_ticks_amd64_tsc_setup (amd64-tsc.c:28)
by 0x...: cpucycles_init (wrapper.c:314)
by 0x...: main (try-anything.c:330)
Illegal instruction (core dumped)
Number of similar (implementation,compiler) pairs: 1, namely:
| Implementation | Compiler |
| oncore64bits | clang -march=native -Os -fwrapv -Qunused-arguments -fPIC -fPIE -gdwarf-4 -Wall (Ubuntu_Clang_21.1.8_(6ubuntu1)) |
TIMECOP error (can be valgrind bug)
error 132
Process terminating with default action of signal 4 (SIGILL)
Illegal opcode at address 0x4017198
at 0x...: memset (string_fortified.h:59)
by 0x...: cpucycles_works (wrapper.c:59)
by 0x...: supercop_cpucycles_ticks_amd64_tsc_setup (amd64-tsc.c:28)
by 0x...: cpucycles_init (wrapper.c:314)
by 0x...: main (try-anything.c:330)
Illegal instruction (core dumped)
Number of similar (implementation,compiler) pairs: 1, namely:
| Implementation | Compiler |
| oncore64bits | gcc -march=native -mtune=native -O2 -fwrapv -fPIC -fPIE -gdwarf-4 -Wall (15.2.0) |
TIMECOP error (can be valgrind bug)
error 132
Process terminating with default action of signal 4 (SIGILL)
Illegal opcode at address 0x40177D8
at 0x...: memset (string_fortified.h:59)
by 0x...: cpucycles_works (wrapper.c:59)
by 0x...: supercop_cpucycles_ticks_amd64_tsc_setup (amd64-tsc.c:28)
by 0x...: cpucycles_init (wrapper.c:314)
by 0x...: main (try-anything.c:330)
Illegal instruction (core dumped)
Number of similar (implementation,compiler) pairs: 1, namely:
| Implementation | Compiler |
| oncore64bits | gcc -march=native -mtune=native -O3 -fwrapv -fPIC -fPIE -gdwarf-4 -Wall (15.2.0) |
TIMECOP error (can be valgrind bug)
error 132
Process terminating with default action of signal 4 (SIGILL)
Illegal opcode at address 0x4016F58
at 0x...: memset (string_fortified.h:59)
by 0x...: cpucycles_works (wrapper.c:59)
by 0x...: supercop_cpucycles_ticks_amd64_tsc_setup (amd64-tsc.c:28)
by 0x...: cpucycles_init (wrapper.c:314)
by 0x...: main (try-anything.c:330)
Illegal instruction (core dumped)
Number of similar (implementation,compiler) pairs: 1, namely:
| Implementation | Compiler |
| oncore64bits | gcc -march=native -mtune=native -O -fwrapv -fPIC -fPIE -gdwarf-4 -Wall (15.2.0) |
TIMECOP error (can be valgrind bug)
error 132
Process terminating with default action of signal 4 (SIGILL)
Illegal opcode at address 0x4016AD8
at 0x...: memset (string_fortified.h:59)
by 0x...: cpucycles_works (wrapper.c:59)
by 0x...: supercop_cpucycles_ticks_amd64_tsc_setup (amd64-tsc.c:28)
by 0x...: cpucycles_init (wrapper.c:314)
by 0x...: main (try-anything.c:330)
Illegal instruction (core dumped)
Number of similar (implementation,compiler) pairs: 1, namely:
| Implementation | Compiler |
| oncore64bits | gcc -march=native -mtune=native -Os -fwrapv -fPIC -fPIE -gdwarf-4 -Wall (15.2.0) |
TIMECOP error (can be valgrind bug)
error 132
Process terminating with default action of signal 4 (SIGILL)
Illegal opcode at address 0x4004F58
at 0x...: memset (string_fortified.h:59)
by 0x...: cpucycles_works (wrapper.c:59)
by 0x...: supercop_cpucycles_ticks_amd64_tsc_setup (amd64-tsc.c:28)
by 0x...: cpucycles_init (wrapper.c:314)
by 0x...: main (try-anything.c:330)
Illegal instruction (core dumped)
Number of similar (implementation,compiler) pairs: 1, namely:
| Implementation | Compiler |
| openssl | clang -march=native -O2 -fwrapv -Qunused-arguments -fPIC -fPIE -gdwarf-4 -Wall (Ubuntu_Clang_21.1.8_(6ubuntu1)) |
TIMECOP error (can be valgrind bug)
error 132
Process terminating with default action of signal 4 (SIGILL)
Illegal opcode at address 0x4005118
at 0x...: memset (string_fortified.h:59)
by 0x...: cpucycles_works (wrapper.c:59)
by 0x...: supercop_cpucycles_ticks_amd64_tsc_setup (amd64-tsc.c:28)
by 0x...: cpucycles_init (wrapper.c:314)
by 0x...: main (try-anything.c:330)
Illegal instruction (core dumped)
Number of similar (implementation,compiler) pairs: 1, namely:
| Implementation | Compiler |
| openssl | clang -march=native -O3 -fwrapv -Qunused-arguments -fPIC -fPIE -gdwarf-4 -Wall (Ubuntu_Clang_21.1.8_(6ubuntu1)) |
TIMECOP error (can be valgrind bug)
error 132
Process terminating with default action of signal 4 (SIGILL)
Illegal opcode at address 0x40044D8
at 0x...: memset (string_fortified.h:59)
by 0x...: cpucycles_works (wrapper.c:59)
by 0x...: supercop_cpucycles_ticks_amd64_tsc_setup (amd64-tsc.c:28)
by 0x...: cpucycles_init (wrapper.c:314)
by 0x...: main (try-anything.c:330)
Illegal instruction (core dumped)
Number of similar (implementation,compiler) pairs: 1, namely:
| Implementation | Compiler |
| openssl | clang -march=native -O -fwrapv -Qunused-arguments -fPIC -fPIE -gdwarf-4 -Wall (Ubuntu_Clang_21.1.8_(6ubuntu1)) |
TIMECOP error (can be valgrind bug)
error 132
Process terminating with default action of signal 4 (SIGILL)
Illegal opcode at address 0x4004758
at 0x...: memset (string_fortified.h:59)
by 0x...: cpucycles_works (wrapper.c:59)
by 0x...: supercop_cpucycles_ticks_amd64_tsc_setup (amd64-tsc.c:28)
by 0x...: cpucycles_init (wrapper.c:314)
by 0x...: main (try-anything.c:330)
Illegal instruction (core dumped)
Number of similar (implementation,compiler) pairs: 1, namely:
| Implementation | Compiler |
| openssl | clang -march=native -Os -fwrapv -Qunused-arguments -fPIC -fPIE -gdwarf-4 -Wall (Ubuntu_Clang_21.1.8_(6ubuntu1)) |
TIMECOP error (can be valgrind bug)
error 132
Process terminating with default action of signal 4 (SIGILL)
Illegal opcode at address 0x4004B18
at 0x...: memset (string_fortified.h:59)
by 0x...: cpucycles_works (wrapper.c:59)
by 0x...: supercop_cpucycles_ticks_amd64_tsc_setup (amd64-tsc.c:28)
by 0x...: cpucycles_init (wrapper.c:314)
by 0x...: main (try-anything.c:330)
Illegal instruction (core dumped)
Number of similar (implementation,compiler) pairs: 1, namely:
| Implementation | Compiler |
| openssl | gcc -march=native -mtune=native -O2 -fwrapv -fPIC -fPIE -gdwarf-4 -Wall (15.2.0) |
TIMECOP error (can be valgrind bug)
error 132
Process terminating with default action of signal 4 (SIGILL)
Illegal opcode at address 0x4005058
at 0x...: memset (string_fortified.h:59)
by 0x...: cpucycles_works (wrapper.c:59)
by 0x...: supercop_cpucycles_ticks_amd64_tsc_setup (amd64-tsc.c:28)
by 0x...: cpucycles_init (wrapper.c:314)
by 0x...: main (try-anything.c:330)
Illegal instruction (core dumped)
Number of similar (implementation,compiler) pairs: 1, namely:
| Implementation | Compiler |
| openssl | gcc -march=native -mtune=native -O3 -fwrapv -fPIC -fPIE -gdwarf-4 -Wall (15.2.0) |
TIMECOP error (can be valgrind bug)
error 132
Process terminating with default action of signal 4 (SIGILL)
Illegal opcode at address 0x4004918
at 0x...: memset (string_fortified.h:59)
by 0x...: cpucycles_works (wrapper.c:59)
by 0x...: supercop_cpucycles_ticks_amd64_tsc_setup (amd64-tsc.c:28)
by 0x...: cpucycles_init (wrapper.c:314)
by 0x...: main (try-anything.c:330)
Illegal instruction (core dumped)
Number of similar (implementation,compiler) pairs: 1, namely:
| Implementation | Compiler |
| openssl | gcc -march=native -mtune=native -O -fwrapv -fPIC -fPIE -gdwarf-4 -Wall (15.2.0) |
TIMECOP error (can be valgrind bug)
error 132
Process terminating with default action of signal 4 (SIGILL)
Illegal opcode at address 0x4004558
at 0x...: memset (string_fortified.h:59)
by 0x...: cpucycles_works (wrapper.c:59)
by 0x...: supercop_cpucycles_ticks_amd64_tsc_setup (amd64-tsc.c:28)
by 0x...: cpucycles_init (wrapper.c:314)
by 0x...: main (try-anything.c:330)
Illegal instruction (core dumped)
Number of similar (implementation,compiler) pairs: 1, namely:
| Implementation | Compiler |
| openssl | gcc -march=native -mtune=native -Os -fwrapv -fPIC -fPIE -gdwarf-4 -Wall (15.2.0) |
TIMECOP error (can be valgrind bug)
error 132
Process terminating with default action of signal 4 (SIGILL)
Illegal opcode at address 0x4006958
at 0x...: memset (string_fortified.h:59)
by 0x...: cpucycles_works (wrapper.c:59)
by 0x...: supercop_cpucycles_ticks_amd64_tsc_setup (amd64-tsc.c:28)
by 0x...: cpucycles_init (wrapper.c:314)
by 0x...: main (try-anything.c:330)
Illegal instruction (core dumped)
Number of similar (implementation,compiler) pairs: 1, namely:
| Implementation | Compiler |
| usekcp | clang -march=native -O2 -fwrapv -Qunused-arguments -fPIC -fPIE -gdwarf-4 -Wall (Ubuntu_Clang_21.1.8_(6ubuntu1)) |
TIMECOP error (can be valgrind bug)
error 132
Process terminating with default action of signal 4 (SIGILL)
Illegal opcode at address 0x4006B18
at 0x...: memset (string_fortified.h:59)
by 0x...: cpucycles_works (wrapper.c:59)
by 0x...: supercop_cpucycles_ticks_amd64_tsc_setup (amd64-tsc.c:28)
by 0x...: cpucycles_init (wrapper.c:314)
by 0x...: main (try-anything.c:330)
Illegal instruction (core dumped)
Number of similar (implementation,compiler) pairs: 1, namely:
| Implementation | Compiler |
| usekcp | clang -march=native -O3 -fwrapv -Qunused-arguments -fPIC -fPIE -gdwarf-4 -Wall (Ubuntu_Clang_21.1.8_(6ubuntu1)) |
TIMECOP error (can be valgrind bug)
error 132
Process terminating with default action of signal 4 (SIGILL)
Illegal opcode at address 0x4005ED8
at 0x...: memset (string_fortified.h:59)
by 0x...: cpucycles_works (wrapper.c:59)
by 0x...: supercop_cpucycles_ticks_amd64_tsc_setup (amd64-tsc.c:28)
by 0x...: cpucycles_init (wrapper.c:314)
by 0x...: main (try-anything.c:330)
Illegal instruction (core dumped)
Number of similar (implementation,compiler) pairs: 1, namely:
| Implementation | Compiler |
| usekcp | clang -march=native -O -fwrapv -Qunused-arguments -fPIC -fPIE -gdwarf-4 -Wall (Ubuntu_Clang_21.1.8_(6ubuntu1)) |
TIMECOP error (can be valgrind bug)
error 132
Process terminating with default action of signal 4 (SIGILL)
Illegal opcode at address 0x4006158
at 0x...: memset (string_fortified.h:59)
by 0x...: cpucycles_works (wrapper.c:59)
by 0x...: supercop_cpucycles_ticks_amd64_tsc_setup (amd64-tsc.c:28)
by 0x...: cpucycles_init (wrapper.c:314)
by 0x...: main (try-anything.c:330)
Illegal instruction (core dumped)
Number of similar (implementation,compiler) pairs: 1, namely:
| Implementation | Compiler |
| usekcp | clang -march=native -Os -fwrapv -Qunused-arguments -fPIC -fPIE -gdwarf-4 -Wall (Ubuntu_Clang_21.1.8_(6ubuntu1)) |
TIMECOP error (can be valgrind bug)
error 132
Process terminating with default action of signal 4 (SIGILL)
Illegal opcode at address 0x4006298
at 0x...: memset (string_fortified.h:59)
by 0x...: cpucycles_works (wrapper.c:59)
by 0x...: supercop_cpucycles_ticks_amd64_tsc_setup (amd64-tsc.c:28)
by 0x...: cpucycles_init (wrapper.c:314)
by 0x...: main (try-anything.c:330)
Illegal instruction (core dumped)
Number of similar (implementation,compiler) pairs: 1, namely:
| Implementation | Compiler |
| usekcp | gcc -march=native -mtune=native -O2 -fwrapv -fPIC -fPIE -gdwarf-4 -Wall (15.2.0) |
TIMECOP error (can be valgrind bug)
error 132
Process terminating with default action of signal 4 (SIGILL)
Illegal opcode at address 0x40067D8
at 0x...: memset (string_fortified.h:59)
by 0x...: cpucycles_works (wrapper.c:59)
by 0x...: supercop_cpucycles_ticks_amd64_tsc_setup (amd64-tsc.c:28)
by 0x...: cpucycles_init (wrapper.c:314)
by 0x...: main (try-anything.c:330)
Illegal instruction (core dumped)
Number of similar (implementation,compiler) pairs: 1, namely:
| Implementation | Compiler |
| usekcp | gcc -march=native -mtune=native -O3 -fwrapv -fPIC -fPIE -gdwarf-4 -Wall (15.2.0) |
TIMECOP error (can be valgrind bug)
error 132
Process terminating with default action of signal 4 (SIGILL)
Illegal opcode at address 0x4006098
at 0x...: memset (string_fortified.h:59)
by 0x...: cpucycles_works (wrapper.c:59)
by 0x...: supercop_cpucycles_ticks_amd64_tsc_setup (amd64-tsc.c:28)
by 0x...: cpucycles_init (wrapper.c:314)
by 0x...: main (try-anything.c:330)
Illegal instruction (core dumped)
Number of similar (implementation,compiler) pairs: 1, namely:
| Implementation | Compiler |
| usekcp | gcc -march=native -mtune=native -O -fwrapv -fPIC -fPIE -gdwarf-4 -Wall (15.2.0) |
TIMECOP error (can be valgrind bug)
error 132
Process terminating with default action of signal 4 (SIGILL)
Illegal opcode at address 0x4005CD8
at 0x...: memset (string_fortified.h:59)
by 0x...: cpucycles_works (wrapper.c:59)
by 0x...: supercop_cpucycles_ticks_amd64_tsc_setup (amd64-tsc.c:28)
by 0x...: cpucycles_init (wrapper.c:314)
by 0x...: main (try-anything.c:330)
Illegal instruction (core dumped)
Number of similar (implementation,compiler) pairs: 1, namely:
| Implementation | Compiler |
| usekcp | gcc -march=native -mtune=native -Os -fwrapv -fPIC -fPIE -gdwarf-4 -Wall (15.2.0) |