Test results for amd64, hertz, crypto_hash/sha3256
[Page version: 20261022 14:52:12]
Measurements for amd64, hertz, crypto_hash
Test results for amd64, hertz, crypto_hash
Test results for crypto_hash/sha3256
Computer: hertz
Microarchitecture: amd64; Zen 4 (a60f12)
Architecture: amd64
CPU ID: AuthenticAMD-00a60f12-178bfbff
SUPERCOP version: 20261018
Operation: crypto_hash
Primitive: sha3256
| Time | Object size | Test size | Implementation | Compiler | Benchmark date | SUPERCOP version |
| 10708 | 902 0 0 | 100781 1264 1664 | oncore64bits | gcc -march=native -mtune=native -O2 -fwrapv -fPIC -fPIE -gdwarf-4 -Wall | 20261019 | 20261018 |
| 10741 | 1508 0 0 | 107738 1296 1568 | oncore64bits | clang -march=native -O3 -fwrapv -Qunused-arguments -fPIC -fPIE -gdwarf-4 -Wall | 20261019 | 20261018 |
| 10756 | 1508 0 0 | 106266 1296 1568 | oncore64bits | clang -march=native -O2 -fwrapv -Qunused-arguments -fPIC -fPIE -gdwarf-4 -Wall | 20261019 | 20261018 |
| 10816 | 603 0 0 | 99045 1256 1568 | oncore64bits | gcc -march=native -mtune=native -Os -fwrapv -fPIC -fPIE -gdwarf-4 -Wall | 20261019 | 20261018 |
| 11029 | 590 0 0 | 99708 1288 1568 | oncore64bits | clang -march=native -Os -fwrapv -Qunused-arguments -fPIC -fPIE -gdwarf-4 -Wall | 20261019 | 20261018 |
| 11880 | 1191 0 0 | 104717 1264 1664 | oncore64bits | gcc -march=native -mtune=native -O3 -fwrapv -fPIC -fPIE -gdwarf-4 -Wall | 20261019 | 20261018 |
| 12695 | 245 0 0 | 29438 1344 1568 | openssl | clang -march=native -O2 -fwrapv -Qunused-arguments -fPIC -fPIE -gdwarf-4 -Wall | 20261019 | 20261018 |
| 12697 | 295 0 0 | 23011 1304 1568 | openssl | gcc -march=native -mtune=native -Os -fwrapv -fPIC -fPIE -gdwarf-4 -Wall | 20261019 | 20261018 |
| 12707 | 317 0 0 | 24712 1328 1664 | openssl | gcc -march=native -mtune=native -O2 -fwrapv -fPIC -fPIE -gdwarf-4 -Wall | 20261019 | 20261018 |
| 12707 | 317 0 0 | 28392 1328 1664 | openssl | gcc -march=native -mtune=native -O3 -fwrapv -fPIC -fPIE -gdwarf-4 -Wall | 20261019 | 20261018 |
| 12708 | 245 0 0 | 30910 1344 1568 | openssl | clang -march=native -O3 -fwrapv -Qunused-arguments -fPIC -fPIE -gdwarf-4 -Wall | 20261019 | 20261018 |
| 12845 | 245 0 0 | 23784 1336 1568 | openssl | clang -march=native -Os -fwrapv -Qunused-arguments -fPIC -fPIE -gdwarf-4 -Wall | 20261019 | 20261018 |
| 12893 | 89 0 0 | 35891 1288 1568 | usekcp | clang -march=native -O2 -fwrapv -Qunused-arguments -fPIC -fPIE -gdwarf-4 -Wall | 20261019 | 20261018 |
| 12901 | 89 0 0 | 37363 1288 1568 | usekcp | clang -march=native -O3 -fwrapv -Qunused-arguments -fPIC -fPIE -gdwarf-4 -Wall | 20261019 | 20261018 |
| 12914 | 133 0 0 | 28737 1232 1568 | usekcp | gcc -march=native -mtune=native -Os -fwrapv -fPIC -fPIE -gdwarf-4 -Wall | 20261019 | 20261018 |
| 13069 | 133 0 0 | 30382 1256 1664 | usekcp | gcc -march=native -mtune=native -O2 -fwrapv -fPIC -fPIE -gdwarf-4 -Wall | 20261019 | 20261018 |
| 13071 | 89 0 0 | 30237 1280 1568 | usekcp | clang -march=native -Os -fwrapv -Qunused-arguments -fPIC -fPIE -gdwarf-4 -Wall | 20261019 | 20261018 |
| 13114 | 133 0 0 | 34062 1256 1664 | usekcp | gcc -march=native -mtune=native -O3 -fwrapv -fPIC -fPIE -gdwarf-4 -Wall | 20261019 | 20261018 |
| 16019 | 32366 0 0 | 62555 1288 1568 | kcp/optimized1600AVX512 | clang -march=native -O3 -fwrapv -Qunused-arguments -fPIC -fPIE -gdwarf-4 -Wall | 20261019 | 20261018 |
| 16022 | 31565 0 0 | 60331 1288 1568 | kcp/optimized1600AVX512 | clang -march=native -O2 -fwrapv -Qunused-arguments -fPIC -fPIE -gdwarf-4 -Wall | 20261019 | 20261018 |
| 16035 | 28195 0 0 | 50749 1280 1568 | kcp/optimized1600AVX512 | clang -march=native -Os -fwrapv -Qunused-arguments -fPIC -fPIE -gdwarf-4 -Wall | 20261019 | 20261018 |
| 16252 | 25378 0 0 | 49174 1256 1664 | kcp/optimized1600AVX512 | gcc -march=native -mtune=native -O2 -fwrapv -fPIC -fPIE -gdwarf-4 -Wall | 20261019 | 20261018 |
| 16370 | 26137 0 0 | 53598 1256 1664 | kcp/optimized1600AVX512 | gcc -march=native -mtune=native -O3 -fwrapv -fPIC -fPIE -gdwarf-4 -Wall | 20261019 | 20261018 |
| 16715 | 23670 0 0 | 45713 1232 1568 | kcp/optimized1600AVX512 | gcc -march=native -mtune=native -Os -fwrapv -fPIC -fPIE -gdwarf-4 -Wall | 20261019 | 20261018 |
| 28704 | 2827 0 0 | 47259 1288 1568 | oncore32bits | clang -march=native -O3 -fwrapv -Qunused-arguments -fPIC -fPIE -gdwarf-4 -Wall | 20261019 | 20261018 |
| 28763 | 3207 0 0 | 46171 1288 1568 | oncore32bits | clang -march=native -O2 -fwrapv -Qunused-arguments -fPIC -fPIE -gdwarf-4 -Wall | 20261019 | 20261018 |
| 28875 | 6789 0 0 | 48014 1256 1664 | oncore32bits | gcc -march=native -mtune=native -O3 -fwrapv -fPIC -fPIE -gdwarf-4 -Wall | 20261019 | 20261018 |
| 30393 | 1941 0 0 | 39470 1256 1664 | oncore32bits | gcc -march=native -mtune=native -O2 -fwrapv -fPIC -fPIE -gdwarf-4 -Wall | 20261019 | 20261018 |
| 31611 | 1507 0 0 | 38901 1280 1568 | oncore32bits | clang -march=native -Os -fwrapv -Qunused-arguments -fPIC -fPIE -gdwarf-4 -Wall | 20261019 | 20261018 |
| 32390 | 1668 0 0 | 37758 1248 1568 | oncore32bits | gcc -march=native -mtune=native -Os -fwrapv -fPIC -fPIE -gdwarf-4 -Wall | 20261019 | 20261018 |
| 75373 | 4110 0 0 | 34195 1288 1568 | compact | clang -march=native -O3 -fwrapv -Qunused-arguments -fPIC -fPIE -gdwarf-4 -Wall | 20261019 | 20261018 |
| 94596 | 5785 0 0 | 33022 1256 1664 | compact | gcc -march=native -mtune=native -O3 -fwrapv -fPIC -fPIE -gdwarf-4 -Wall | 20261019 | 20261018 |
| 102005 | 3048 0 0 | 31675 1288 1568 | compact | clang -march=native -O2 -fwrapv -Qunused-arguments -fPIC -fPIE -gdwarf-4 -Wall | 20261019 | 20261018 |
| 143123 | 1925 0 0 | 25606 1256 1664 | compact | gcc -march=native -mtune=native -O2 -fwrapv -fPIC -fPIE -gdwarf-4 -Wall | 20261019 | 20261018 |
| 217577 | 1603 0 0 | 24581 1280 1568 | compact | clang -march=native -Os -fwrapv -Qunused-arguments -fPIC -fPIE -gdwarf-4 -Wall | 20261019 | 20261018 |
| 222776 | 951 0 0 | 22897 1232 1568 | compact | gcc -march=native -mtune=native -Os -fwrapv -fPIC -fPIE -gdwarf-4 -Wall | 20261019 | 20261018 |
Compiler output
KeccakP-1600-AVX2.c: KeccakP-1600-AVX2.c:28:17: warning: unknown pragma ignored [-Wunknown-pragmas]
KeccakP-1600-AVX2.c: 28 | #pragma GCC optimize("2")
KeccakP-1600-AVX2.c: | ^
KeccakP-1600-AVX2.c: KeccakP-1600-AVX2.c:637:5: warning: unused variable 'SLLV_A0' [-Wunused-variable]
KeccakP-1600-AVX2.c: 637 | KECCAK_CONSTANTS
KeccakP-1600-AVX2.c: | ^~~~~~~~~~~~~~~~
KeccakP-1600-AVX2.c: KeccakP-1600-AVX2.c:94:32: note: expanded from macro 'KECCAK_CONSTANTS'
KeccakP-1600-AVX2.c: 94 | ROLV_CONST(C4, 27, 20, 39, 8) \
KeccakP-1600-AVX2.c: | ^
KeccakP-1600-AVX2.c: 95 | _ROLV_CONST(_A0, 0, 1, 62, 28) \
KeccakP-1600-AVX2.c: | ~~~~~~~~~~~~~~~~~~~~~~~~~~~~~~~~
KeccakP-1600-AVX2.c: KeccakP-1600-AVX2.c:85:17: note: expanded from macro '\
KeccakP-1600-AVX2.c: _ROLV_CONST'
KeccakP-1600-AVX2.c: 85 | _ROLV_TYPE SLLV##name = SET(i0, i1, i2, i3); \
KeccakP-1600-AVX2.c: | ^~~~~~~~~~
KeccakP-1600-AVX2.c: <scratch space>:153:1: note: expanded from here
KeccakP-1600-AVX2.c: 153 | SLLV_A0
KeccakP-1600-AVX2.c: | ^~~~~~~
KeccakP-1600-AVX2.c: KeccakP-1600-AVX2.c:637:5: warning: unused variable 'SRLV_A0' [-Wunused-variable]
KeccakP-1600-AVX2.c: 637 | KECCAK_CONSTANTS
KeccakP-1600-AVX2.c: | ^~~~~~~~~~~~~~~~
KeccakP-1600-AVX2.c: KeccakP-1600-AVX2.c:94:32: note: expanded from macro 'KECCAK_CONSTANTS'
KeccakP-1600-AVX2.c: 94 | ROLV_CONST(C4, 27, 20, 39, 8) \
KeccakP-1600-AVX2.c: | ^
KeccakP-1600-AVX2.c: 95 | _ROLV_CONST(_A0, 0, 1, 62, 28) \
KeccakP-1600-AVX2.c: ...
try.c: /usr/bin/x86_64-linux-gnu-ld.bfd: libcrypto_hash_sha3256.a(SHA3-256.o): in function `crypto_hash_sha3256_kcp_optimized1600AVX2_constbranchindex':
try.c: .../supercop-data/hertz/amd64/try/c/clang_-march=native_-O2_-fwrapv_-Qunused-arguments_-fPIC_-fPIE_-gdwarf-4_-Wall/constbranchindex/crypto_hash/sha3256/kcp/optimized1600AVX2/work/SHA3-256.c:24:(.text+0x...): undefined reference to `KeccakWidth1600_Sponge'
try.c: clang: error: linker command failed with exit code 1 (use -v to see invocation)
Number of similar (implementation,compiler) pairs: 1, namely:
| Implementation | Compiler |
| kcp/optimized1600AVX2 | clang -march=native -O2 -fwrapv -Qunused-arguments -fPIC -fPIE -gdwarf-4 -Wall (Ubuntu_Clang_21.1.8_(6ubuntu1)) |
Compiler output
KeccakP-1600-AVX2.c: KeccakP-1600-AVX2.c:28:17: warning: unknown pragma ignored [-Wunknown-pragmas]
KeccakP-1600-AVX2.c: 28 | #pragma GCC optimize("2")
KeccakP-1600-AVX2.c: | ^
KeccakP-1600-AVX2.c: KeccakP-1600-AVX2.c:637:5: warning: unused variable 'SLLV_A0' [-Wunused-variable]
KeccakP-1600-AVX2.c: 637 | KECCAK_CONSTANTS
KeccakP-1600-AVX2.c: | ^~~~~~~~~~~~~~~~
KeccakP-1600-AVX2.c: KeccakP-1600-AVX2.c:94:32: note: expanded from macro 'KECCAK_CONSTANTS'
KeccakP-1600-AVX2.c: 94 | ROLV_CONST(C4, 27, 20, 39, 8) \
KeccakP-1600-AVX2.c: | ^
KeccakP-1600-AVX2.c: 95 | _ROLV_CONST(_A0, 0, 1, 62, 28) \
KeccakP-1600-AVX2.c: | ~~~~~~~~~~~~~~~~~~~~~~~~~~~~~~~~
KeccakP-1600-AVX2.c: KeccakP-1600-AVX2.c:85:17: note: expanded from macro '\
KeccakP-1600-AVX2.c: _ROLV_CONST'
KeccakP-1600-AVX2.c: 85 | _ROLV_TYPE SLLV##name = SET(i0, i1, i2, i3); \
KeccakP-1600-AVX2.c: | ^~~~~~~~~~
KeccakP-1600-AVX2.c: <scratch space>:153:1: note: expanded from here
KeccakP-1600-AVX2.c: 153 | SLLV_A0
KeccakP-1600-AVX2.c: | ^~~~~~~
KeccakP-1600-AVX2.c: KeccakP-1600-AVX2.c:637:5: warning: unused variable 'SRLV_A0' [-Wunused-variable]
KeccakP-1600-AVX2.c: 637 | KECCAK_CONSTANTS
KeccakP-1600-AVX2.c: | ^~~~~~~~~~~~~~~~
KeccakP-1600-AVX2.c: KeccakP-1600-AVX2.c:94:32: note: expanded from macro 'KECCAK_CONSTANTS'
KeccakP-1600-AVX2.c: 94 | ROLV_CONST(C4, 27, 20, 39, 8) \
KeccakP-1600-AVX2.c: | ^
KeccakP-1600-AVX2.c: 95 | _ROLV_CONST(_A0, 0, 1, 62, 28) \
KeccakP-1600-AVX2.c: ...
try.c: /usr/bin/x86_64-linux-gnu-ld.bfd: libcrypto_hash_sha3256.a(SHA3-256.o): in function `crypto_hash_sha3256_kcp_optimized1600AVX2_constbranchindex':
try.c: .../supercop-data/hertz/amd64/try/c/clang_-march=native_-O3_-fwrapv_-Qunused-arguments_-fPIC_-fPIE_-gdwarf-4_-Wall/constbranchindex/crypto_hash/sha3256/kcp/optimized1600AVX2/work/SHA3-256.c:24:(.text+0x...): undefined reference to `KeccakWidth1600_Sponge'
try.c: clang: error: linker command failed with exit code 1 (use -v to see invocation)
Number of similar (implementation,compiler) pairs: 1, namely:
| Implementation | Compiler |
| kcp/optimized1600AVX2 | clang -march=native -O3 -fwrapv -Qunused-arguments -fPIC -fPIE -gdwarf-4 -Wall (Ubuntu_Clang_21.1.8_(6ubuntu1)) |
Compiler output
KeccakP-1600-AVX2.c: KeccakP-1600-AVX2.c:28:17: warning: unknown pragma ignored [-Wunknown-pragmas]
KeccakP-1600-AVX2.c: 28 | #pragma GCC optimize("2")
KeccakP-1600-AVX2.c: | ^
KeccakP-1600-AVX2.c: KeccakP-1600-AVX2.c:637:5: warning: unused variable 'SLLV_A0' [-Wunused-variable]
KeccakP-1600-AVX2.c: 637 | KECCAK_CONSTANTS
KeccakP-1600-AVX2.c: | ^~~~~~~~~~~~~~~~
KeccakP-1600-AVX2.c: KeccakP-1600-AVX2.c:94:32: note: expanded from macro 'KECCAK_CONSTANTS'
KeccakP-1600-AVX2.c: 94 | ROLV_CONST(C4, 27, 20, 39, 8) \
KeccakP-1600-AVX2.c: | ^
KeccakP-1600-AVX2.c: 95 | _ROLV_CONST(_A0, 0, 1, 62, 28) \
KeccakP-1600-AVX2.c: | ~~~~~~~~~~~~~~~~~~~~~~~~~~~~~~~~
KeccakP-1600-AVX2.c: KeccakP-1600-AVX2.c:85:17: note: expanded from macro '\
KeccakP-1600-AVX2.c: _ROLV_CONST'
KeccakP-1600-AVX2.c: 85 | _ROLV_TYPE SLLV##name = SET(i0, i1, i2, i3); \
KeccakP-1600-AVX2.c: | ^~~~~~~~~~
KeccakP-1600-AVX2.c: <scratch space>:153:1: note: expanded from here
KeccakP-1600-AVX2.c: 153 | SLLV_A0
KeccakP-1600-AVX2.c: | ^~~~~~~
KeccakP-1600-AVX2.c: KeccakP-1600-AVX2.c:637:5: warning: unused variable 'SRLV_A0' [-Wunused-variable]
KeccakP-1600-AVX2.c: 637 | KECCAK_CONSTANTS
KeccakP-1600-AVX2.c: | ^~~~~~~~~~~~~~~~
KeccakP-1600-AVX2.c: KeccakP-1600-AVX2.c:94:32: note: expanded from macro 'KECCAK_CONSTANTS'
KeccakP-1600-AVX2.c: 94 | ROLV_CONST(C4, 27, 20, 39, 8) \
KeccakP-1600-AVX2.c: | ^
KeccakP-1600-AVX2.c: 95 | _ROLV_CONST(_A0, 0, 1, 62, 28) \
KeccakP-1600-AVX2.c: ...
try.c: /usr/bin/x86_64-linux-gnu-ld.bfd: libcrypto_hash_sha3256.a(SHA3-256.o): in function `crypto_hash_sha3256_kcp_optimized1600AVX2_constbranchindex':
try.c: .../supercop-data/hertz/amd64/try/c/clang_-march=native_-Os_-fwrapv_-Qunused-arguments_-fPIC_-fPIE_-gdwarf-4_-Wall/constbranchindex/crypto_hash/sha3256/kcp/optimized1600AVX2/work/SHA3-256.c:24:(.text+0x...): undefined reference to `KeccakWidth1600_Sponge'
try.c: clang: error: linker command failed with exit code 1 (use -v to see invocation)
Number of similar (implementation,compiler) pairs: 1, namely:
| Implementation | Compiler |
| kcp/optimized1600AVX2 | clang -march=native -Os -fwrapv -Qunused-arguments -fPIC -fPIE -gdwarf-4 -Wall (Ubuntu_Clang_21.1.8_(6ubuntu1)) |
Compiler output
KeccakP-1600-AVX2.c: KeccakP-1600-AVX2.c: In function 'crypto_hash_sha3256_kcp_optimized1600AVX2_constbranchindex_KeccakP1600_Permute_Nrounds':
KeccakP-1600-AVX2.c: KeccakP-1600-AVX2.c:86:17: warning: unused variable 'SRLV_C4' [-Wunused-variable]
KeccakP-1600-AVX2.c: 86 | _ROLV_TYPE SRLV##name = SET(64 - i0, 64 - i1, 64 - i2, 64 - i3);
KeccakP-1600-AVX2.c: | ^~~~
KeccakP-1600-AVX2.c: KeccakP-1600-AVX2.c:100:1: note: in expansion of macro '_ROLV_CONST'
KeccakP-1600-AVX2.c: 100 | _ROLV_CONST(_C4, 27, 20, 39, 8)
KeccakP-1600-AVX2.c: | ^~~~~~~~~~~
KeccakP-1600-AVX2.c: KeccakP-1600-AVX2.c:637:5: note: in expansion of macro 'KECCAK_CONSTANTS'
KeccakP-1600-AVX2.c: 637 | KECCAK_CONSTANTS
KeccakP-1600-AVX2.c: | ^~~~~~~~~~~~~~~~
KeccakP-1600-AVX2.c: KeccakP-1600-AVX2.c:85:17: warning: unused variable 'SLLV_C4' [-Wunused-variable]
KeccakP-1600-AVX2.c: 85 | _ROLV_TYPE SLLV##name = SET(i0, i1, i2, i3); \
KeccakP-1600-AVX2.c: | ^~~~
KeccakP-1600-AVX2.c: KeccakP-1600-AVX2.c:100:1: note: in expansion of macro '_ROLV_CONST'
KeccakP-1600-AVX2.c: 100 | _ROLV_CONST(_C4, 27, 20, 39, 8)
KeccakP-1600-AVX2.c: | ^~~~~~~~~~~
KeccakP-1600-AVX2.c: KeccakP-1600-AVX2.c:637:5: note: in expansion of macro 'KECCAK_CONSTANTS'
KeccakP-1600-AVX2.c: 637 | KECCAK_CONSTANTS
KeccakP-1600-AVX2.c: | ^~~~~~~~~~~~~~~~
KeccakP-1600-AVX2.c: KeccakP-1600-AVX2.c:86:17: warning: unused variable 'SRLV_A4' [-Wunused-variable]
KeccakP-1600-AVX2.c: 86 | _ROLV_TYPE SRLV##name = SET(64 - i0, 64 - i1, 64 - i2, 64 - i3);
KeccakP-1600-AVX2.c: | ^~~~
KeccakP-1600-AVX2.c: KeccakP-1600-AVX2.c:99:1: note: in expansion of macro '_ROLV_CONST'
KeccakP-1600-AVX2.c: 99 | _ROLV_CONST(_A4, 18, 2, 61, 56) \
KeccakP-1600-AVX2.c: | ^~~~~~~~~~~
KeccakP-1600-AVX2.c: ...
try.c: /usr/bin/x86_64-linux-gnu-ld.bfd: libcrypto_hash_sha3256.a(SHA3-256.o): in function `crypto_hash_sha3256_kcp_optimized1600AVX2_constbranchindex':
try.c: .../supercop-data/hertz/amd64/try/c/gcc_-march=native_-mtune=native_-O2_-fwrapv_-fPIC_-fPIE_-gdwarf-4_-Wall/constbranchindex/crypto_hash/sha3256/kcp/optimized1600AVX2/work/SHA3-256.c:24:(.text+0x...): undefined reference to `KeccakWidth1600_Sponge'
try.c: collect2: error: ld returned 1 exit status
Number of similar (implementation,compiler) pairs: 1, namely:
| Implementation | Compiler |
| kcp/optimized1600AVX2 | gcc -march=native -mtune=native -O2 -fwrapv -fPIC -fPIE -gdwarf-4 -Wall (15.2.0) |
Compiler output
KeccakP-1600-AVX2.c: KeccakP-1600-AVX2.c: In function 'crypto_hash_sha3256_kcp_optimized1600AVX2_constbranchindex_KeccakP1600_Permute_Nrounds':
KeccakP-1600-AVX2.c: KeccakP-1600-AVX2.c:86:17: warning: unused variable 'SRLV_C4' [-Wunused-variable]
KeccakP-1600-AVX2.c: 86 | _ROLV_TYPE SRLV##name = SET(64 - i0, 64 - i1, 64 - i2, 64 - i3);
KeccakP-1600-AVX2.c: | ^~~~
KeccakP-1600-AVX2.c: KeccakP-1600-AVX2.c:100:1: note: in expansion of macro '_ROLV_CONST'
KeccakP-1600-AVX2.c: 100 | _ROLV_CONST(_C4, 27, 20, 39, 8)
KeccakP-1600-AVX2.c: | ^~~~~~~~~~~
KeccakP-1600-AVX2.c: KeccakP-1600-AVX2.c:637:5: note: in expansion of macro 'KECCAK_CONSTANTS'
KeccakP-1600-AVX2.c: 637 | KECCAK_CONSTANTS
KeccakP-1600-AVX2.c: | ^~~~~~~~~~~~~~~~
KeccakP-1600-AVX2.c: KeccakP-1600-AVX2.c:85:17: warning: unused variable 'SLLV_C4' [-Wunused-variable]
KeccakP-1600-AVX2.c: 85 | _ROLV_TYPE SLLV##name = SET(i0, i1, i2, i3); \
KeccakP-1600-AVX2.c: | ^~~~
KeccakP-1600-AVX2.c: KeccakP-1600-AVX2.c:100:1: note: in expansion of macro '_ROLV_CONST'
KeccakP-1600-AVX2.c: 100 | _ROLV_CONST(_C4, 27, 20, 39, 8)
KeccakP-1600-AVX2.c: | ^~~~~~~~~~~
KeccakP-1600-AVX2.c: KeccakP-1600-AVX2.c:637:5: note: in expansion of macro 'KECCAK_CONSTANTS'
KeccakP-1600-AVX2.c: 637 | KECCAK_CONSTANTS
KeccakP-1600-AVX2.c: | ^~~~~~~~~~~~~~~~
KeccakP-1600-AVX2.c: KeccakP-1600-AVX2.c:86:17: warning: unused variable 'SRLV_A4' [-Wunused-variable]
KeccakP-1600-AVX2.c: 86 | _ROLV_TYPE SRLV##name = SET(64 - i0, 64 - i1, 64 - i2, 64 - i3);
KeccakP-1600-AVX2.c: | ^~~~
KeccakP-1600-AVX2.c: KeccakP-1600-AVX2.c:99:1: note: in expansion of macro '_ROLV_CONST'
KeccakP-1600-AVX2.c: 99 | _ROLV_CONST(_A4, 18, 2, 61, 56) \
KeccakP-1600-AVX2.c: | ^~~~~~~~~~~
KeccakP-1600-AVX2.c: ...
try.c: /usr/bin/x86_64-linux-gnu-ld.bfd: libcrypto_hash_sha3256.a(SHA3-256.o): in function `crypto_hash_sha3256_kcp_optimized1600AVX2_constbranchindex':
try.c: .../supercop-data/hertz/amd64/try/c/gcc_-march=native_-mtune=native_-O3_-fwrapv_-fPIC_-fPIE_-gdwarf-4_-Wall/constbranchindex/crypto_hash/sha3256/kcp/optimized1600AVX2/work/SHA3-256.c:24:(.text+0x...): undefined reference to `KeccakWidth1600_Sponge'
try.c: collect2: error: ld returned 1 exit status
Number of similar (implementation,compiler) pairs: 1, namely:
| Implementation | Compiler |
| kcp/optimized1600AVX2 | gcc -march=native -mtune=native -O3 -fwrapv -fPIC -fPIE -gdwarf-4 -Wall (15.2.0) |
Compiler output
KeccakP-1600-AVX2.c: KeccakP-1600-AVX2.c: In function 'crypto_hash_sha3256_kcp_optimized1600AVX2_constbranchindex_KeccakP1600_Permute_Nrounds':
KeccakP-1600-AVX2.c: KeccakP-1600-AVX2.c:86:17: warning: unused variable 'SRLV_C4' [-Wunused-variable]
KeccakP-1600-AVX2.c: 86 | _ROLV_TYPE SRLV##name = SET(64 - i0, 64 - i1, 64 - i2, 64 - i3);
KeccakP-1600-AVX2.c: | ^~~~
KeccakP-1600-AVX2.c: KeccakP-1600-AVX2.c:100:1: note: in expansion of macro '_ROLV_CONST'
KeccakP-1600-AVX2.c: 100 | _ROLV_CONST(_C4, 27, 20, 39, 8)
KeccakP-1600-AVX2.c: | ^~~~~~~~~~~
KeccakP-1600-AVX2.c: KeccakP-1600-AVX2.c:637:5: note: in expansion of macro 'KECCAK_CONSTANTS'
KeccakP-1600-AVX2.c: 637 | KECCAK_CONSTANTS
KeccakP-1600-AVX2.c: | ^~~~~~~~~~~~~~~~
KeccakP-1600-AVX2.c: KeccakP-1600-AVX2.c:85:17: warning: unused variable 'SLLV_C4' [-Wunused-variable]
KeccakP-1600-AVX2.c: 85 | _ROLV_TYPE SLLV##name = SET(i0, i1, i2, i3); \
KeccakP-1600-AVX2.c: | ^~~~
KeccakP-1600-AVX2.c: KeccakP-1600-AVX2.c:100:1: note: in expansion of macro '_ROLV_CONST'
KeccakP-1600-AVX2.c: 100 | _ROLV_CONST(_C4, 27, 20, 39, 8)
KeccakP-1600-AVX2.c: | ^~~~~~~~~~~
KeccakP-1600-AVX2.c: KeccakP-1600-AVX2.c:637:5: note: in expansion of macro 'KECCAK_CONSTANTS'
KeccakP-1600-AVX2.c: 637 | KECCAK_CONSTANTS
KeccakP-1600-AVX2.c: | ^~~~~~~~~~~~~~~~
KeccakP-1600-AVX2.c: KeccakP-1600-AVX2.c:86:17: warning: unused variable 'SRLV_A4' [-Wunused-variable]
KeccakP-1600-AVX2.c: 86 | _ROLV_TYPE SRLV##name = SET(64 - i0, 64 - i1, 64 - i2, 64 - i3);
KeccakP-1600-AVX2.c: | ^~~~
KeccakP-1600-AVX2.c: KeccakP-1600-AVX2.c:99:1: note: in expansion of macro '_ROLV_CONST'
KeccakP-1600-AVX2.c: 99 | _ROLV_CONST(_A4, 18, 2, 61, 56) \
KeccakP-1600-AVX2.c: | ^~~~~~~~~~~
KeccakP-1600-AVX2.c: ...
try.c: /usr/bin/x86_64-linux-gnu-ld.bfd: libcrypto_hash_sha3256.a(SHA3-256.o): in function `crypto_hash_sha3256_kcp_optimized1600AVX2_constbranchindex':
try.c: .../supercop-data/hertz/amd64/try/c/gcc_-march=native_-mtune=native_-Os_-fwrapv_-fPIC_-fPIE_-gdwarf-4_-Wall/constbranchindex/crypto_hash/sha3256/kcp/optimized1600AVX2/work/SHA3-256.c:24:(.text+0x...): undefined reference to `KeccakWidth1600_Sponge'
try.c: collect2: error: ld returned 1 exit status
Number of similar (implementation,compiler) pairs: 1, namely:
| Implementation | Compiler |
| kcp/optimized1600AVX2 | gcc -march=native -mtune=native -Os -fwrapv -fPIC -fPIE -gdwarf-4 -Wall (15.2.0) |
Compiler output
KeccakP-1600-AVX512.c: KeccakP-1600-AVX512.c:525:18: warning: unused variable 'i' [-Wunused-variable]
KeccakP-1600-AVX512.c: 525 | unsigned int i;
KeccakP-1600-AVX512.c: | ^
KeccakP-1600-AVX512.c: 1 warning generated.
Number of similar (implementation,compiler) pairs: 3, namely:
| Implementation | Compiler |
| kcp/optimized1600AVX512 | clang -march=native -O2 -fwrapv -Qunused-arguments -fPIC -fPIE -gdwarf-4 -Wall (Ubuntu_Clang_21.1.8_(6ubuntu1)) |
| kcp/optimized1600AVX512 | clang -march=native -O3 -fwrapv -Qunused-arguments -fPIC -fPIE -gdwarf-4 -Wall (Ubuntu_Clang_21.1.8_(6ubuntu1)) |
| kcp/optimized1600AVX512 | clang -march=native -Os -fwrapv -Qunused-arguments -fPIC -fPIE -gdwarf-4 -Wall (Ubuntu_Clang_21.1.8_(6ubuntu1)) |
Compiler output
KeccakP-1600-AVX512.c: KeccakP-1600-AVX512.c: In function 'KeccakP1600_Permute_12rounds':
KeccakP-1600-AVX512.c: KeccakP-1600-AVX512.c:525:18: warning: unused variable 'i' [-Wunused-variable]
KeccakP-1600-AVX512.c: 525 | unsigned int i;
KeccakP-1600-AVX512.c: | ^
Number of similar (implementation,compiler) pairs: 3, namely:
| Implementation | Compiler |
| kcp/optimized1600AVX512 | gcc -march=native -mtune=native -O2 -fwrapv -fPIC -fPIE -gdwarf-4 -Wall (15.2.0) |
| kcp/optimized1600AVX512 | gcc -march=native -mtune=native -O3 -fwrapv -fPIC -fPIE -gdwarf-4 -Wall (15.2.0) |
| kcp/optimized1600AVX512 | gcc -march=native -mtune=native -Os -fwrapv -fPIC -fPIE -gdwarf-4 -Wall (15.2.0) |
Namespace violations
KeccakP-1600-AVX512.o KeccakF1600_FastLoop_Absorb T
KeccakP-1600-AVX512.o KeccakP1600RoundConstants R
KeccakP-1600-AVX512.o KeccakP1600_12rounds_FastLoop_Absorb T
KeccakP-1600-AVX512.o KeccakP1600_AddBytes T
KeccakP-1600-AVX512.o KeccakP1600_ExtractAndAddBytes T
KeccakP-1600-AVX512.o KeccakP1600_ExtractBytes T
KeccakP-1600-AVX512.o KeccakP1600_Initialize T
KeccakP-1600-AVX512.o KeccakP1600_OverwriteBytes T
KeccakP-1600-AVX512.o KeccakP1600_OverwriteWithZeroes T
KeccakP-1600-AVX512.o KeccakP1600_Permute_12rounds T
KeccakP-1600-AVX512.o KeccakP1600_Permute_24rounds T
KeccakP-1600-AVX512.o KeccakP1600_Permute_Nrounds T
KeccakSpongeWidth1600.o KeccakWidth1600_12rounds_Sponge T
KeccakSpongeWidth1600.o KeccakWidth1600_12rounds_SpongeAbsorb T
KeccakSpongeWidth1600.o KeccakWidth1600_12rounds_SpongeAbsorbLastFewBits T
KeccakSpongeWidth1600.o KeccakWidth1600_12rounds_SpongeInitialize T
KeccakSpongeWidth1600.o KeccakWidth1600_12rounds_SpongeSqueeze T
KeccakSpongeWidth1600.o KeccakWidth1600_Sponge T
KeccakSpongeWidth1600.o KeccakWidth1600_SpongeAbsorb T
KeccakSpongeWidth1600.o KeccakWidth1600_SpongeAbsorbLastFewBits T
KeccakSpongeWidth1600.o KeccakWidth1600_SpongeInitialize T
KeccakSpongeWidth1600.o KeccakWidth1600_SpongeSqueeze T
Number of similar (implementation,compiler) pairs: 6, namely:
| Implementation | Compiler |
| kcp/optimized1600AVX512 | clang -march=native -O2 -fwrapv -Qunused-arguments -fPIC -fPIE -gdwarf-4 -Wall (Ubuntu_Clang_21.1.8_(6ubuntu1)) |
| kcp/optimized1600AVX512 | clang -march=native -O3 -fwrapv -Qunused-arguments -fPIC -fPIE -gdwarf-4 -Wall (Ubuntu_Clang_21.1.8_(6ubuntu1)) |
| kcp/optimized1600AVX512 | clang -march=native -Os -fwrapv -Qunused-arguments -fPIC -fPIE -gdwarf-4 -Wall (Ubuntu_Clang_21.1.8_(6ubuntu1)) |
| kcp/optimized1600AVX512 | gcc -march=native -mtune=native -O2 -fwrapv -fPIC -fPIE -gdwarf-4 -Wall (15.2.0) |
| kcp/optimized1600AVX512 | gcc -march=native -mtune=native -O3 -fwrapv -fPIC -fPIE -gdwarf-4 -Wall (15.2.0) |
| kcp/optimized1600AVX512 | gcc -march=native -mtune=native -Os -fwrapv -fPIC -fPIE -gdwarf-4 -Wall (15.2.0) |
TIMECOP error (can be valgrind bug)
error 132
Process terminating with default action of signal 4 (SIGILL)
Illegal opcode at address 0x40055D8
at 0x...: memset (string_fortified.h:59)
by 0x...: cpucycles_works (wrapper.c:59)
by 0x...: supercop_cpucycles_ticks_amd64_tsc_setup (amd64-tsc.c:28)
by 0x...: cpucycles_init (wrapper.c:314)
by 0x...: main (try-anything.c:330)
Illegal instruction (core dumped)
Number of similar (implementation,compiler) pairs: 1, namely:
| Implementation | Compiler |
| compact | clang -march=native -O2 -fwrapv -Qunused-arguments -fPIC -fPIE -gdwarf-4 -Wall (Ubuntu_Clang_21.1.8_(6ubuntu1)) |
TIMECOP error (can be valgrind bug)
error 132
Process terminating with default action of signal 4 (SIGILL)
Illegal opcode at address 0x40058D8
at 0x...: memset (string_fortified.h:59)
by 0x...: cpucycles_works (wrapper.c:59)
by 0x...: supercop_cpucycles_ticks_amd64_tsc_setup (amd64-tsc.c:28)
by 0x...: cpucycles_init (wrapper.c:314)
by 0x...: main (try-anything.c:330)
Illegal instruction (core dumped)
Number of similar (implementation,compiler) pairs: 1, namely:
| Implementation | Compiler |
| compact | clang -march=native -O3 -fwrapv -Qunused-arguments -fPIC -fPIE -gdwarf-4 -Wall (Ubuntu_Clang_21.1.8_(6ubuntu1)) |
TIMECOP error (can be valgrind bug)
error 132
Process terminating with default action of signal 4 (SIGILL)
Illegal opcode at address 0x4004A18
at 0x...: memset (string_fortified.h:59)
by 0x...: cpucycles_works (wrapper.c:59)
by 0x...: supercop_cpucycles_ticks_amd64_tsc_setup (amd64-tsc.c:28)
by 0x...: cpucycles_init (wrapper.c:314)
by 0x...: main (try-anything.c:330)
Illegal instruction (core dumped)
Number of similar (implementation,compiler) pairs: 1, namely:
| Implementation | Compiler |
| compact | clang -march=native -Os -fwrapv -Qunused-arguments -fPIC -fPIE -gdwarf-4 -Wall (Ubuntu_Clang_21.1.8_(6ubuntu1)) |
TIMECOP error (can be valgrind bug)
error 132
Process terminating with default action of signal 4 (SIGILL)
Illegal opcode at address 0x4005058
at 0x...: memset (string_fortified.h:59)
by 0x...: cpucycles_works (wrapper.c:59)
by 0x...: supercop_cpucycles_ticks_amd64_tsc_setup (amd64-tsc.c:28)
by 0x...: cpucycles_init (wrapper.c:314)
by 0x...: main (try-anything.c:330)
Illegal instruction (core dumped)
Number of similar (implementation,compiler) pairs: 2, namely:
| Implementation | Compiler |
| compact | gcc -march=native -mtune=native -O2 -fwrapv -fPIC -fPIE -gdwarf-4 -Wall (15.2.0) |
| openssl | gcc -march=native -mtune=native -O3 -fwrapv -fPIC -fPIE -gdwarf-4 -Wall (15.2.0) |
TIMECOP error (can be valgrind bug)
error 132
Process terminating with default action of signal 4 (SIGILL)
Illegal opcode at address 0x4006418
at 0x...: memset (string_fortified.h:59)
by 0x...: cpucycles_works (wrapper.c:59)
by 0x...: supercop_cpucycles_ticks_amd64_tsc_setup (amd64-tsc.c:28)
by 0x...: cpucycles_init (wrapper.c:314)
by 0x...: main (try-anything.c:330)
Illegal instruction (core dumped)
Number of similar (implementation,compiler) pairs: 1, namely:
| Implementation | Compiler |
| compact | gcc -march=native -mtune=native -O3 -fwrapv -fPIC -fPIE -gdwarf-4 -Wall (15.2.0) |
TIMECOP error (can be valgrind bug)
error 132
Process terminating with default action of signal 4 (SIGILL)
Illegal opcode at address 0x4004698
at 0x...: memset (string_fortified.h:59)
by 0x...: cpucycles_works (wrapper.c:59)
by 0x...: supercop_cpucycles_ticks_amd64_tsc_setup (amd64-tsc.c:28)
by 0x...: cpucycles_init (wrapper.c:314)
by 0x...: main (try-anything.c:330)
Illegal instruction (core dumped)
Number of similar (implementation,compiler) pairs: 1, namely:
| Implementation | Compiler |
| compact | gcc -march=native -mtune=native -Os -fwrapv -fPIC -fPIE -gdwarf-4 -Wall (15.2.0) |
TIMECOP error (can be valgrind bug)
error 132
Process terminating with default action of signal 4 (SIGILL)
Illegal opcode at address 0x400AF18
at 0x...: memset (string_fortified.h:59)
by 0x...: cpucycles_works (wrapper.c:59)
by 0x...: supercop_cpucycles_ticks_amd64_tsc_setup (amd64-tsc.c:28)
by 0x...: cpucycles_init (wrapper.c:314)
by 0x...: main (try-anything.c:330)
Illegal instruction (core dumped)
Number of similar (implementation,compiler) pairs: 1, namely:
| Implementation | Compiler |
| kcp/optimized1600AVX512 | clang -march=native -O2 -fwrapv -Qunused-arguments -fPIC -fPIE -gdwarf-4 -Wall (Ubuntu_Clang_21.1.8_(6ubuntu1)) |
TIMECOP error (can be valgrind bug)
error 132
Process terminating with default action of signal 4 (SIGILL)
Illegal opcode at address 0x400B3D8
at 0x...: memset (string_fortified.h:59)
by 0x...: cpucycles_works (wrapper.c:59)
by 0x...: supercop_cpucycles_ticks_amd64_tsc_setup (amd64-tsc.c:28)
by 0x...: cpucycles_init (wrapper.c:314)
by 0x...: main (try-anything.c:330)
Illegal instruction (core dumped)
Number of similar (implementation,compiler) pairs: 1, namely:
| Implementation | Compiler |
| kcp/optimized1600AVX512 | clang -march=native -O3 -fwrapv -Qunused-arguments -fPIC -fPIE -gdwarf-4 -Wall (Ubuntu_Clang_21.1.8_(6ubuntu1)) |
TIMECOP error (can be valgrind bug)
error 132
Process terminating with default action of signal 4 (SIGILL)
Illegal opcode at address 0x4009758
at 0x...: memset (string_fortified.h:59)
by 0x...: cpucycles_works (wrapper.c:59)
by 0x...: supercop_cpucycles_ticks_amd64_tsc_setup (amd64-tsc.c:28)
by 0x...: cpucycles_init (wrapper.c:314)
by 0x...: main (try-anything.c:330)
Illegal instruction (core dumped)
Number of similar (implementation,compiler) pairs: 1, namely:
| Implementation | Compiler |
| kcp/optimized1600AVX512 | clang -march=native -Os -fwrapv -Qunused-arguments -fPIC -fPIE -gdwarf-4 -Wall (Ubuntu_Clang_21.1.8_(6ubuntu1)) |
TIMECOP error (can be valgrind bug)
error 132
Process terminating with default action of signal 4 (SIGILL)
Illegal opcode at address 0x400A3D8
at 0x...: memset (string_fortified.h:59)
by 0x...: cpucycles_works (wrapper.c:59)
by 0x...: supercop_cpucycles_ticks_amd64_tsc_setup (amd64-tsc.c:28)
by 0x...: cpucycles_init (wrapper.c:314)
by 0x...: main (try-anything.c:330)
Illegal instruction (core dumped)
Number of similar (implementation,compiler) pairs: 1, namely:
| Implementation | Compiler |
| kcp/optimized1600AVX512 | gcc -march=native -mtune=native -O2 -fwrapv -fPIC -fPIE -gdwarf-4 -Wall (15.2.0) |
TIMECOP error (can be valgrind bug)
error 132
Process terminating with default action of signal 4 (SIGILL)
Illegal opcode at address 0x400AC18
at 0x...: memset (string_fortified.h:59)
by 0x...: cpucycles_works (wrapper.c:59)
by 0x...: supercop_cpucycles_ticks_amd64_tsc_setup (amd64-tsc.c:28)
by 0x...: cpucycles_init (wrapper.c:314)
by 0x...: main (try-anything.c:330)
Illegal instruction (core dumped)
Number of similar (implementation,compiler) pairs: 1, namely:
| Implementation | Compiler |
| kcp/optimized1600AVX512 | gcc -march=native -mtune=native -O3 -fwrapv -fPIC -fPIE -gdwarf-4 -Wall (15.2.0) |
TIMECOP error (can be valgrind bug)
error 132
Process terminating with default action of signal 4 (SIGILL)
Illegal opcode at address 0x40096D8
at 0x...: memset (string_fortified.h:59)
by 0x...: cpucycles_works (wrapper.c:59)
by 0x...: supercop_cpucycles_ticks_amd64_tsc_setup (amd64-tsc.c:28)
by 0x...: cpucycles_init (wrapper.c:314)
by 0x...: main (try-anything.c:330)
Illegal instruction (core dumped)
Number of similar (implementation,compiler) pairs: 1, namely:
| Implementation | Compiler |
| kcp/optimized1600AVX512 | gcc -march=native -mtune=native -Os -fwrapv -fPIC -fPIE -gdwarf-4 -Wall (15.2.0) |
TIMECOP error (can be valgrind bug)
error 132
Process terminating with default action of signal 4 (SIGILL)
Illegal opcode at address 0x4008918
at 0x...: memset (string_fortified.h:59)
by 0x...: cpucycles_works (wrapper.c:59)
by 0x...: supercop_cpucycles_ticks_amd64_tsc_setup (amd64-tsc.c:28)
by 0x...: cpucycles_init (wrapper.c:314)
by 0x...: main (try-anything.c:330)
Illegal instruction (core dumped)
Number of similar (implementation,compiler) pairs: 1, namely:
| Implementation | Compiler |
| oncore32bits | clang -march=native -O2 -fwrapv -Qunused-arguments -fPIC -fPIE -gdwarf-4 -Wall (Ubuntu_Clang_21.1.8_(6ubuntu1)) |
TIMECOP error (can be valgrind bug)
error 132
Process terminating with default action of signal 4 (SIGILL)
Illegal opcode at address 0x40088D8
at 0x...: memset (string_fortified.h:59)
by 0x...: cpucycles_works (wrapper.c:59)
by 0x...: supercop_cpucycles_ticks_amd64_tsc_setup (amd64-tsc.c:28)
by 0x...: cpucycles_init (wrapper.c:314)
by 0x...: main (try-anything.c:330)
Illegal instruction (core dumped)
Number of similar (implementation,compiler) pairs: 1, namely:
| Implementation | Compiler |
| oncore32bits | clang -march=native -O3 -fwrapv -Qunused-arguments -fPIC -fPIE -gdwarf-4 -Wall (Ubuntu_Clang_21.1.8_(6ubuntu1)) |
TIMECOP error (can be valgrind bug)
error 132
Process terminating with default action of signal 4 (SIGILL)
Illegal opcode at address 0x4007B98
at 0x...: memset (string_fortified.h:59)
by 0x...: cpucycles_works (wrapper.c:59)
by 0x...: supercop_cpucycles_ticks_amd64_tsc_setup (amd64-tsc.c:28)
by 0x...: cpucycles_init (wrapper.c:314)
by 0x...: main (try-anything.c:330)
Illegal instruction (core dumped)
Number of similar (implementation,compiler) pairs: 1, namely:
| Implementation | Compiler |
| oncore32bits | clang -march=native -Os -fwrapv -Qunused-arguments -fPIC -fPIE -gdwarf-4 -Wall (Ubuntu_Clang_21.1.8_(6ubuntu1)) |
TIMECOP error (can be valgrind bug)
error 132
Process terminating with default action of signal 4 (SIGILL)
Illegal opcode at address 0x4007E98
at 0x...: memset (string_fortified.h:59)
by 0x...: cpucycles_works (wrapper.c:59)
by 0x...: supercop_cpucycles_ticks_amd64_tsc_setup (amd64-tsc.c:28)
by 0x...: cpucycles_init (wrapper.c:314)
by 0x...: main (try-anything.c:330)
Illegal instruction (core dumped)
Number of similar (implementation,compiler) pairs: 1, namely:
| Implementation | Compiler |
| oncore32bits | gcc -march=native -mtune=native -O2 -fwrapv -fPIC -fPIE -gdwarf-4 -Wall (15.2.0) |
TIMECOP error (can be valgrind bug)
error 132
Process terminating with default action of signal 4 (SIGILL)
Illegal opcode at address 0x4009598
at 0x...: memset (string_fortified.h:59)
by 0x...: cpucycles_works (wrapper.c:59)
by 0x...: supercop_cpucycles_ticks_amd64_tsc_setup (amd64-tsc.c:28)
by 0x...: cpucycles_init (wrapper.c:314)
by 0x...: main (try-anything.c:330)
Illegal instruction (core dumped)
Number of similar (implementation,compiler) pairs: 1, namely:
| Implementation | Compiler |
| oncore32bits | gcc -march=native -mtune=native -O3 -fwrapv -fPIC -fPIE -gdwarf-4 -Wall (15.2.0) |
TIMECOP error (can be valgrind bug)
error 132
Process terminating with default action of signal 4 (SIGILL)
Illegal opcode at address 0x4007858
at 0x...: memset (string_fortified.h:59)
by 0x...: cpucycles_works (wrapper.c:59)
by 0x...: supercop_cpucycles_ticks_amd64_tsc_setup (amd64-tsc.c:28)
by 0x...: cpucycles_init (wrapper.c:314)
by 0x...: main (try-anything.c:330)
Illegal instruction (core dumped)
Number of similar (implementation,compiler) pairs: 1, namely:
| Implementation | Compiler |
| oncore32bits | gcc -march=native -mtune=native -Os -fwrapv -fPIC -fPIE -gdwarf-4 -Wall (15.2.0) |
TIMECOP error (can be valgrind bug)
error 132
Process terminating with default action of signal 4 (SIGILL)
Illegal opcode at address 0x40178D8
at 0x...: memset (string_fortified.h:59)
by 0x...: cpucycles_works (wrapper.c:59)
by 0x...: supercop_cpucycles_ticks_amd64_tsc_setup (amd64-tsc.c:28)
by 0x...: cpucycles_init (wrapper.c:314)
by 0x...: main (try-anything.c:330)
Illegal instruction (core dumped)
Number of similar (implementation,compiler) pairs: 1, namely:
| Implementation | Compiler |
| oncore64bits | clang -march=native -O2 -fwrapv -Qunused-arguments -fPIC -fPIE -gdwarf-4 -Wall (Ubuntu_Clang_21.1.8_(6ubuntu1)) |
TIMECOP error (can be valgrind bug)
error 132
Process terminating with default action of signal 4 (SIGILL)
Illegal opcode at address 0x4017A98
at 0x...: memset (string_fortified.h:59)
by 0x...: cpucycles_works (wrapper.c:59)
by 0x...: supercop_cpucycles_ticks_amd64_tsc_setup (amd64-tsc.c:28)
by 0x...: cpucycles_init (wrapper.c:314)
by 0x...: main (try-anything.c:330)
Illegal instruction (core dumped)
Number of similar (implementation,compiler) pairs: 1, namely:
| Implementation | Compiler |
| oncore64bits | clang -march=native -O3 -fwrapv -Qunused-arguments -fPIC -fPIE -gdwarf-4 -Wall (Ubuntu_Clang_21.1.8_(6ubuntu1)) |
TIMECOP error (can be valgrind bug)
error 132
Process terminating with default action of signal 4 (SIGILL)
Illegal opcode at address 0x4016D18
at 0x...: memset (string_fortified.h:59)
by 0x...: cpucycles_works (wrapper.c:59)
by 0x...: supercop_cpucycles_ticks_amd64_tsc_setup (amd64-tsc.c:28)
by 0x...: cpucycles_init (wrapper.c:314)
by 0x...: main (try-anything.c:330)
Illegal instruction (core dumped)
Number of similar (implementation,compiler) pairs: 1, namely:
| Implementation | Compiler |
| oncore64bits | clang -march=native -Os -fwrapv -Qunused-arguments -fPIC -fPIE -gdwarf-4 -Wall (Ubuntu_Clang_21.1.8_(6ubuntu1)) |
TIMECOP error (can be valgrind bug)
error 132
Process terminating with default action of signal 4 (SIGILL)
Illegal opcode at address 0x4017198
at 0x...: memset (string_fortified.h:59)
by 0x...: cpucycles_works (wrapper.c:59)
by 0x...: supercop_cpucycles_ticks_amd64_tsc_setup (amd64-tsc.c:28)
by 0x...: cpucycles_init (wrapper.c:314)
by 0x...: main (try-anything.c:330)
Illegal instruction (core dumped)
Number of similar (implementation,compiler) pairs: 1, namely:
| Implementation | Compiler |
| oncore64bits | gcc -march=native -mtune=native -O2 -fwrapv -fPIC -fPIE -gdwarf-4 -Wall (15.2.0) |
TIMECOP error (can be valgrind bug)
error 132
Process terminating with default action of signal 4 (SIGILL)
Illegal opcode at address 0x40177D8
at 0x...: memset (string_fortified.h:59)
by 0x...: cpucycles_works (wrapper.c:59)
by 0x...: supercop_cpucycles_ticks_amd64_tsc_setup (amd64-tsc.c:28)
by 0x...: cpucycles_init (wrapper.c:314)
by 0x...: main (try-anything.c:330)
Illegal instruction (core dumped)
Number of similar (implementation,compiler) pairs: 1, namely:
| Implementation | Compiler |
| oncore64bits | gcc -march=native -mtune=native -O3 -fwrapv -fPIC -fPIE -gdwarf-4 -Wall (15.2.0) |
TIMECOP error (can be valgrind bug)
error 132
Process terminating with default action of signal 4 (SIGILL)
Illegal opcode at address 0x4016AD8
at 0x...: memset (string_fortified.h:59)
by 0x...: cpucycles_works (wrapper.c:59)
by 0x...: supercop_cpucycles_ticks_amd64_tsc_setup (amd64-tsc.c:28)
by 0x...: cpucycles_init (wrapper.c:314)
by 0x...: main (try-anything.c:330)
Illegal instruction (core dumped)
Number of similar (implementation,compiler) pairs: 1, namely:
| Implementation | Compiler |
| oncore64bits | gcc -march=native -mtune=native -Os -fwrapv -fPIC -fPIE -gdwarf-4 -Wall (15.2.0) |
TIMECOP error (can be valgrind bug)
error 132
Process terminating with default action of signal 4 (SIGILL)
Illegal opcode at address 0x4004F58
at 0x...: memset (string_fortified.h:59)
by 0x...: cpucycles_works (wrapper.c:59)
by 0x...: supercop_cpucycles_ticks_amd64_tsc_setup (amd64-tsc.c:28)
by 0x...: cpucycles_init (wrapper.c:314)
by 0x...: main (try-anything.c:330)
Illegal instruction (core dumped)
Number of similar (implementation,compiler) pairs: 1, namely:
| Implementation | Compiler |
| openssl | clang -march=native -O2 -fwrapv -Qunused-arguments -fPIC -fPIE -gdwarf-4 -Wall (Ubuntu_Clang_21.1.8_(6ubuntu1)) |
TIMECOP error (can be valgrind bug)
error 132
Process terminating with default action of signal 4 (SIGILL)
Illegal opcode at address 0x4005118
at 0x...: memset (string_fortified.h:59)
by 0x...: cpucycles_works (wrapper.c:59)
by 0x...: supercop_cpucycles_ticks_amd64_tsc_setup (amd64-tsc.c:28)
by 0x...: cpucycles_init (wrapper.c:314)
by 0x...: main (try-anything.c:330)
Illegal instruction (core dumped)
Number of similar (implementation,compiler) pairs: 1, namely:
| Implementation | Compiler |
| openssl | clang -march=native -O3 -fwrapv -Qunused-arguments -fPIC -fPIE -gdwarf-4 -Wall (Ubuntu_Clang_21.1.8_(6ubuntu1)) |
TIMECOP error (can be valgrind bug)
error 132
Process terminating with default action of signal 4 (SIGILL)
Illegal opcode at address 0x4004758
at 0x...: memset (string_fortified.h:59)
by 0x...: cpucycles_works (wrapper.c:59)
by 0x...: supercop_cpucycles_ticks_amd64_tsc_setup (amd64-tsc.c:28)
by 0x...: cpucycles_init (wrapper.c:314)
by 0x...: main (try-anything.c:330)
Illegal instruction (core dumped)
Number of similar (implementation,compiler) pairs: 1, namely:
| Implementation | Compiler |
| openssl | clang -march=native -Os -fwrapv -Qunused-arguments -fPIC -fPIE -gdwarf-4 -Wall (Ubuntu_Clang_21.1.8_(6ubuntu1)) |
TIMECOP error (can be valgrind bug)
error 132
Process terminating with default action of signal 4 (SIGILL)
Illegal opcode at address 0x4004B18
at 0x...: memset (string_fortified.h:59)
by 0x...: cpucycles_works (wrapper.c:59)
by 0x...: supercop_cpucycles_ticks_amd64_tsc_setup (amd64-tsc.c:28)
by 0x...: cpucycles_init (wrapper.c:314)
by 0x...: main (try-anything.c:330)
Illegal instruction (core dumped)
Number of similar (implementation,compiler) pairs: 1, namely:
| Implementation | Compiler |
| openssl | gcc -march=native -mtune=native -O2 -fwrapv -fPIC -fPIE -gdwarf-4 -Wall (15.2.0) |
TIMECOP error (can be valgrind bug)
error 132
Process terminating with default action of signal 4 (SIGILL)
Illegal opcode at address 0x4004558
at 0x...: memset (string_fortified.h:59)
by 0x...: cpucycles_works (wrapper.c:59)
by 0x...: supercop_cpucycles_ticks_amd64_tsc_setup (amd64-tsc.c:28)
by 0x...: cpucycles_init (wrapper.c:314)
by 0x...: main (try-anything.c:330)
Illegal instruction (core dumped)
Number of similar (implementation,compiler) pairs: 1, namely:
| Implementation | Compiler |
| openssl | gcc -march=native -mtune=native -Os -fwrapv -fPIC -fPIE -gdwarf-4 -Wall (15.2.0) |
TIMECOP error (can be valgrind bug)
error 132
Process terminating with default action of signal 4 (SIGILL)
Illegal opcode at address 0x4006958
at 0x...: memset (string_fortified.h:59)
by 0x...: cpucycles_works (wrapper.c:59)
by 0x...: supercop_cpucycles_ticks_amd64_tsc_setup (amd64-tsc.c:28)
by 0x...: cpucycles_init (wrapper.c:314)
by 0x...: main (try-anything.c:330)
Illegal instruction (core dumped)
Number of similar (implementation,compiler) pairs: 1, namely:
| Implementation | Compiler |
| usekcp | clang -march=native -O2 -fwrapv -Qunused-arguments -fPIC -fPIE -gdwarf-4 -Wall (Ubuntu_Clang_21.1.8_(6ubuntu1)) |
TIMECOP error (can be valgrind bug)
error 132
Process terminating with default action of signal 4 (SIGILL)
Illegal opcode at address 0x4006B18
at 0x...: memset (string_fortified.h:59)
by 0x...: cpucycles_works (wrapper.c:59)
by 0x...: supercop_cpucycles_ticks_amd64_tsc_setup (amd64-tsc.c:28)
by 0x...: cpucycles_init (wrapper.c:314)
by 0x...: main (try-anything.c:330)
Illegal instruction (core dumped)
Number of similar (implementation,compiler) pairs: 1, namely:
| Implementation | Compiler |
| usekcp | clang -march=native -O3 -fwrapv -Qunused-arguments -fPIC -fPIE -gdwarf-4 -Wall (Ubuntu_Clang_21.1.8_(6ubuntu1)) |
TIMECOP error (can be valgrind bug)
error 132
Process terminating with default action of signal 4 (SIGILL)
Illegal opcode at address 0x4006118
at 0x...: memset (string_fortified.h:59)
by 0x...: cpucycles_works (wrapper.c:59)
by 0x...: supercop_cpucycles_ticks_amd64_tsc_setup (amd64-tsc.c:28)
by 0x...: cpucycles_init (wrapper.c:314)
by 0x...: main (try-anything.c:330)
Illegal instruction (core dumped)
Number of similar (implementation,compiler) pairs: 1, namely:
| Implementation | Compiler |
| usekcp | clang -march=native -Os -fwrapv -Qunused-arguments -fPIC -fPIE -gdwarf-4 -Wall (Ubuntu_Clang_21.1.8_(6ubuntu1)) |
TIMECOP error (can be valgrind bug)
error 132
Process terminating with default action of signal 4 (SIGILL)
Illegal opcode at address 0x4006298
at 0x...: memset (string_fortified.h:59)
by 0x...: cpucycles_works (wrapper.c:59)
by 0x...: supercop_cpucycles_ticks_amd64_tsc_setup (amd64-tsc.c:28)
by 0x...: cpucycles_init (wrapper.c:314)
by 0x...: main (try-anything.c:330)
Illegal instruction (core dumped)
Number of similar (implementation,compiler) pairs: 1, namely:
| Implementation | Compiler |
| usekcp | gcc -march=native -mtune=native -O2 -fwrapv -fPIC -fPIE -gdwarf-4 -Wall (15.2.0) |
TIMECOP error (can be valgrind bug)
error 132
Process terminating with default action of signal 4 (SIGILL)
Illegal opcode at address 0x40067D8
at 0x...: memset (string_fortified.h:59)
by 0x...: cpucycles_works (wrapper.c:59)
by 0x...: supercop_cpucycles_ticks_amd64_tsc_setup (amd64-tsc.c:28)
by 0x...: cpucycles_init (wrapper.c:314)
by 0x...: main (try-anything.c:330)
Illegal instruction (core dumped)
Number of similar (implementation,compiler) pairs: 1, namely:
| Implementation | Compiler |
| usekcp | gcc -march=native -mtune=native -O3 -fwrapv -fPIC -fPIE -gdwarf-4 -Wall (15.2.0) |
TIMECOP error (can be valgrind bug)
error 132
Process terminating with default action of signal 4 (SIGILL)
Illegal opcode at address 0x4005CD8
at 0x...: memset (string_fortified.h:59)
by 0x...: cpucycles_works (wrapper.c:59)
by 0x...: supercop_cpucycles_ticks_amd64_tsc_setup (amd64-tsc.c:28)
by 0x...: cpucycles_init (wrapper.c:314)
by 0x...: main (try-anything.c:330)
Illegal instruction (core dumped)
Number of similar (implementation,compiler) pairs: 1, namely:
| Implementation | Compiler |
| usekcp | gcc -march=native -mtune=native -Os -fwrapv -fPIC -fPIE -gdwarf-4 -Wall (15.2.0) |