Test results for amd64, hertz, crypto_hash/groestl256

[Page version: 20261007 20:07:58]

Measurements for amd64, hertz, crypto_hash Test results for amd64, hertz, crypto_hash Test results for crypto_hash/groestl256
Computer: hertz
Microarchitecture: amd64; Zen 4 (a60f12)
Architecture: amd64
CPU ID: AuthenticAMD-00a60f12-178bfbff
SUPERCOP version: 20261004
Operation: crypto_hash
Primitive: groestl256
TimeObject sizeTest sizeImplementationCompilerBenchmark dateSUPERCOP version
984319078 0 108847562 1296 2656T:aesni-intrclang -march=native -O2 -fwrapv -Qunused-arguments -fPIC -fPIE -gdwarf-4 -Wall2026100620261004
985619117 0 108849114 1296 2656T:aesni-intrclang -march=native -O3 -fwrapv -Qunused-arguments -fPIC -fPIE -gdwarf-4 -Wall2026100620261004
993816429 0 108839404 1288 2656T:aesni-intrclang -march=native -Os -fwrapv -Qunused-arguments -fPIC -fPIE -gdwarf-4 -Wall2026100620261004
1058324506 0 97651957 1264 2656T:aesni-intrgcc -march=native -mtune=native -O3 -fwrapv -fPIC -fPIE -gdwarf-4 -Wall2026100620261004
1058924454 0 97651893 1264 2656T:avx-intrgcc -march=native -mtune=native -O3 -fwrapv -fPIC -fPIE -gdwarf-4 -Wall2026100620261004
1059822562 0 97646373 1264 2656T:avx-intrgcc -march=native -mtune=native -O2 -fwrapv -fPIC -fPIE -gdwarf-4 -Wall2026100620261004
1060922626 0 97646437 1264 2656T:aesni-intrgcc -march=native -mtune=native -O2 -fwrapv -fPIC -fPIE -gdwarf-4 -Wall2026100620261004
1066321884 0 97645524 1256 2592T:aesni-intrgcc -march=native -mtune=native -O -fwrapv -fPIC -fPIE -gdwarf-4 -Wall2026100620261004
1087821948 0 97645588 1256 2592T:avx-intrgcc -march=native -mtune=native -O -fwrapv -fPIC -fPIE -gdwarf-4 -Wall2026100620261004
1089421865 0 97643976 1240 2560T:aesni-intrgcc -march=native -mtune=native -Os -fwrapv -fPIC -fPIE -gdwarf-4 -Wall2026100620261004
1100921803 0 97643912 1240 2560T:avx-intrgcc -march=native -mtune=native -Os -fwrapv -fPIC -fPIE -gdwarf-4 -Wall2026100620261004
1112821186 0 128051106 1296 2848T:avx-intrclang -march=native -O3 -fwrapv -Qunused-arguments -fPIC -fPIE -gdwarf-4 -Wall2026100620261004
1115121147 0 128049618 1296 2848T:avx-intrclang -march=native -O2 -fwrapv -Qunused-arguments -fPIC -fPIE -gdwarf-4 -Wall2026100620261004
1117118449 0 128041460 1288 2848T:avx-intrclang -march=native -Os -fwrapv -Qunused-arguments -fPIC -fPIE -gdwarf-4 -Wall2026100620261004
2165649266 0 126476693 1264 2944T:vperm-intrgcc -march=native -mtune=native -O3 -fwrapv -fPIC -fPIE -gdwarf-4 -Wall2026100620261004
2228747090 0 126470901 1264 2944T:vperm-intrgcc -march=native -mtune=native -O2 -fwrapv -fPIC -fPIE -gdwarf-4 -Wall2026100620261004
2230746156 0 126469796 1256 2880T:vperm-intrgcc -march=native -mtune=native -O -fwrapv -fPIC -fPIE -gdwarf-4 -Wall2026100620261004
2237143809 0 160071946 1296 3168T:vperm-intrclang -march=native -O2 -fwrapv -Qunused-arguments -fPIC -fPIE -gdwarf-4 -Wall2026100620261004
2260143825 0 160073418 1296 3168T:vperm-intrclang -march=native -O3 -fwrapv -Qunused-arguments -fPIC -fPIE -gdwarf-4 -Wall2026100620261004
2264041368 0 160064372 1288 3168T:vperm-intrclang -march=native -Os -fwrapv -Qunused-arguments -fPIC -fPIE -gdwarf-4 -Wall2026100620261004
2265343615 0 126465752 1240 2848T:vperm-intrgcc -march=native -mtune=native -Os -fwrapv -fPIC -fPIE -gdwarf-4 -Wall2026100620261004
3104551079 0 078573 1264 1664T:sphlib-adaptedgcc -march=native -mtune=native -O3 -fwrapv -fPIC -fPIE -gdwarf-4 -Wall2026100620261004
3222648263 0 075757 1264 1664T:sphlibgcc -march=native -mtune=native -O3 -fwrapv -fPIC -fPIE -gdwarf-4 -Wall2026100620261004
3276050183 0 073997 1264 1664T:sphlib-adaptedgcc -march=native -mtune=native -O2 -fwrapv -fPIC -fPIE -gdwarf-4 -Wall2026100620261004
3499347287 0 071117 1264 1664T:sphlibgcc -march=native -mtune=native -O2 -fwrapv -fPIC -fPIE -gdwarf-4 -Wall2026100620261004
3533456560 0 079701 1296 1568T:mmxclang -march=native -Os -fwrapv -Qunused-arguments -fPIC -fPIE -gdwarf-4 -Wall2026100620261004
3552322759 0 050285 1264 1664T:sphlib-smallgcc -march=native -mtune=native -O3 -fwrapv -fPIC -fPIE -gdwarf-4 -Wall2026100620261004
3623119575 0 043405 1264 1664T:sphlib-smallgcc -march=native -mtune=native -O2 -fwrapv -fPIC -fPIE -gdwarf-4 -Wall2026100620261004
3697065073 0 087257 1248 1568T:mmxgcc -march=native -mtune=native -Os -fwrapv -fPIC -fPIE -gdwarf-4 -Wall2026100620261004
3699245909 0 068933 1280 1568T:sphlibclang -march=native -Os -fwrapv -Qunused-arguments -fPIC -fPIE -gdwarf-4 -Wall2026100620261004
3721852097 0 082267 1288 1568T:sphlibclang -march=native -O3 -fwrapv -Qunused-arguments -fPIC -fPIE -gdwarf-4 -Wall2026100620261004
3723052097 0 080795 1288 1568T:sphlibclang -march=native -O2 -fwrapv -Qunused-arguments -fPIC -fPIE -gdwarf-4 -Wall2026100620261004
3743649887 0 072965 1280 1568T:sphlib-adaptedclang -march=native -Os -fwrapv -Qunused-arguments -fPIC -fPIE -gdwarf-4 -Wall2026100620261004
3784668354 0 092093 1264 1600T:mmxgcc -march=native -mtune=native -O -fwrapv -fPIC -fPIE -gdwarf-4 -Wall2026100620261004
3794652777 0 163274978 1296 3136T:avx-intrclang -march=native -O -fwrapv -Qunused-arguments -fPIC -fPIE -gdwarf-4 -Wall2026100620261004
3836155649 0 084379 1288 1568T:sphlib-adaptedclang -march=native -O2 -fwrapv -Qunused-arguments -fPIC -fPIE -gdwarf-4 -Wall2026100620261004
3842955649 0 085851 1288 1568T:sphlib-adaptedclang -march=native -O3 -fwrapv -Qunused-arguments -fPIC -fPIE -gdwarf-4 -Wall2026100620261004
3866252001 0 074283 1288 1504T:sphlibclang -march=native -O -fwrapv -Qunused-arguments -fPIC -fPIE -gdwarf-4 -Wall2026100620261004
3908560635 0 083053 1312 1504T:mmxclang -march=native -O -fwrapv -Qunused-arguments -fPIC -fPIE -gdwarf-4 -Wall2026100620261004
3924368409 0 092358 1272 1664T:mmxgcc -march=native -mtune=native -O2 -fwrapv -fPIC -fPIE -gdwarf-4 -Wall2026100620261004
4023217220 0 040261 1280 1568T:sphlib-smallclang -march=native -Os -fwrapv -Qunused-arguments -fPIC -fPIE -gdwarf-4 -Wall2026100620261004
4096818945 0 047579 1288 1568T:sphlib-smallclang -march=native -O2 -fwrapv -Qunused-arguments -fPIC -fPIE -gdwarf-4 -Wall2026100620261004
4102618945 0 049051 1288 1568T:sphlib-smallclang -march=native -O3 -fwrapv -Qunused-arguments -fPIC -fPIE -gdwarf-4 -Wall2026100620261004
4106119073 0 041323 1288 1504T:sphlib-smallclang -march=native -O -fwrapv -Qunused-arguments -fPIC -fPIE -gdwarf-4 -Wall2026100620261004
4111166784 0 097157 1312 1568T:mmxclang -march=native -O3 -fwrapv -Qunused-arguments -fPIC -fPIE -gdwarf-4 -Wall2026100620261004
4116066584 0 095485 1312 1568T:mmxclang -march=native -O2 -fwrapv -Qunused-arguments -fPIC -fPIE -gdwarf-4 -Wall2026100620261004
4169920357 0 044044 1256 1600T:sphlib-smallgcc -march=native -mtune=native -O -fwrapv -fPIC -fPIE -gdwarf-4 -Wall2026100620261004
4217450189 0 160072482 1296 3104T:aesni-intrclang -march=native -O -fwrapv -Qunused-arguments -fPIC -fPIE -gdwarf-4 -Wall2026100620261004
4297555409 0 077675 1288 1504T:sphlib-adaptedclang -march=native -O -fwrapv -Qunused-arguments -fPIC -fPIE -gdwarf-4 -Wall2026100620261004
486128490 0 038587 1288 1568T:32bit-2ktableclang -march=native -O3 -fwrapv -Qunused-arguments -fPIC -fPIE -gdwarf-4 -Wall2026100620261004
486588426 0 037115 1288 1568T:32bit-2ktableclang -march=native -O2 -fwrapv -Qunused-arguments -fPIC -fPIE -gdwarf-4 -Wall2026100620261004
490567658 0 030685 1280 1568T:32bit-2ktableclang -march=native -Os -fwrapv -Qunused-arguments -fPIC -fPIE -gdwarf-4 -Wall2026100620261004
5080151885 0 075596 1256 1600T:sphlibgcc -march=native -mtune=native -O -fwrapv -fPIC -fPIE -gdwarf-4 -Wall2026100620261004
5275077684 0 0105246 1272 1664T:mmxgcc -march=native -mtune=native -O3 -fwrapv -fPIC -fPIE -gdwarf-4 -Wall2026100620261004
5672458693 0 082380 1256 1600T:sphlib-adaptedgcc -march=native -mtune=native -O -fwrapv -fPIC -fPIE -gdwarf-4 -Wall2026100620261004
5907921099 0 043409 1248 1568T:opt32gcc -march=native -mtune=native -Os -fwrapv -fPIC -fPIE -gdwarf-4 -Wall2026100620261004
6047622970 0 046709 1264 1600T:opt32gcc -march=native -mtune=native -O -fwrapv -fPIC -fPIE -gdwarf-4 -Wall2026100620261004
6081921557 0 044085 1312 1504T:opt32clang -march=native -O -fwrapv -Qunused-arguments -fPIC -fPIE -gdwarf-4 -Wall2026100620261004
6398246433 0 068592 1240 1568T:sphlibgcc -march=native -mtune=native -Os -fwrapv -fPIC -fPIE -gdwarf-4 -Wall2026100620261004
6401825613 0 053198 1272 1664T:opt32gcc -march=native -mtune=native -O3 -fwrapv -fPIC -fPIE -gdwarf-4 -Wall2026100620261004
6436349838 0 072048 1240 1568T:sphlib-adaptedgcc -march=native -mtune=native -Os -fwrapv -fPIC -fPIE -gdwarf-4 -Wall2026100620261004
6465423601 0 047526 1272 1664T:opt32gcc -march=native -mtune=native -O2 -fwrapv -fPIC -fPIE -gdwarf-4 -Wall2026100620261004
6849820871 0 044053 1296 1568T:opt32clang -march=native -Os -fwrapv -Qunused-arguments -fPIC -fPIE -gdwarf-4 -Wall2026100620261004
7022723013 0 053373 1312 1568T:opt32clang -march=native -O3 -fwrapv -Qunused-arguments -fPIC -fPIE -gdwarf-4 -Wall2026100620261004
7109823029 0 051965 1312 1568T:opt32clang -march=native -O2 -fwrapv -Qunused-arguments -fPIC -fPIE -gdwarf-4 -Wall2026100620261004
8450720495 0 042672 1240 1568T:sphlib-smallgcc -march=native -mtune=native -Os -fwrapv -fPIC -fPIE -gdwarf-4 -Wall2026100620261004
85201108101 0 2144130474 1296 3648T:vperm-intrclang -march=native -O -fwrapv -Qunused-arguments -fPIC -fPIE -gdwarf-4 -Wall2026100620261004
9665010005 0 033694 1256 1664T:32bit-2ktablegcc -march=native -mtune=native -O2 -fwrapv -fPIC -fPIE -gdwarf-4 -Wall2026100620261004
9673010453 0 037822 1256 1664T:32bit-2ktablegcc -march=native -mtune=native -O3 -fwrapv -fPIC -fPIE -gdwarf-4 -Wall2026100620261004
1187008342 0 030571 1288 1504T:32bit-2ktableclang -march=native -O -fwrapv -Qunused-arguments -fPIC -fPIE -gdwarf-4 -Wall2026100620261004
12710912291 0 041035 1288 1568T:32bit-bytesliced-c-fastclang -march=native -O2 -fwrapv -Qunused-arguments -fPIC -fPIE -gdwarf-4 -Wall2026100620261004
12717612325 0 042443 1288 1568T:32bit-bytesliced-c-fastclang -march=native -O3 -fwrapv -Qunused-arguments -fPIC -fPIE -gdwarf-4 -Wall2026100620261004
1283135531 0 032942 1256 1664T:32bit-bytesliced-c-fastgcc -march=native -mtune=native -O3 -fwrapv -fPIC -fPIE -gdwarf-4 -Wall2026100620261004
1288813893 0 027582 1256 1664T:32bit-bytesliced-c-fastgcc -march=native -mtune=native -O2 -fwrapv -fPIC -fPIE -gdwarf-4 -Wall2026100620261004
1389239281 0 031345 1232 1568T:32bit-2ktablegcc -march=native -mtune=native -Os -fwrapv -fPIC -fPIE -gdwarf-4 -Wall2026100620261004
1420544029 0 026211 1288 1504T:32bit-bytesliced-c-fastclang -march=native -O -fwrapv -Qunused-arguments -fPIC -fPIE -gdwarf-4 -Wall2026100620261004
1495993470 0 026525 1280 1568T:32bit-bytesliced-c-fastclang -march=native -Os -fwrapv -Qunused-arguments -fPIC -fPIE -gdwarf-4 -Wall2026100620261004
14977910221 0 033757 1248 1600T:32bit-2ktablegcc -march=native -mtune=native -O -fwrapv -fPIC -fPIE -gdwarf-4 -Wall2026100620261004
1612292670 0 024745 1232 1568T:32bit-bytesliced-c-fastgcc -march=native -mtune=native -Os -fwrapv -fPIC -fPIE -gdwarf-4 -Wall2026100620261004
1660724373 0 034443 1288 1568T:8bit_cclang -march=native -O3 -fwrapv -Qunused-arguments -fPIC -fPIE -gdwarf-4 -Wall2026100620261004
1663284393 0 026523 1288 1504T:8bit_cclang -march=native -O -fwrapv -Qunused-arguments -fPIC -fPIE -gdwarf-4 -Wall2026100620261004
1665394373 0 032971 1288 1568T:8bit_cclang -march=native -O2 -fwrapv -Qunused-arguments -fPIC -fPIE -gdwarf-4 -Wall2026100620261004
1731424157 0 027085 1280 1568T:8bit_cclang -march=native -Os -fwrapv -Qunused-arguments -fPIC -fPIE -gdwarf-4 -Wall2026100620261004
1740563425 0 026949 1248 1600T:32bit-bytesliced-c-fastgcc -march=native -mtune=native -O -fwrapv -fPIC -fPIE -gdwarf-4 -Wall2026100620261004
1857734640 0 028476 1272 1664T:8bit_cgcc -march=native -mtune=native -O2 -fwrapv -fPIC -fPIE -gdwarf-4 -Wall2026100620261004
1859926594 0 034100 1272 1664T:8bit_cgcc -march=native -mtune=native -O3 -fwrapv -fPIC -fPIE -gdwarf-4 -Wall2026100620261004
18927911844 0 041739 1288 1568T:32bit-bytesliced-c-smallclang -march=native -O3 -fwrapv -Qunused-arguments -fPIC -fPIE -gdwarf-4 -Wall2026100620261004
1911704514 0 028211 1264 1600T:8bit_cgcc -march=native -mtune=native -O -fwrapv -fPIC -fPIE -gdwarf-4 -Wall2026100620261004
1973415709 0 034379 1288 1568T:32bit-bytesliced-c-smallclang -march=native -O2 -fwrapv -Qunused-arguments -fPIC -fPIE -gdwarf-4 -Wall2026100620261004
2098504287 0 026455 1248 1568T:8bit_cgcc -march=native -mtune=native -Os -fwrapv -fPIC -fPIE -gdwarf-4 -Wall2026100620261004
2224834582 0 031934 1256 1664T:32bit-bytesliced-c-smallgcc -march=native -mtune=native -O3 -fwrapv -fPIC -fPIE -gdwarf-4 -Wall2026100620261004
2475511814 0 023817 1232 1568T:32bit-bytesliced-c-smallgcc -march=native -mtune=native -Os -fwrapv -fPIC -fPIE -gdwarf-4 -Wall2026100620261004
2747812053 0 025085 1280 1568T:32bit-bytesliced-c-smallclang -march=native -Os -fwrapv -Qunused-arguments -fPIC -fPIE -gdwarf-4 -Wall2026100620261004
2783982342 0 026030 1256 1664T:32bit-bytesliced-c-smallgcc -march=native -mtune=native -O2 -fwrapv -fPIC -fPIE -gdwarf-4 -Wall2026100620261004
3234982963 0 026469 1248 1600T:32bit-bytesliced-c-smallgcc -march=native -mtune=native -O -fwrapv -fPIC -fPIE -gdwarf-4 -Wall2026100620261004
3426513168 0 025387 1288 1504T:32bit-bytesliced-c-smallclang -march=native -O -fwrapv -Qunused-arguments -fPIC -fPIE -gdwarf-4 -Wall2026100620261004

Test failure


error 139
Segmentation fault (core dumped)

Number of similar (implementation,compiler) pairs: 8, namely:
ImplementationCompiler
T:aesnigcc -march=native -mtune=native -O2 -fwrapv -fPIC -fPIE -gdwarf-4 -Wall (15.2.0)
T:aesnigcc -march=native -mtune=native -O3 -fwrapv -fPIC -fPIE -gdwarf-4 -Wall (15.2.0)
T:aesnigcc -march=native -mtune=native -O -fwrapv -fPIC -fPIE -gdwarf-4 -Wall (15.2.0)
T:aesnigcc -march=native -mtune=native -Os -fwrapv -fPIC -fPIE -gdwarf-4 -Wall (15.2.0)
T:avxgcc -march=native -mtune=native -O2 -fwrapv -fPIC -fPIE -gdwarf-4 -Wall (15.2.0)
T:avxgcc -march=native -mtune=native -O3 -fwrapv -fPIC -fPIE -gdwarf-4 -Wall (15.2.0)
T:avxgcc -march=native -mtune=native -O -fwrapv -fPIC -fPIE -gdwarf-4 -Wall (15.2.0)
T:avxgcc -march=native -mtune=native -Os -fwrapv -fPIC -fPIE -gdwarf-4 -Wall (15.2.0)

Compiler output


hash.c: hash.c:104:12: warning: comparison of array 'ctx->chaining' equal to a null pointer is always false [-Wtautological-pointer-compare]
hash.c:   104 |   if (ctx->chaining == NULL || ctx->buffer == NULL)
hash.c:       |       ~~~~~^~~~~~~~    ~~~~
hash.c: hash.c:104:37: warning: comparison of array 'ctx->buffer' equal to a null pointer is always false [-Wtautological-pointer-compare]
hash.c:   104 |   if (ctx->chaining == NULL || ctx->buffer == NULL)
hash.c:       |                                ~~~~~^~~~~~    ~~~~
hash.c: In file included from hash.c:13:
hash.c: ./groestl-asm-aes.h:389:8: error: invalid operand for instruction
hash.c:   389 |   asm ("movaps xmm12, [rdi+0*16]");
hash.c:       |        ^
hash.c: <inline asm>:1:16: note: instantiated into assembly here
hash.c:     1 |         movaps xmm12, [rdi+0*16]
hash.c:       |                       ^~~~~~~~~~
hash.c: In file included from hash.c:13:
hash.c: ./groestl-asm-aes.h:390:8: error: invalid operand for instruction
hash.c:   390 |   asm ("movaps xmm13, [rdi+1*16]");
hash.c:       |        ^
hash.c: <inline asm>:1:16: note: instantiated into assembly here
hash.c:     1 |         movaps xmm13, [rdi+1*16]
hash.c:       |                       ^~~~~~~~~~
hash.c: In file included from hash.c:13:
hash.c: ./groestl-asm-aes.h:391:8: error: invalid operand for instruction
hash.c:   391 |   asm ("movaps xmm14, [rdi+2*16]");
hash.c:       |        ^
hash.c: <inline asm>:1:16: note: instantiated into assembly here
hash.c: ...

Number of similar (implementation,compiler) pairs: 4, namely:
ImplementationCompiler
T:aesniclang -march=native -O2 -fwrapv -Qunused-arguments -fPIC -fPIE -gdwarf-4 -Wall (Ubuntu_Clang_21.1.8_(6ubuntu1))
T:aesniclang -march=native -O3 -fwrapv -Qunused-arguments -fPIC -fPIE -gdwarf-4 -Wall (Ubuntu_Clang_21.1.8_(6ubuntu1))
T:aesniclang -march=native -O -fwrapv -Qunused-arguments -fPIC -fPIE -gdwarf-4 -Wall (Ubuntu_Clang_21.1.8_(6ubuntu1))
T:aesniclang -march=native -Os -fwrapv -Qunused-arguments -fPIC -fPIE -gdwarf-4 -Wall (Ubuntu_Clang_21.1.8_(6ubuntu1))

Compiler output


hash.c: hash.c: In function 'Init':
hash.c: hash.c:104:21: warning: the comparison will always evaluate as 'false' for the address of 'chaining' will never be NULL [-Waddress]
hash.c:   104 |   if (ctx->chaining == NULL || ctx->buffer == NULL)
hash.c:       |                     ^~
hash.c: In file included from groestl-asm-aes.h:10,
hash.c:                  from hash.c:13:
hash.c: hash.h:83:38: note: 'chaining' declared here
hash.c:    83 |   __attribute__ ((aligned (32))) u64 chaining[SIZE/8];      /* actual state */
hash.c:       |                                      ^~~~~~~~
hash.c: hash.c:104:44: warning: the comparison will always evaluate as 'false' for the address of 'buffer' will never be NULL [-Waddress]
hash.c:   104 |   if (ctx->chaining == NULL || ctx->buffer == NULL)
hash.c:       |                                            ^~
hash.c: hash.h:84:46: note: 'buffer' declared here
hash.c:    84 |   __attribute__ ((aligned (32))) BitSequence buffer[SIZE];  /* data buffer */
hash.c:       |                                              ^~~~~~

Number of similar (implementation,compiler) pairs: 4, namely:
ImplementationCompiler
T:aesnigcc -march=native -mtune=native -O2 -fwrapv -fPIC -fPIE -gdwarf-4 -Wall (15.2.0)
T:aesnigcc -march=native -mtune=native -O3 -fwrapv -fPIC -fPIE -gdwarf-4 -Wall (15.2.0)
T:aesnigcc -march=native -mtune=native -O -fwrapv -fPIC -fPIE -gdwarf-4 -Wall (15.2.0)
T:aesnigcc -march=native -mtune=native -Os -fwrapv -fPIC -fPIE -gdwarf-4 -Wall (15.2.0)

Compiler output


hash.c: hash.c:104:12: warning: comparison of array 'ctx->chaining' equal to a null pointer is always false [-Wtautological-pointer-compare]
hash.c:   104 |   if (ctx->chaining == NULL || ctx->buffer == NULL)
hash.c:       |       ~~~~~^~~~~~~~    ~~~~
hash.c: hash.c:104:37: warning: comparison of array 'ctx->buffer' equal to a null pointer is always false [-Wtautological-pointer-compare]
hash.c:   104 |   if (ctx->chaining == NULL || ctx->buffer == NULL)
hash.c:       |                                ~~~~~^~~~~~    ~~~~
hash.c: 2 warnings generated.

Number of similar (implementation,compiler) pairs: 8, namely:
ImplementationCompiler
T:aesni-intrclang -march=native -O2 -fwrapv -Qunused-arguments -fPIC -fPIE -gdwarf-4 -Wall (Ubuntu_Clang_21.1.8_(6ubuntu1))
T:aesni-intrclang -march=native -O3 -fwrapv -Qunused-arguments -fPIC -fPIE -gdwarf-4 -Wall (Ubuntu_Clang_21.1.8_(6ubuntu1))
T:aesni-intrclang -march=native -O -fwrapv -Qunused-arguments -fPIC -fPIE -gdwarf-4 -Wall (Ubuntu_Clang_21.1.8_(6ubuntu1))
T:aesni-intrclang -march=native -Os -fwrapv -Qunused-arguments -fPIC -fPIE -gdwarf-4 -Wall (Ubuntu_Clang_21.1.8_(6ubuntu1))
T:vperm-intrclang -march=native -O2 -fwrapv -Qunused-arguments -fPIC -fPIE -gdwarf-4 -Wall (Ubuntu_Clang_21.1.8_(6ubuntu1))
T:vperm-intrclang -march=native -O3 -fwrapv -Qunused-arguments -fPIC -fPIE -gdwarf-4 -Wall (Ubuntu_Clang_21.1.8_(6ubuntu1))
T:vperm-intrclang -march=native -O -fwrapv -Qunused-arguments -fPIC -fPIE -gdwarf-4 -Wall (Ubuntu_Clang_21.1.8_(6ubuntu1))
T:vperm-intrclang -march=native -Os -fwrapv -Qunused-arguments -fPIC -fPIE -gdwarf-4 -Wall (Ubuntu_Clang_21.1.8_(6ubuntu1))

Compiler output


hash.c: hash.c: In function 'Init':
hash.c: hash.c:104:21: warning: the comparison will always evaluate as 'false' for the address of 'chaining' will never be NULL [-Waddress]
hash.c:   104 |   if (ctx->chaining == NULL || ctx->buffer == NULL)
hash.c:       |                     ^~
hash.c: In file included from groestl-intr-aes.h:12,
hash.c:                  from hash.c:28:
hash.c: hash.h:83:38: note: 'chaining' declared here
hash.c:    83 |   __attribute__ ((aligned (32))) u64 chaining[SIZE/8];      /* actual state */
hash.c:       |                                      ^~~~~~~~
hash.c: hash.c:104:44: warning: the comparison will always evaluate as 'false' for the address of 'buffer' will never be NULL [-Waddress]
hash.c:   104 |   if (ctx->chaining == NULL || ctx->buffer == NULL)
hash.c:       |                                            ^~
hash.c: hash.h:84:46: note: 'buffer' declared here
hash.c:    84 |   __attribute__ ((aligned (32))) BitSequence buffer[SIZE];  /* data buffer */
hash.c:       |                                              ^~~~~~

Number of similar (implementation,compiler) pairs: 4, namely:
ImplementationCompiler
T:aesni-intrgcc -march=native -mtune=native -O2 -fwrapv -fPIC -fPIE -gdwarf-4 -Wall (15.2.0)
T:aesni-intrgcc -march=native -mtune=native -O3 -fwrapv -fPIC -fPIE -gdwarf-4 -Wall (15.2.0)
T:aesni-intrgcc -march=native -mtune=native -O -fwrapv -fPIC -fPIE -gdwarf-4 -Wall (15.2.0)
T:aesni-intrgcc -march=native -mtune=native -Os -fwrapv -fPIC -fPIE -gdwarf-4 -Wall (15.2.0)

Compiler output


hash.c: hash.c:69:12: warning: comparison of array 'ctx->chaining' equal to a null pointer is always false [-Wtautological-pointer-compare]
hash.c:    69 |   if (ctx->chaining == NULL || ctx->buffer == NULL)
hash.c:       |       ~~~~~^~~~~~~~    ~~~~
hash.c: hash.c:69:37: warning: comparison of array 'ctx->buffer' equal to a null pointer is always false [-Wtautological-pointer-compare]
hash.c:    69 |   if (ctx->chaining == NULL || ctx->buffer == NULL)
hash.c:       |                                ~~~~~^~~~~~    ~~~~
hash.c: hash.c:62:3: warning: while loop has empty body [-Wempty-body]
hash.c:    62 |   SET_CONSTANTS();
hash.c:       |   ^
hash.c: ./groestl-asm-avx.h:62:10: note: expanded from macro 'SET_CONSTANTS'
hash.c:    62 | }while(0);
hash.c:       |          ^
hash.c: hash.c:62:3: note: put the semicolon on a separate line to silence this warning
hash.c: ./groestl-asm-avx.h:62:10: note: expanded from macro 'SET_CONSTANTS'
hash.c:    62 | }while(0);
hash.c:       |          ^
hash.c: ./groestl-asm-avx.h:377:8: error: invalid operand for instruction
hash.c:   377 |   asm ("vmovdqa xmm12, [rdi+0*16]");
hash.c:       |        ^
hash.c: <inline asm>:1:17: note: instantiated into assembly here
hash.c:     1 |         vmovdqa xmm12, [rdi+0*16]
hash.c:       |                        ^~~~~~~~~~
hash.c: In file included from hash.c:9:
hash.c: ./groestl-asm-avx.h:378:8: error: invalid operand for instruction
hash.c:   378 |   asm ("vmovdqa xmm13, [rdi+1*16]");
hash.c: ...

Number of similar (implementation,compiler) pairs: 4, namely:
ImplementationCompiler
T:avxclang -march=native -O2 -fwrapv -Qunused-arguments -fPIC -fPIE -gdwarf-4 -Wall (Ubuntu_Clang_21.1.8_(6ubuntu1))
T:avxclang -march=native -O3 -fwrapv -Qunused-arguments -fPIC -fPIE -gdwarf-4 -Wall (Ubuntu_Clang_21.1.8_(6ubuntu1))
T:avxclang -march=native -O -fwrapv -Qunused-arguments -fPIC -fPIE -gdwarf-4 -Wall (Ubuntu_Clang_21.1.8_(6ubuntu1))
T:avxclang -march=native -Os -fwrapv -Qunused-arguments -fPIC -fPIE -gdwarf-4 -Wall (Ubuntu_Clang_21.1.8_(6ubuntu1))

Compiler output


hash.c: hash.c: In function 'Init':
hash.c: hash.c:69:21: warning: the comparison will always evaluate as 'false' for the address of 'chaining' will never be NULL [-Waddress]
hash.c:    69 |   if (ctx->chaining == NULL || ctx->buffer == NULL)
hash.c:       |                     ^~
hash.c: In file included from groestl-asm-avx.h:10,
hash.c:                  from hash.c:9:
hash.c: hash.h:81:38: note: 'chaining' declared here
hash.c:    81 |   __attribute__ ((aligned (32))) u64 chaining[SIZE/8];      /* actual state */
hash.c:       |                                      ^~~~~~~~
hash.c: hash.c:69:44: warning: the comparison will always evaluate as 'false' for the address of 'buffer' will never be NULL [-Waddress]
hash.c:    69 |   if (ctx->chaining == NULL || ctx->buffer == NULL)
hash.c:       |                                            ^~
hash.c: hash.h:82:46: note: 'buffer' declared here
hash.c:    82 |   __attribute__ ((aligned (32))) BitSequence buffer[SIZE];  /* data buffer */
hash.c:       |                                              ^~~~~~

Number of similar (implementation,compiler) pairs: 4, namely:
ImplementationCompiler
T:avxgcc -march=native -mtune=native -O2 -fwrapv -fPIC -fPIE -gdwarf-4 -Wall (15.2.0)
T:avxgcc -march=native -mtune=native -O3 -fwrapv -fPIC -fPIE -gdwarf-4 -Wall (15.2.0)
T:avxgcc -march=native -mtune=native -O -fwrapv -fPIC -fPIE -gdwarf-4 -Wall (15.2.0)
T:avxgcc -march=native -mtune=native -Os -fwrapv -fPIC -fPIE -gdwarf-4 -Wall (15.2.0)

Compiler output


hash.c: hash.c:69:12: warning: comparison of array 'ctx->chaining' equal to a null pointer is always false [-Wtautological-pointer-compare]
hash.c:    69 |   if (ctx->chaining == NULL || ctx->buffer == NULL)
hash.c:       |       ~~~~~^~~~~~~~    ~~~~
hash.c: hash.c:69:37: warning: comparison of array 'ctx->buffer' equal to a null pointer is always false [-Wtautological-pointer-compare]
hash.c:    69 |   if (ctx->chaining == NULL || ctx->buffer == NULL)
hash.c:       |                                ~~~~~^~~~~~    ~~~~
hash.c: 2 warnings generated.

Number of similar (implementation,compiler) pairs: 4, namely:
ImplementationCompiler
T:avx-intrclang -march=native -O2 -fwrapv -Qunused-arguments -fPIC -fPIE -gdwarf-4 -Wall (Ubuntu_Clang_21.1.8_(6ubuntu1))
T:avx-intrclang -march=native -O3 -fwrapv -Qunused-arguments -fPIC -fPIE -gdwarf-4 -Wall (Ubuntu_Clang_21.1.8_(6ubuntu1))
T:avx-intrclang -march=native -O -fwrapv -Qunused-arguments -fPIC -fPIE -gdwarf-4 -Wall (Ubuntu_Clang_21.1.8_(6ubuntu1))
T:avx-intrclang -march=native -Os -fwrapv -Qunused-arguments -fPIC -fPIE -gdwarf-4 -Wall (Ubuntu_Clang_21.1.8_(6ubuntu1))

Compiler output


hash.c: hash.c: In function 'Init':
hash.c: hash.c:69:21: warning: the comparison will always evaluate as 'false' for the address of 'chaining' will never be NULL [-Waddress]
hash.c:    69 |   if (ctx->chaining == NULL || ctx->buffer == NULL)
hash.c:       |                     ^~
hash.c: In file included from groestl-intr-avx.h:13,
hash.c:                  from hash.c:9:
hash.c: hash.h:81:38: note: 'chaining' declared here
hash.c:    81 |   __attribute__ ((aligned (32))) u64 chaining[SIZE/8];      /* actual state */
hash.c:       |                                      ^~~~~~~~
hash.c: hash.c:69:44: warning: the comparison will always evaluate as 'false' for the address of 'buffer' will never be NULL [-Waddress]
hash.c:    69 |   if (ctx->chaining == NULL || ctx->buffer == NULL)
hash.c:       |                                            ^~
hash.c: hash.h:82:46: note: 'buffer' declared here
hash.c:    82 |   __attribute__ ((aligned (32))) BitSequence buffer[SIZE];  /* data buffer */
hash.c:       |                                              ^~~~~~

Number of similar (implementation,compiler) pairs: 4, namely:
ImplementationCompiler
T:avx-intrgcc -march=native -mtune=native -O2 -fwrapv -fPIC -fPIE -gdwarf-4 -Wall (15.2.0)
T:avx-intrgcc -march=native -mtune=native -O3 -fwrapv -fPIC -fPIE -gdwarf-4 -Wall (15.2.0)
T:avx-intrgcc -march=native -mtune=native -O -fwrapv -fPIC -fPIE -gdwarf-4 -Wall (15.2.0)
T:avx-intrgcc -march=native -mtune=native -Os -fwrapv -fPIC -fPIE -gdwarf-4 -Wall (15.2.0)

Compiler output


try.c: /usr/bin/x86_64-linux-gnu-ld.bfd: libcrypto_hash_groestl256.a(hash.o): relocation R_X86_64_32S against symbol `T0' can not be used when making a PIE object; recompile with -fPIE
try.c: /usr/bin/x86_64-linux-gnu-ld.bfd: failed to set dynamic section sizes: bad value
try.c: clang: error: linker command failed with exit code 1 (use -v to see invocation)

Number of similar (implementation,compiler) pairs: 12, namely:
ImplementationCompiler
T:core2duoclang -march=native -O2 -fwrapv -Qunused-arguments -fPIC -fPIE -gdwarf-4 -Wall (Ubuntu_Clang_21.1.8_(6ubuntu1))
T:core2duoclang -march=native -O3 -fwrapv -Qunused-arguments -fPIC -fPIE -gdwarf-4 -Wall (Ubuntu_Clang_21.1.8_(6ubuntu1))
T:core2duoclang -march=native -O -fwrapv -Qunused-arguments -fPIC -fPIE -gdwarf-4 -Wall (Ubuntu_Clang_21.1.8_(6ubuntu1))
T:core2duoclang -march=native -Os -fwrapv -Qunused-arguments -fPIC -fPIE -gdwarf-4 -Wall (Ubuntu_Clang_21.1.8_(6ubuntu1))
T:opteronclang -march=native -O2 -fwrapv -Qunused-arguments -fPIC -fPIE -gdwarf-4 -Wall (Ubuntu_Clang_21.1.8_(6ubuntu1))
T:opteronclang -march=native -O3 -fwrapv -Qunused-arguments -fPIC -fPIE -gdwarf-4 -Wall (Ubuntu_Clang_21.1.8_(6ubuntu1))
T:opteronclang -march=native -O -fwrapv -Qunused-arguments -fPIC -fPIE -gdwarf-4 -Wall (Ubuntu_Clang_21.1.8_(6ubuntu1))
T:opteronclang -march=native -Os -fwrapv -Qunused-arguments -fPIC -fPIE -gdwarf-4 -Wall (Ubuntu_Clang_21.1.8_(6ubuntu1))
T:opteron-unrolledclang -march=native -O2 -fwrapv -Qunused-arguments -fPIC -fPIE -gdwarf-4 -Wall (Ubuntu_Clang_21.1.8_(6ubuntu1))
T:opteron-unrolledclang -march=native -O3 -fwrapv -Qunused-arguments -fPIC -fPIE -gdwarf-4 -Wall (Ubuntu_Clang_21.1.8_(6ubuntu1))
T:opteron-unrolledclang -march=native -O -fwrapv -Qunused-arguments -fPIC -fPIE -gdwarf-4 -Wall (Ubuntu_Clang_21.1.8_(6ubuntu1))
T:opteron-unrolledclang -march=native -Os -fwrapv -Qunused-arguments -fPIC -fPIE -gdwarf-4 -Wall (Ubuntu_Clang_21.1.8_(6ubuntu1))

Compiler output


try.c: /usr/bin/x86_64-linux-gnu-ld.bfd: libcrypto_hash_groestl256.a(hash.o): in function `Transform':
try.c: .../supercop-data/hertz/amd64/try/c/gcc_-march=native_-mtune=native_-O2_-fwrapv_-fPIC_-fPIE_-gdwarf-4_-Wall/timingleaks/crypto_hash/groestl256/core2duo/work/hash.c:37:(.text+0x...): undefined reference to `Q512ASM'
try.c: /usr/bin/x86_64-linux-gnu-ld.bfd: .../supercop-data/hertz/amd64/try/c/gcc_-march=native_-mtune=native_-O2_-fwrapv_-fPIC_-fPIE_-gdwarf-4_-Wall/timingleaks/crypto_hash/groestl256/core2duo/work/hash.c:38:(.text+0x...): undefined reference to `P512ASM'
try.c: /usr/bin/x86_64-linux-gnu-ld.bfd: libcrypto_hash_groestl256.a(hash.o): in function `OutputTransformation':
try.c: .../supercop-data/hertz/amd64/try/c/gcc_-march=native_-mtune=native_-O2_-fwrapv_-fPIC_-fPIE_-gdwarf-4_-Wall/timingleaks/crypto_hash/groestl256/core2duo/work/hash.c:62:(.text+0x...): undefined reference to `P512ASM'
try.c: collect2: error: ld returned 1 exit status

Number of similar (implementation,compiler) pairs: 1, namely:
ImplementationCompiler
T:core2duogcc -march=native -mtune=native -O2 -fwrapv -fPIC -fPIE -gdwarf-4 -Wall (15.2.0)

Compiler output


try.c: /usr/bin/x86_64-linux-gnu-ld.bfd: libcrypto_hash_groestl256.a(hash.o): in function `Transform':
try.c: .../supercop-data/hertz/amd64/try/c/gcc_-march=native_-mtune=native_-O3_-fwrapv_-fPIC_-fPIE_-gdwarf-4_-Wall/timingleaks/crypto_hash/groestl256/core2duo/work/hash.c:37:(.text+0x...): undefined reference to `Q512ASM'
try.c: /usr/bin/x86_64-linux-gnu-ld.bfd: .../supercop-data/hertz/amd64/try/c/gcc_-march=native_-mtune=native_-O3_-fwrapv_-fPIC_-fPIE_-gdwarf-4_-Wall/timingleaks/crypto_hash/groestl256/core2duo/work/hash.c:38:(.text+0x...): undefined reference to `P512ASM'
try.c: /usr/bin/x86_64-linux-gnu-ld.bfd: .../supercop-data/hertz/amd64/try/c/gcc_-march=native_-mtune=native_-O3_-fwrapv_-fPIC_-fPIE_-gdwarf-4_-Wall/timingleaks/crypto_hash/groestl256/core2duo/work/hash.c:37:(.text+0x...): undefined reference to `Q512ASM'
try.c: /usr/bin/x86_64-linux-gnu-ld.bfd: .../supercop-data/hertz/amd64/try/c/gcc_-march=native_-mtune=native_-O3_-fwrapv_-fPIC_-fPIE_-gdwarf-4_-Wall/timingleaks/crypto_hash/groestl256/core2duo/work/hash.c:38:(.text+0x...): undefined reference to `P512ASM'
try.c: /usr/bin/x86_64-linux-gnu-ld.bfd: libcrypto_hash_groestl256.a(hash.o): in function `OutputTransformation':
try.c: .../supercop-data/hertz/amd64/try/c/gcc_-march=native_-mtune=native_-O3_-fwrapv_-fPIC_-fPIE_-gdwarf-4_-Wall/timingleaks/crypto_hash/groestl256/core2duo/work/hash.c:62:(.text+0x...): undefined reference to `P512ASM'
try.c: /usr/bin/x86_64-linux-gnu-ld.bfd: .../supercop-data/hertz/amd64/try/c/gcc_-march=native_-mtune=native_-O3_-fwrapv_-fPIC_-fPIE_-gdwarf-4_-Wall/timingleaks/crypto_hash/groestl256/core2duo/work/hash.c:62:(.text+0x...): undefined reference to `P512ASM'
try.c: /usr/bin/x86_64-linux-gnu-ld.bfd: .../supercop-data/hertz/amd64/try/c/gcc_-march=native_-mtune=native_-O3_-fwrapv_-fPIC_-fPIE_-gdwarf-4_-Wall/timingleaks/crypto_hash/groestl256/core2duo/work/hash.c:62:(.text+0x...): undefined reference to `P512ASM'
try.c: collect2: error: ld returned 1 exit status

Number of similar (implementation,compiler) pairs: 1, namely:
ImplementationCompiler
T:core2duogcc -march=native -mtune=native -O3 -fwrapv -fPIC -fPIE -gdwarf-4 -Wall (15.2.0)

Compiler output


try.c: /usr/bin/x86_64-linux-gnu-ld.bfd: libcrypto_hash_groestl256.a(hash.o): in function `Transform':
try.c: .../supercop-data/hertz/amd64/try/c/gcc_-march=native_-mtune=native_-O_-fwrapv_-fPIC_-fPIE_-gdwarf-4_-Wall/timingleaks/crypto_hash/groestl256/core2duo/work/hash.c:37:(.text+0x...): undefined reference to `Q512ASM'
try.c: /usr/bin/x86_64-linux-gnu-ld.bfd: .../supercop-data/hertz/amd64/try/c/gcc_-march=native_-mtune=native_-O_-fwrapv_-fPIC_-fPIE_-gdwarf-4_-Wall/timingleaks/crypto_hash/groestl256/core2duo/work/hash.c:38:(.text+0x...): undefined reference to `P512ASM'
try.c: /usr/bin/x86_64-linux-gnu-ld.bfd: libcrypto_hash_groestl256.a(hash.o): in function `OutputTransformation':
try.c: .../supercop-data/hertz/amd64/try/c/gcc_-march=native_-mtune=native_-O_-fwrapv_-fPIC_-fPIE_-gdwarf-4_-Wall/timingleaks/crypto_hash/groestl256/core2duo/work/hash.c:62:(.text+0x...): undefined reference to `P512ASM'
try.c: collect2: error: ld returned 1 exit status

Number of similar (implementation,compiler) pairs: 1, namely:
ImplementationCompiler
T:core2duogcc -march=native -mtune=native -O -fwrapv -fPIC -fPIE -gdwarf-4 -Wall (15.2.0)

Compiler output


try.c: /usr/bin/x86_64-linux-gnu-ld.bfd: libcrypto_hash_groestl256.a(hash.o): in function `Transform':
try.c: .../supercop-data/hertz/amd64/try/c/gcc_-march=native_-mtune=native_-Os_-fwrapv_-fPIC_-fPIE_-gdwarf-4_-Wall/timingleaks/crypto_hash/groestl256/core2duo/work/hash.c:37:(.text+0x...): undefined reference to `Q512ASM'
try.c: /usr/bin/x86_64-linux-gnu-ld.bfd: .../supercop-data/hertz/amd64/try/c/gcc_-march=native_-mtune=native_-Os_-fwrapv_-fPIC_-fPIE_-gdwarf-4_-Wall/timingleaks/crypto_hash/groestl256/core2duo/work/hash.c:38:(.text+0x...): undefined reference to `P512ASM'
try.c: /usr/bin/x86_64-linux-gnu-ld.bfd: libcrypto_hash_groestl256.a(hash.o): in function `OutputTransformation':
try.c: .../supercop-data/hertz/amd64/try/c/gcc_-march=native_-mtune=native_-Os_-fwrapv_-fPIC_-fPIE_-gdwarf-4_-Wall/timingleaks/crypto_hash/groestl256/core2duo/work/hash.c:62:(.text+0x...): undefined reference to `P512ASM'
try.c: collect2: error: ld returned 1 exit status

Number of similar (implementation,compiler) pairs: 1, namely:
ImplementationCompiler
T:core2duogcc -march=native -mtune=native -Os -fwrapv -fPIC -fPIE -gdwarf-4 -Wall (15.2.0)

Compiler output


hash.c: hash.c:563:8: warning: unused variable 'mmm' [-Wunused-variable]
hash.c:   563 |   u64 *mmm = (u64*)tmp;
hash.c:       |        ^~~
hash.c: 1 warning generated.

Number of similar (implementation,compiler) pairs: 4, namely:
ImplementationCompiler
T:mmxclang -march=native -O2 -fwrapv -Qunused-arguments -fPIC -fPIE -gdwarf-4 -Wall (Ubuntu_Clang_21.1.8_(6ubuntu1))
T:mmxclang -march=native -O3 -fwrapv -Qunused-arguments -fPIC -fPIE -gdwarf-4 -Wall (Ubuntu_Clang_21.1.8_(6ubuntu1))
T:mmxclang -march=native -O -fwrapv -Qunused-arguments -fPIC -fPIE -gdwarf-4 -Wall (Ubuntu_Clang_21.1.8_(6ubuntu1))
T:mmxclang -march=native -Os -fwrapv -Qunused-arguments -fPIC -fPIE -gdwarf-4 -Wall (Ubuntu_Clang_21.1.8_(6ubuntu1))

Compiler output


hash.c: hash.c: In function 'Transform1024':
hash.c: hash.c:563:8: warning: unused variable 'mmm' [-Wunused-variable]
hash.c:   563 |   u64 *mmm = (u64*)tmp;
hash.c:       |        ^~~

Number of similar (implementation,compiler) pairs: 4, namely:
ImplementationCompiler
T:mmxgcc -march=native -mtune=native -O2 -fwrapv -fPIC -fPIE -gdwarf-4 -Wall (15.2.0)
T:mmxgcc -march=native -mtune=native -O3 -fwrapv -fPIC -fPIE -gdwarf-4 -Wall (15.2.0)
T:mmxgcc -march=native -mtune=native -O -fwrapv -fPIC -fPIE -gdwarf-4 -Wall (15.2.0)
T:mmxgcc -march=native -mtune=native -Os -fwrapv -fPIC -fPIE -gdwarf-4 -Wall (15.2.0)

Compiler output


hash.c: hash.c:182:9: warning: unknown pragma ignored [-Wunknown-pragmas]
hash.c:   182 | #pragma vector aligned
hash.c:       |         ^
hash.c: hash.c:219:9: warning: unknown pragma ignored [-Wunknown-pragmas]
hash.c:   219 | #pragma vector aligned
hash.c:       |         ^
hash.c: 2 warnings generated.
try.c: /usr/bin/x86_64-linux-gnu-ld.bfd: libcrypto_hash_groestl256.a(hash.o): in function `Transform':
try.c: .../supercop-data/hertz/amd64/try/c/clang_-march=native_-O2_-fwrapv_-Qunused-arguments_-fPIC_-fPIE_-gdwarf-4_-Wall/timingleaks/crypto_hash/groestl256/opt64/work/hash.c:237:(.text+0x...): undefined reference to `F512'
try.c: /usr/bin/x86_64-linux-gnu-ld.bfd: .../supercop-data/hertz/amd64/try/c/clang_-march=native_-O2_-fwrapv_-Qunused-arguments_-fPIC_-fPIE_-gdwarf-4_-Wall/timingleaks/crypto_hash/groestl256/opt64/work/hash.c:246:(.text+0x...): undefined reference to `F1024'
try.c: /usr/bin/x86_64-linux-gnu-ld.bfd: .../supercop-data/hertz/amd64/try/c/clang_-march=native_-O2_-fwrapv_-Qunused-arguments_-fPIC_-fPIE_-gdwarf-4_-Wall/timingleaks/crypto_hash/groestl256/opt64/work/hash.c:237:(.text+0x...): undefined reference to `F512'
try.c: /usr/bin/x86_64-linux-gnu-ld.bfd: .../supercop-data/hertz/amd64/try/c/clang_-march=native_-O2_-fwrapv_-Qunused-arguments_-fPIC_-fPIE_-gdwarf-4_-Wall/timingleaks/crypto_hash/groestl256/opt64/work/hash.c:246:(.text+0x...): undefined reference to `F1024'
try.c: /usr/bin/x86_64-linux-gnu-ld.bfd: .../supercop-data/hertz/amd64/try/c/clang_-march=native_-O2_-fwrapv_-Qunused-arguments_-fPIC_-fPIE_-gdwarf-4_-Wall/timingleaks/crypto_hash/groestl256/opt64/work/hash.c:237:(.text+0x...): undefined reference to `F512'
try.c: /usr/bin/x86_64-linux-gnu-ld.bfd: .../supercop-data/hertz/amd64/try/c/clang_-march=native_-O2_-fwrapv_-Qunused-arguments_-fPIC_-fPIE_-gdwarf-4_-Wall/timingleaks/crypto_hash/groestl256/opt64/work/hash.c:246:(.text+0x...): undefined reference to `F1024'
try.c: /usr/bin/x86_64-linux-gnu-ld.bfd: .../supercop-data/hertz/amd64/try/c/clang_-march=native_-O2_-fwrapv_-Qunused-arguments_-fPIC_-fPIE_-gdwarf-4_-Wall/timingleaks/crypto_hash/groestl256/opt64/work/hash.c:237:(.text+0x...): undefined reference to `F512'
try.c: /usr/bin/x86_64-linux-gnu-ld.bfd: .../supercop-data/hertz/amd64/try/c/clang_-march=native_-O2_-fwrapv_-Qunused-arguments_-fPIC_-fPIE_-gdwarf-4_-Wall/timingleaks/crypto_hash/groestl256/opt64/work/hash.c:246:(.text+0x...): undefined reference to `F1024'
try.c: /usr/bin/x86_64-linux-gnu-ld.bfd: .../supercop-data/hertz/amd64/try/c/clang_-march=native_-O2_-fwrapv_-Qunused-arguments_-fPIC_-fPIE_-gdwarf-4_-Wall/timingleaks/crypto_hash/groestl256/opt64/work/hash.c:237:(.text+0x...): undefined reference to `F512'
try.c: /usr/bin/x86_64-linux-gnu-ld.bfd: .../supercop-data/hertz/amd64/try/c/clang_-march=native_-O2_-fwrapv_-Qunused-arguments_-fPIC_-fPIE_-gdwarf-4_-Wall/timingleaks/crypto_hash/groestl256/opt64/work/hash.c:246:(.text+0x...): undefined reference to `F1024'
try.c: clang: error: linker command failed with exit code 1 (use -v to see invocation)

Number of similar (implementation,compiler) pairs: 1, namely:
ImplementationCompiler
T:opt64clang -march=native -O2 -fwrapv -Qunused-arguments -fPIC -fPIE -gdwarf-4 -Wall (Ubuntu_Clang_21.1.8_(6ubuntu1))

Compiler output


hash.c: hash.c:182:9: warning: unknown pragma ignored [-Wunknown-pragmas]
hash.c:   182 | #pragma vector aligned
hash.c:       |         ^
hash.c: hash.c:219:9: warning: unknown pragma ignored [-Wunknown-pragmas]
hash.c:   219 | #pragma vector aligned
hash.c:       |         ^
hash.c: 2 warnings generated.
try.c: /usr/bin/x86_64-linux-gnu-ld.bfd: libcrypto_hash_groestl256.a(hash.o): in function `Transform':
try.c: .../supercop-data/hertz/amd64/try/c/clang_-march=native_-O3_-fwrapv_-Qunused-arguments_-fPIC_-fPIE_-gdwarf-4_-Wall/timingleaks/crypto_hash/groestl256/opt64/work/hash.c:237:(.text+0x...): undefined reference to `F512'
try.c: /usr/bin/x86_64-linux-gnu-ld.bfd: .../supercop-data/hertz/amd64/try/c/clang_-march=native_-O3_-fwrapv_-Qunused-arguments_-fPIC_-fPIE_-gdwarf-4_-Wall/timingleaks/crypto_hash/groestl256/opt64/work/hash.c:246:(.text+0x...): undefined reference to `F1024'
try.c: /usr/bin/x86_64-linux-gnu-ld.bfd: .../supercop-data/hertz/amd64/try/c/clang_-march=native_-O3_-fwrapv_-Qunused-arguments_-fPIC_-fPIE_-gdwarf-4_-Wall/timingleaks/crypto_hash/groestl256/opt64/work/hash.c:237:(.text+0x...): undefined reference to `F512'
try.c: /usr/bin/x86_64-linux-gnu-ld.bfd: .../supercop-data/hertz/amd64/try/c/clang_-march=native_-O3_-fwrapv_-Qunused-arguments_-fPIC_-fPIE_-gdwarf-4_-Wall/timingleaks/crypto_hash/groestl256/opt64/work/hash.c:246:(.text+0x...): undefined reference to `F1024'
try.c: /usr/bin/x86_64-linux-gnu-ld.bfd: .../supercop-data/hertz/amd64/try/c/clang_-march=native_-O3_-fwrapv_-Qunused-arguments_-fPIC_-fPIE_-gdwarf-4_-Wall/timingleaks/crypto_hash/groestl256/opt64/work/hash.c:237:(.text+0x...): undefined reference to `F512'
try.c: /usr/bin/x86_64-linux-gnu-ld.bfd: .../supercop-data/hertz/amd64/try/c/clang_-march=native_-O3_-fwrapv_-Qunused-arguments_-fPIC_-fPIE_-gdwarf-4_-Wall/timingleaks/crypto_hash/groestl256/opt64/work/hash.c:246:(.text+0x...): undefined reference to `F1024'
try.c: /usr/bin/x86_64-linux-gnu-ld.bfd: .../supercop-data/hertz/amd64/try/c/clang_-march=native_-O3_-fwrapv_-Qunused-arguments_-fPIC_-fPIE_-gdwarf-4_-Wall/timingleaks/crypto_hash/groestl256/opt64/work/hash.c:237:(.text+0x...): undefined reference to `F512'
try.c: /usr/bin/x86_64-linux-gnu-ld.bfd: .../supercop-data/hertz/amd64/try/c/clang_-march=native_-O3_-fwrapv_-Qunused-arguments_-fPIC_-fPIE_-gdwarf-4_-Wall/timingleaks/crypto_hash/groestl256/opt64/work/hash.c:246:(.text+0x...): undefined reference to `F1024'
try.c: /usr/bin/x86_64-linux-gnu-ld.bfd: .../supercop-data/hertz/amd64/try/c/clang_-march=native_-O3_-fwrapv_-Qunused-arguments_-fPIC_-fPIE_-gdwarf-4_-Wall/timingleaks/crypto_hash/groestl256/opt64/work/hash.c:237:(.text+0x...): undefined reference to `F512'
try.c: /usr/bin/x86_64-linux-gnu-ld.bfd: .../supercop-data/hertz/amd64/try/c/clang_-march=native_-O3_-fwrapv_-Qunused-arguments_-fPIC_-fPIE_-gdwarf-4_-Wall/timingleaks/crypto_hash/groestl256/opt64/work/hash.c:246:(.text+0x...): undefined reference to `F1024'
try.c: clang: error: linker command failed with exit code 1 (use -v to see invocation)

Number of similar (implementation,compiler) pairs: 1, namely:
ImplementationCompiler
T:opt64clang -march=native -O3 -fwrapv -Qunused-arguments -fPIC -fPIE -gdwarf-4 -Wall (Ubuntu_Clang_21.1.8_(6ubuntu1))

Compiler output


hash.c: hash.c:182:9: warning: unknown pragma ignored [-Wunknown-pragmas]
hash.c:   182 | #pragma vector aligned
hash.c:       |         ^
hash.c: hash.c:219:9: warning: unknown pragma ignored [-Wunknown-pragmas]
hash.c:   219 | #pragma vector aligned
hash.c:       |         ^
hash.c: 2 warnings generated.
try.c: /usr/bin/x86_64-linux-gnu-ld.bfd: libcrypto_hash_groestl256.a(hash.o): in function `Transform':
try.c: .../supercop-data/hertz/amd64/try/c/clang_-march=native_-O_-fwrapv_-Qunused-arguments_-fPIC_-fPIE_-gdwarf-4_-Wall/timingleaks/crypto_hash/groestl256/opt64/work/hash.c:237:(.text+0x...): undefined reference to `F512'
try.c: /usr/bin/x86_64-linux-gnu-ld.bfd: .../supercop-data/hertz/amd64/try/c/clang_-march=native_-O_-fwrapv_-Qunused-arguments_-fPIC_-fPIE_-gdwarf-4_-Wall/timingleaks/crypto_hash/groestl256/opt64/work/hash.c:246:(.text+0x...): undefined reference to `F1024'
try.c: /usr/bin/x86_64-linux-gnu-ld.bfd: .../supercop-data/hertz/amd64/try/c/clang_-march=native_-O_-fwrapv_-Qunused-arguments_-fPIC_-fPIE_-gdwarf-4_-Wall/timingleaks/crypto_hash/groestl256/opt64/work/hash.c:237:(.text+0x...): undefined reference to `F512'
try.c: /usr/bin/x86_64-linux-gnu-ld.bfd: .../supercop-data/hertz/amd64/try/c/clang_-march=native_-O_-fwrapv_-Qunused-arguments_-fPIC_-fPIE_-gdwarf-4_-Wall/timingleaks/crypto_hash/groestl256/opt64/work/hash.c:246:(.text+0x...): undefined reference to `F1024'
try.c: /usr/bin/x86_64-linux-gnu-ld.bfd: .../supercop-data/hertz/amd64/try/c/clang_-march=native_-O_-fwrapv_-Qunused-arguments_-fPIC_-fPIE_-gdwarf-4_-Wall/timingleaks/crypto_hash/groestl256/opt64/work/hash.c:237:(.text+0x...): undefined reference to `F512'
try.c: /usr/bin/x86_64-linux-gnu-ld.bfd: .../supercop-data/hertz/amd64/try/c/clang_-march=native_-O_-fwrapv_-Qunused-arguments_-fPIC_-fPIE_-gdwarf-4_-Wall/timingleaks/crypto_hash/groestl256/opt64/work/hash.c:246:(.text+0x...): undefined reference to `F1024'
try.c: /usr/bin/x86_64-linux-gnu-ld.bfd: .../supercop-data/hertz/amd64/try/c/clang_-march=native_-O_-fwrapv_-Qunused-arguments_-fPIC_-fPIE_-gdwarf-4_-Wall/timingleaks/crypto_hash/groestl256/opt64/work/hash.c:237:(.text+0x...): undefined reference to `F512'
try.c: /usr/bin/x86_64-linux-gnu-ld.bfd: .../supercop-data/hertz/amd64/try/c/clang_-march=native_-O_-fwrapv_-Qunused-arguments_-fPIC_-fPIE_-gdwarf-4_-Wall/timingleaks/crypto_hash/groestl256/opt64/work/hash.c:246:(.text+0x...): undefined reference to `F1024'
try.c: /usr/bin/x86_64-linux-gnu-ld.bfd: .../supercop-data/hertz/amd64/try/c/clang_-march=native_-O_-fwrapv_-Qunused-arguments_-fPIC_-fPIE_-gdwarf-4_-Wall/timingleaks/crypto_hash/groestl256/opt64/work/hash.c:237:(.text+0x...): undefined reference to `F512'
try.c: /usr/bin/x86_64-linux-gnu-ld.bfd: .../supercop-data/hertz/amd64/try/c/clang_-march=native_-O_-fwrapv_-Qunused-arguments_-fPIC_-fPIE_-gdwarf-4_-Wall/timingleaks/crypto_hash/groestl256/opt64/work/hash.c:246:(.text+0x...): undefined reference to `F1024'
try.c: clang: error: linker command failed with exit code 1 (use -v to see invocation)

Number of similar (implementation,compiler) pairs: 1, namely:
ImplementationCompiler
T:opt64clang -march=native -O -fwrapv -Qunused-arguments -fPIC -fPIE -gdwarf-4 -Wall (Ubuntu_Clang_21.1.8_(6ubuntu1))

Compiler output


hash.c: hash.c:182:9: warning: unknown pragma ignored [-Wunknown-pragmas]
hash.c:   182 | #pragma vector aligned
hash.c:       |         ^
hash.c: hash.c:219:9: warning: unknown pragma ignored [-Wunknown-pragmas]
hash.c:   219 | #pragma vector aligned
hash.c:       |         ^
hash.c: 2 warnings generated.
try.c: /usr/bin/x86_64-linux-gnu-ld.bfd: libcrypto_hash_groestl256.a(hash.o): in function `Transform':
try.c: .../supercop-data/hertz/amd64/try/c/clang_-march=native_-Os_-fwrapv_-Qunused-arguments_-fPIC_-fPIE_-gdwarf-4_-Wall/timingleaks/crypto_hash/groestl256/opt64/work/hash.c:237:(.text+0x...): undefined reference to `F512'
try.c: /usr/bin/x86_64-linux-gnu-ld.bfd: .../supercop-data/hertz/amd64/try/c/clang_-march=native_-Os_-fwrapv_-Qunused-arguments_-fPIC_-fPIE_-gdwarf-4_-Wall/timingleaks/crypto_hash/groestl256/opt64/work/hash.c:246:(.text+0x...): undefined reference to `F1024'
try.c: clang: error: linker command failed with exit code 1 (use -v to see invocation)

Number of similar (implementation,compiler) pairs: 1, namely:
ImplementationCompiler
T:opt64clang -march=native -Os -fwrapv -Qunused-arguments -fPIC -fPIE -gdwarf-4 -Wall (Ubuntu_Clang_21.1.8_(6ubuntu1))

Compiler output


hash.c: hash.c: In function 'F512':
hash.c: hash.c:182: warning: ignoring '#pragma vector aligned' [-Wunknown-pragmas]
hash.c:   182 | #pragma vector aligned
hash.c: hash.c: In function 'F1024':
hash.c: hash.c:219: warning: ignoring '#pragma vector aligned' [-Wunknown-pragmas]
hash.c:   219 | #pragma vector aligned
try.c: /usr/bin/x86_64-linux-gnu-ld.bfd: libcrypto_hash_groestl256.a(hash.o): in function `Transform':
try.c: .../supercop-data/hertz/amd64/try/c/gcc_-march=native_-mtune=native_-O2_-fwrapv_-fPIC_-fPIE_-gdwarf-4_-Wall/timingleaks/crypto_hash/groestl256/opt64/work/hash.c:246:(.text+0x...): undefined reference to `F1024'
try.c: /usr/bin/x86_64-linux-gnu-ld.bfd: .../supercop-data/hertz/amd64/try/c/gcc_-march=native_-mtune=native_-O2_-fwrapv_-fPIC_-fPIE_-gdwarf-4_-Wall/timingleaks/crypto_hash/groestl256/opt64/work/hash.c:237:(.text+0x...): undefined reference to `F512'
try.c: collect2: error: ld returned 1 exit status

Number of similar (implementation,compiler) pairs: 1, namely:
ImplementationCompiler
T:opt64gcc -march=native -mtune=native -O2 -fwrapv -fPIC -fPIE -gdwarf-4 -Wall (15.2.0)

Compiler output


hash.c: hash.c: In function 'F512':
hash.c: hash.c:182: warning: ignoring '#pragma vector aligned' [-Wunknown-pragmas]
hash.c:   182 | #pragma vector aligned
hash.c: hash.c: In function 'F1024':
hash.c: hash.c:219: warning: ignoring '#pragma vector aligned' [-Wunknown-pragmas]
hash.c:   219 | #pragma vector aligned
try.c: /usr/bin/x86_64-linux-gnu-ld.bfd: libcrypto_hash_groestl256.a(hash.o): in function `Transform':
try.c: .../supercop-data/hertz/amd64/try/c/gcc_-march=native_-mtune=native_-O3_-fwrapv_-fPIC_-fPIE_-gdwarf-4_-Wall/timingleaks/crypto_hash/groestl256/opt64/work/hash.c:246:(.text+0x...): undefined reference to `F1024'
try.c: /usr/bin/x86_64-linux-gnu-ld.bfd: .../supercop-data/hertz/amd64/try/c/gcc_-march=native_-mtune=native_-O3_-fwrapv_-fPIC_-fPIE_-gdwarf-4_-Wall/timingleaks/crypto_hash/groestl256/opt64/work/hash.c:237:(.text+0x...): undefined reference to `F512'
try.c: /usr/bin/x86_64-linux-gnu-ld.bfd: .../supercop-data/hertz/amd64/try/c/gcc_-march=native_-mtune=native_-O3_-fwrapv_-fPIC_-fPIE_-gdwarf-4_-Wall/timingleaks/crypto_hash/groestl256/opt64/work/hash.c:246:(.text+0x...): undefined reference to `F1024'
try.c: /usr/bin/x86_64-linux-gnu-ld.bfd: .../supercop-data/hertz/amd64/try/c/gcc_-march=native_-mtune=native_-O3_-fwrapv_-fPIC_-fPIE_-gdwarf-4_-Wall/timingleaks/crypto_hash/groestl256/opt64/work/hash.c:237:(.text+0x...): undefined reference to `F512'
try.c: /usr/bin/x86_64-linux-gnu-ld.bfd: .../supercop-data/hertz/amd64/try/c/gcc_-march=native_-mtune=native_-O3_-fwrapv_-fPIC_-fPIE_-gdwarf-4_-Wall/timingleaks/crypto_hash/groestl256/opt64/work/hash.c:246:(.text+0x...): undefined reference to `F1024'
try.c: /usr/bin/x86_64-linux-gnu-ld.bfd: .../supercop-data/hertz/amd64/try/c/gcc_-march=native_-mtune=native_-O3_-fwrapv_-fPIC_-fPIE_-gdwarf-4_-Wall/timingleaks/crypto_hash/groestl256/opt64/work/hash.c:237:(.text+0x...): undefined reference to `F512'
try.c: /usr/bin/x86_64-linux-gnu-ld.bfd: .../supercop-data/hertz/amd64/try/c/gcc_-march=native_-mtune=native_-O3_-fwrapv_-fPIC_-fPIE_-gdwarf-4_-Wall/timingleaks/crypto_hash/groestl256/opt64/work/hash.c:246:(.text+0x...): undefined reference to `F1024'
try.c: /usr/bin/x86_64-linux-gnu-ld.bfd: .../supercop-data/hertz/amd64/try/c/gcc_-march=native_-mtune=native_-O3_-fwrapv_-fPIC_-fPIE_-gdwarf-4_-Wall/timingleaks/crypto_hash/groestl256/opt64/work/hash.c:246:(.text+0x...): undefined reference to `F1024'
try.c: /usr/bin/x86_64-linux-gnu-ld.bfd: .../supercop-data/hertz/amd64/try/c/gcc_-march=native_-mtune=native_-O3_-fwrapv_-fPIC_-fPIE_-gdwarf-4_-Wall/timingleaks/crypto_hash/groestl256/opt64/work/hash.c:237:(.text+0x...): undefined reference to `F512'
try.c: /usr/bin/x86_64-linux-gnu-ld.bfd: .../supercop-data/hertz/amd64/try/c/gcc_-march=native_-mtune=native_-O3_-fwrapv_-fPIC_-fPIE_-gdwarf-4_-Wall/timingleaks/crypto_hash/groestl256/opt64/work/hash.c:237:(.text+0x...): undefined reference to `F512'
try.c: /usr/bin/x86_64-linux-gnu-ld.bfd: .../supercop-data/hertz/amd64/try/c/gcc_-march=native_-mtune=native_-O3_-fwrapv_-fPIC_-fPIE_-gdwarf-4_-Wall/timingleaks/crypto_hash/groestl256/opt64/work/hash.c:237:(.text+0x...): undefined reference to `F512'
try.c: /usr/bin/x86_64-linux-gnu-ld.bfd: .../supercop-data/hertz/amd64/try/c/gcc_-march=native_-mtune=native_-O3_-fwrapv_-fPIC_-fPIE_-gdwarf-4_-Wall/timingleaks/crypto_hash/groestl256/opt64/work/hash.c:246:(.text+0x...): undefined reference to `F1024'
try.c: /usr/bin/x86_64-linux-gnu-ld.bfd: .../supercop-data/hertz/amd64/try/c/gcc_-march=native_-mtune=native_-O3_-fwrapv_-fPIC_-fPIE_-gdwarf-4_-Wall/timingleaks/crypto_hash/groestl256/opt64/work/hash.c:237:(.text+0x...): undefined reference to `F512'
try.c: /usr/bin/x86_64-linux-gnu-ld.bfd: .../supercop-data/hertz/amd64/try/c/gcc_-march=native_-mtune=native_-O3_-fwrapv_-fPIC_-fPIE_-gdwarf-4_-Wall/timingleaks/crypto_hash/groestl256/opt64/work/hash.c:237:(.text+0x...): undefined reference to `F512'
try.c: /usr/bin/x86_64-linux-gnu-ld.bfd: .../supercop-data/hertz/amd64/try/c/gcc_-march=native_-mtune=native_-O3_-fwrapv_-fPIC_-fPIE_-gdwarf-4_-Wall/timingleaks/crypto_hash/groestl256/opt64/work/hash.c:237:(.text+0x...): undefined reference to `F512'
try.c: collect2: error: ld returned 1 exit status

Number of similar (implementation,compiler) pairs: 1, namely:
ImplementationCompiler
T:opt64gcc -march=native -mtune=native -O3 -fwrapv -fPIC -fPIE -gdwarf-4 -Wall (15.2.0)

Compiler output


hash.c: hash.c: In function 'F512':
hash.c: hash.c:182: warning: ignoring '#pragma vector aligned' [-Wunknown-pragmas]
hash.c:   182 | #pragma vector aligned
hash.c: hash.c: In function 'F1024':
hash.c: hash.c:219: warning: ignoring '#pragma vector aligned' [-Wunknown-pragmas]
hash.c:   219 | #pragma vector aligned
try.c: /usr/bin/x86_64-linux-gnu-ld.bfd: libcrypto_hash_groestl256.a(hash.o): in function `Transform':
try.c: .../supercop-data/hertz/amd64/try/c/gcc_-march=native_-mtune=native_-O_-fwrapv_-fPIC_-fPIE_-gdwarf-4_-Wall/timingleaks/crypto_hash/groestl256/opt64/work/hash.c:246:(.text+0x...): undefined reference to `F1024'
try.c: /usr/bin/x86_64-linux-gnu-ld.bfd: .../supercop-data/hertz/amd64/try/c/gcc_-march=native_-mtune=native_-O_-fwrapv_-fPIC_-fPIE_-gdwarf-4_-Wall/timingleaks/crypto_hash/groestl256/opt64/work/hash.c:237:(.text+0x...): undefined reference to `F512'
try.c: collect2: error: ld returned 1 exit status

Number of similar (implementation,compiler) pairs: 1, namely:
ImplementationCompiler
T:opt64gcc -march=native -mtune=native -O -fwrapv -fPIC -fPIE -gdwarf-4 -Wall (15.2.0)

Compiler output


hash.c: hash.c: In function 'F512':
hash.c: hash.c:182: warning: ignoring '#pragma vector aligned' [-Wunknown-pragmas]
hash.c:   182 | #pragma vector aligned
hash.c: hash.c: In function 'F1024':
hash.c: hash.c:219: warning: ignoring '#pragma vector aligned' [-Wunknown-pragmas]
hash.c:   219 | #pragma vector aligned
try.c: /usr/bin/x86_64-linux-gnu-ld.bfd: libcrypto_hash_groestl256.a(hash.o): in function `Transform':
try.c: .../supercop-data/hertz/amd64/try/c/gcc_-march=native_-mtune=native_-Os_-fwrapv_-fPIC_-fPIE_-gdwarf-4_-Wall/timingleaks/crypto_hash/groestl256/opt64/work/hash.c:237:(.text+0x...): undefined reference to `F512'
try.c: /usr/bin/x86_64-linux-gnu-ld.bfd: .../supercop-data/hertz/amd64/try/c/gcc_-march=native_-mtune=native_-Os_-fwrapv_-fPIC_-fPIE_-gdwarf-4_-Wall/timingleaks/crypto_hash/groestl256/opt64/work/hash.c:246:(.text+0x...): undefined reference to `F1024'
try.c: collect2: error: ld returned 1 exit status

Number of similar (implementation,compiler) pairs: 1, namely:
ImplementationCompiler
T:opt64gcc -march=native -mtune=native -Os -fwrapv -fPIC -fPIE -gdwarf-4 -Wall (15.2.0)

Compiler output


try.c: /usr/bin/x86_64-linux-gnu-ld.bfd: libcrypto_hash_groestl256.a(hash.o): in function `Transform':
try.c: .../supercop-data/hertz/amd64/try/c/gcc_-march=native_-mtune=native_-O2_-fwrapv_-fPIC_-fPIE_-gdwarf-4_-Wall/timingleaks/crypto_hash/groestl256/opteron/work/hash.c:36:(.text+0x...): undefined reference to `Q512ASM'
try.c: /usr/bin/x86_64-linux-gnu-ld.bfd: .../supercop-data/hertz/amd64/try/c/gcc_-march=native_-mtune=native_-O2_-fwrapv_-fPIC_-fPIE_-gdwarf-4_-Wall/timingleaks/crypto_hash/groestl256/opteron/work/hash.c:37:(.text+0x...): undefined reference to `P512ASM'
try.c: /usr/bin/x86_64-linux-gnu-ld.bfd: libcrypto_hash_groestl256.a(hash.o): in function `OutputTransformation':
try.c: .../supercop-data/hertz/amd64/try/c/gcc_-march=native_-mtune=native_-O2_-fwrapv_-fPIC_-fPIE_-gdwarf-4_-Wall/timingleaks/crypto_hash/groestl256/opteron/work/hash.c:56:(.text+0x...): undefined reference to `P512ASM'
try.c: collect2: error: ld returned 1 exit status

Number of similar (implementation,compiler) pairs: 1, namely:
ImplementationCompiler
T:opterongcc -march=native -mtune=native -O2 -fwrapv -fPIC -fPIE -gdwarf-4 -Wall (15.2.0)

Compiler output


try.c: /usr/bin/x86_64-linux-gnu-ld.bfd: libcrypto_hash_groestl256.a(hash.o): relocation R_X86_64_32S against symbol `T0' can not be used when making a PIE object; recompile with -fPIE
try.c: /usr/bin/x86_64-linux-gnu-ld.bfd: failed to set dynamic section sizes: bad value
try.c: collect2: error: ld returned 1 exit status

Number of similar (implementation,compiler) pairs: 1, namely:
ImplementationCompiler
T:opterongcc -march=native -mtune=native -O3 -fwrapv -fPIC -fPIE -gdwarf-4 -Wall (15.2.0)

Compiler output


try.c: /usr/bin/x86_64-linux-gnu-ld.bfd: libcrypto_hash_groestl256.a(hash.o): in function `Transform':
try.c: .../supercop-data/hertz/amd64/try/c/gcc_-march=native_-mtune=native_-O_-fwrapv_-fPIC_-fPIE_-gdwarf-4_-Wall/timingleaks/crypto_hash/groestl256/opteron/work/hash.c:36:(.text+0x...): undefined reference to `Q512ASM'
try.c: /usr/bin/x86_64-linux-gnu-ld.bfd: .../supercop-data/hertz/amd64/try/c/gcc_-march=native_-mtune=native_-O_-fwrapv_-fPIC_-fPIE_-gdwarf-4_-Wall/timingleaks/crypto_hash/groestl256/opteron/work/hash.c:37:(.text+0x...): undefined reference to `P512ASM'
try.c: /usr/bin/x86_64-linux-gnu-ld.bfd: libcrypto_hash_groestl256.a(hash.o): in function `OutputTransformation':
try.c: .../supercop-data/hertz/amd64/try/c/gcc_-march=native_-mtune=native_-O_-fwrapv_-fPIC_-fPIE_-gdwarf-4_-Wall/timingleaks/crypto_hash/groestl256/opteron/work/hash.c:56:(.text+0x...): undefined reference to `P512ASM'
try.c: collect2: error: ld returned 1 exit status

Number of similar (implementation,compiler) pairs: 1, namely:
ImplementationCompiler
T:opterongcc -march=native -mtune=native -O -fwrapv -fPIC -fPIE -gdwarf-4 -Wall (15.2.0)

Compiler output


try.c: /usr/bin/x86_64-linux-gnu-ld.bfd: libcrypto_hash_groestl256.a(hash.o): in function `Transform':
try.c: .../supercop-data/hertz/amd64/try/c/gcc_-march=native_-mtune=native_-Os_-fwrapv_-fPIC_-fPIE_-gdwarf-4_-Wall/timingleaks/crypto_hash/groestl256/opteron/work/hash.c:36:(.text+0x...): undefined reference to `Q512ASM'
try.c: /usr/bin/x86_64-linux-gnu-ld.bfd: .../supercop-data/hertz/amd64/try/c/gcc_-march=native_-mtune=native_-Os_-fwrapv_-fPIC_-fPIE_-gdwarf-4_-Wall/timingleaks/crypto_hash/groestl256/opteron/work/hash.c:37:(.text+0x...): undefined reference to `P512ASM'
try.c: /usr/bin/x86_64-linux-gnu-ld.bfd: libcrypto_hash_groestl256.a(hash.o): in function `OutputTransformation':
try.c: .../supercop-data/hertz/amd64/try/c/gcc_-march=native_-mtune=native_-Os_-fwrapv_-fPIC_-fPIE_-gdwarf-4_-Wall/timingleaks/crypto_hash/groestl256/opteron/work/hash.c:56:(.text+0x...): undefined reference to `P512ASM'
try.c: collect2: error: ld returned 1 exit status

Number of similar (implementation,compiler) pairs: 1, namely:
ImplementationCompiler
T:opterongcc -march=native -mtune=native -Os -fwrapv -fPIC -fPIE -gdwarf-4 -Wall (15.2.0)

Compiler output


try.c: /usr/bin/x86_64-linux-gnu-ld.bfd: libcrypto_hash_groestl256.a(hash.o): in function `Transform':
try.c: .../supercop-data/hertz/amd64/try/c/gcc_-march=native_-mtune=native_-O2_-fwrapv_-fPIC_-fPIE_-gdwarf-4_-Wall/timingleaks/crypto_hash/groestl256/opteron-unrolled/work/hash.c:36:(.text+0x...): undefined reference to `Q512ASM'
try.c: /usr/bin/x86_64-linux-gnu-ld.bfd: .../supercop-data/hertz/amd64/try/c/gcc_-march=native_-mtune=native_-O2_-fwrapv_-fPIC_-fPIE_-gdwarf-4_-Wall/timingleaks/crypto_hash/groestl256/opteron-unrolled/work/hash.c:37:(.text+0x...): undefined reference to `P512ASM'
try.c: /usr/bin/x86_64-linux-gnu-ld.bfd: libcrypto_hash_groestl256.a(hash.o): in function `OutputTransformation':
try.c: .../supercop-data/hertz/amd64/try/c/gcc_-march=native_-mtune=native_-O2_-fwrapv_-fPIC_-fPIE_-gdwarf-4_-Wall/timingleaks/crypto_hash/groestl256/opteron-unrolled/work/hash.c:56:(.text+0x...): undefined reference to `P512ASM'
try.c: collect2: error: ld returned 1 exit status

Number of similar (implementation,compiler) pairs: 1, namely:
ImplementationCompiler
T:opteron-unrolledgcc -march=native -mtune=native -O2 -fwrapv -fPIC -fPIE -gdwarf-4 -Wall (15.2.0)

Compiler output


try.c: /usr/bin/x86_64-linux-gnu-ld.bfd: libcrypto_hash_groestl256.a(hash.o): in function `Transform':
try.c: .../supercop-data/hertz/amd64/try/c/gcc_-march=native_-mtune=native_-O3_-fwrapv_-fPIC_-fPIE_-gdwarf-4_-Wall/timingleaks/crypto_hash/groestl256/opteron-unrolled/work/hash.c:36:(.text+0x...): undefined reference to `Q512ASM'
try.c: /usr/bin/x86_64-linux-gnu-ld.bfd: .../supercop-data/hertz/amd64/try/c/gcc_-march=native_-mtune=native_-O3_-fwrapv_-fPIC_-fPIE_-gdwarf-4_-Wall/timingleaks/crypto_hash/groestl256/opteron-unrolled/work/hash.c:37:(.text+0x...): undefined reference to `P512ASM'
try.c: /usr/bin/x86_64-linux-gnu-ld.bfd: .../supercop-data/hertz/amd64/try/c/gcc_-march=native_-mtune=native_-O3_-fwrapv_-fPIC_-fPIE_-gdwarf-4_-Wall/timingleaks/crypto_hash/groestl256/opteron-unrolled/work/hash.c:36:(.text+0x...): undefined reference to `Q512ASM'
try.c: /usr/bin/x86_64-linux-gnu-ld.bfd: .../supercop-data/hertz/amd64/try/c/gcc_-march=native_-mtune=native_-O3_-fwrapv_-fPIC_-fPIE_-gdwarf-4_-Wall/timingleaks/crypto_hash/groestl256/opteron-unrolled/work/hash.c:37:(.text+0x...): undefined reference to `P512ASM'
try.c: /usr/bin/x86_64-linux-gnu-ld.bfd: libcrypto_hash_groestl256.a(hash.o): in function `OutputTransformation':
try.c: .../supercop-data/hertz/amd64/try/c/gcc_-march=native_-mtune=native_-O3_-fwrapv_-fPIC_-fPIE_-gdwarf-4_-Wall/timingleaks/crypto_hash/groestl256/opteron-unrolled/work/hash.c:56:(.text+0x...): undefined reference to `P512ASM'
try.c: /usr/bin/x86_64-linux-gnu-ld.bfd: .../supercop-data/hertz/amd64/try/c/gcc_-march=native_-mtune=native_-O3_-fwrapv_-fPIC_-fPIE_-gdwarf-4_-Wall/timingleaks/crypto_hash/groestl256/opteron-unrolled/work/hash.c:56:(.text+0x...): undefined reference to `P512ASM'
try.c: /usr/bin/x86_64-linux-gnu-ld.bfd: .../supercop-data/hertz/amd64/try/c/gcc_-march=native_-mtune=native_-O3_-fwrapv_-fPIC_-fPIE_-gdwarf-4_-Wall/timingleaks/crypto_hash/groestl256/opteron-unrolled/work/hash.c:56:(.text+0x...): undefined reference to `P512ASM'
try.c: collect2: error: ld returned 1 exit status

Number of similar (implementation,compiler) pairs: 1, namely:
ImplementationCompiler
T:opteron-unrolledgcc -march=native -mtune=native -O3 -fwrapv -fPIC -fPIE -gdwarf-4 -Wall (15.2.0)

Compiler output


try.c: /usr/bin/x86_64-linux-gnu-ld.bfd: libcrypto_hash_groestl256.a(hash.o): in function `Transform':
try.c: .../supercop-data/hertz/amd64/try/c/gcc_-march=native_-mtune=native_-O_-fwrapv_-fPIC_-fPIE_-gdwarf-4_-Wall/timingleaks/crypto_hash/groestl256/opteron-unrolled/work/hash.c:36:(.text+0x...): undefined reference to `Q512ASM'
try.c: /usr/bin/x86_64-linux-gnu-ld.bfd: .../supercop-data/hertz/amd64/try/c/gcc_-march=native_-mtune=native_-O_-fwrapv_-fPIC_-fPIE_-gdwarf-4_-Wall/timingleaks/crypto_hash/groestl256/opteron-unrolled/work/hash.c:37:(.text+0x...): undefined reference to `P512ASM'
try.c: /usr/bin/x86_64-linux-gnu-ld.bfd: libcrypto_hash_groestl256.a(hash.o): in function `OutputTransformation':
try.c: .../supercop-data/hertz/amd64/try/c/gcc_-march=native_-mtune=native_-O_-fwrapv_-fPIC_-fPIE_-gdwarf-4_-Wall/timingleaks/crypto_hash/groestl256/opteron-unrolled/work/hash.c:56:(.text+0x...): undefined reference to `P512ASM'
try.c: collect2: error: ld returned 1 exit status

Number of similar (implementation,compiler) pairs: 1, namely:
ImplementationCompiler
T:opteron-unrolledgcc -march=native -mtune=native -O -fwrapv -fPIC -fPIE -gdwarf-4 -Wall (15.2.0)

Compiler output


try.c: /usr/bin/x86_64-linux-gnu-ld.bfd: libcrypto_hash_groestl256.a(hash.o): in function `Transform':
try.c: .../supercop-data/hertz/amd64/try/c/gcc_-march=native_-mtune=native_-Os_-fwrapv_-fPIC_-fPIE_-gdwarf-4_-Wall/timingleaks/crypto_hash/groestl256/opteron-unrolled/work/hash.c:36:(.text+0x...): undefined reference to `Q512ASM'
try.c: /usr/bin/x86_64-linux-gnu-ld.bfd: .../supercop-data/hertz/amd64/try/c/gcc_-march=native_-mtune=native_-Os_-fwrapv_-fPIC_-fPIE_-gdwarf-4_-Wall/timingleaks/crypto_hash/groestl256/opteron-unrolled/work/hash.c:37:(.text+0x...): undefined reference to `P512ASM'
try.c: /usr/bin/x86_64-linux-gnu-ld.bfd: libcrypto_hash_groestl256.a(hash.o): in function `OutputTransformation':
try.c: .../supercop-data/hertz/amd64/try/c/gcc_-march=native_-mtune=native_-Os_-fwrapv_-fPIC_-fPIE_-gdwarf-4_-Wall/timingleaks/crypto_hash/groestl256/opteron-unrolled/work/hash.c:56:(.text+0x...): undefined reference to `P512ASM'
try.c: collect2: error: ld returned 1 exit status

Number of similar (implementation,compiler) pairs: 1, namely:
ImplementationCompiler
T:opteron-unrolledgcc -march=native -mtune=native -Os -fwrapv -fPIC -fPIE -gdwarf-4 -Wall (15.2.0)

Compiler output


groestl.c: groestl.c:2812:17: warning: variable 'buf' set but not used [-Wunused-but-set-variable]
groestl.c:  2812 |         unsigned char *buf;
groestl.c:       |                        ^
groestl.c: groestl.c:2948:17: warning: variable 'buf' set but not used [-Wunused-but-set-variable]
groestl.c:  2948 |         unsigned char *buf;
groestl.c:       |                        ^
groestl.c: 2 warnings generated.

Number of similar (implementation,compiler) pairs: 8, namely:
ImplementationCompiler
T:sphlibclang -march=native -O2 -fwrapv -Qunused-arguments -fPIC -fPIE -gdwarf-4 -Wall (Ubuntu_Clang_21.1.8_(6ubuntu1))
T:sphlibclang -march=native -O3 -fwrapv -Qunused-arguments -fPIC -fPIE -gdwarf-4 -Wall (Ubuntu_Clang_21.1.8_(6ubuntu1))
T:sphlibclang -march=native -O -fwrapv -Qunused-arguments -fPIC -fPIE -gdwarf-4 -Wall (Ubuntu_Clang_21.1.8_(6ubuntu1))
T:sphlibclang -march=native -Os -fwrapv -Qunused-arguments -fPIC -fPIE -gdwarf-4 -Wall (Ubuntu_Clang_21.1.8_(6ubuntu1))
T:sphlib-smallclang -march=native -O2 -fwrapv -Qunused-arguments -fPIC -fPIE -gdwarf-4 -Wall (Ubuntu_Clang_21.1.8_(6ubuntu1))
T:sphlib-smallclang -march=native -O3 -fwrapv -Qunused-arguments -fPIC -fPIE -gdwarf-4 -Wall (Ubuntu_Clang_21.1.8_(6ubuntu1))
T:sphlib-smallclang -march=native -O -fwrapv -Qunused-arguments -fPIC -fPIE -gdwarf-4 -Wall (Ubuntu_Clang_21.1.8_(6ubuntu1))
T:sphlib-smallclang -march=native -Os -fwrapv -Qunused-arguments -fPIC -fPIE -gdwarf-4 -Wall (Ubuntu_Clang_21.1.8_(6ubuntu1))

Compiler output


groestl.c: groestl.c: In function 'groestl_small_close':
groestl.c: groestl.c:2812:24: warning: variable 'buf' set but not used [-Wunused-but-set-variable]
groestl.c:  2812 |         unsigned char *buf;
groestl.c:       |                        ^~~
groestl.c: groestl.c: In function 'groestl_big_close':
groestl.c: groestl.c:2948:24: warning: variable 'buf' set but not used [-Wunused-but-set-variable]
groestl.c:  2948 |         unsigned char *buf;
groestl.c:       |                        ^~~

Number of similar (implementation,compiler) pairs: 8, namely:
ImplementationCompiler
T:sphlibgcc -march=native -mtune=native -O2 -fwrapv -fPIC -fPIE -gdwarf-4 -Wall (15.2.0)
T:sphlibgcc -march=native -mtune=native -O3 -fwrapv -fPIC -fPIE -gdwarf-4 -Wall (15.2.0)
T:sphlibgcc -march=native -mtune=native -O -fwrapv -fPIC -fPIE -gdwarf-4 -Wall (15.2.0)
T:sphlibgcc -march=native -mtune=native -Os -fwrapv -fPIC -fPIE -gdwarf-4 -Wall (15.2.0)
T:sphlib-smallgcc -march=native -mtune=native -O2 -fwrapv -fPIC -fPIE -gdwarf-4 -Wall (15.2.0)
T:sphlib-smallgcc -march=native -mtune=native -O3 -fwrapv -fPIC -fPIE -gdwarf-4 -Wall (15.2.0)
T:sphlib-smallgcc -march=native -mtune=native -O -fwrapv -fPIC -fPIE -gdwarf-4 -Wall (15.2.0)
T:sphlib-smallgcc -march=native -mtune=native -Os -fwrapv -fPIC -fPIE -gdwarf-4 -Wall (15.2.0)

Compiler output


groestl.c: groestl.c:2742:18: warning: variable 'buf' set but not used [-Wunused-but-set-variable]
groestl.c:  2742 |   unsigned char *buf;
groestl.c:       |                  ^
groestl.c: groestl.c:2878:18: warning: variable 'buf' set but not used [-Wunused-but-set-variable]
groestl.c:  2878 |   unsigned char *buf;
groestl.c:       |                  ^
groestl.c: 2 warnings generated.

Number of similar (implementation,compiler) pairs: 4, namely:
ImplementationCompiler
T:sphlib-adaptedclang -march=native -O2 -fwrapv -Qunused-arguments -fPIC -fPIE -gdwarf-4 -Wall (Ubuntu_Clang_21.1.8_(6ubuntu1))
T:sphlib-adaptedclang -march=native -O3 -fwrapv -Qunused-arguments -fPIC -fPIE -gdwarf-4 -Wall (Ubuntu_Clang_21.1.8_(6ubuntu1))
T:sphlib-adaptedclang -march=native -O -fwrapv -Qunused-arguments -fPIC -fPIE -gdwarf-4 -Wall (Ubuntu_Clang_21.1.8_(6ubuntu1))
T:sphlib-adaptedclang -march=native -Os -fwrapv -Qunused-arguments -fPIC -fPIE -gdwarf-4 -Wall (Ubuntu_Clang_21.1.8_(6ubuntu1))

Compiler output


groestl.c: groestl.c: In function 'groestl_small_close':
groestl.c: groestl.c:2742:18: warning: variable 'buf' set but not used [-Wunused-but-set-variable]
groestl.c:  2742 |   unsigned char *buf;
groestl.c:       |                  ^~~
groestl.c: groestl.c: In function 'groestl_big_close':
groestl.c: groestl.c:2878:18: warning: variable 'buf' set but not used [-Wunused-but-set-variable]
groestl.c:  2878 |   unsigned char *buf;
groestl.c:       |                  ^~~

Number of similar (implementation,compiler) pairs: 4, namely:
ImplementationCompiler
T:sphlib-adaptedgcc -march=native -mtune=native -O2 -fwrapv -fPIC -fPIE -gdwarf-4 -Wall (15.2.0)
T:sphlib-adaptedgcc -march=native -mtune=native -O3 -fwrapv -fPIC -fPIE -gdwarf-4 -Wall (15.2.0)
T:sphlib-adaptedgcc -march=native -mtune=native -O -fwrapv -fPIC -fPIE -gdwarf-4 -Wall (15.2.0)
T:sphlib-adaptedgcc -march=native -mtune=native -Os -fwrapv -fPIC -fPIE -gdwarf-4 -Wall (15.2.0)

Compiler output


hash.c: hash.c:104:12: warning: comparison of array 'ctx->chaining' equal to a null pointer is always false [-Wtautological-pointer-compare]
hash.c:   104 |   if (ctx->chaining == NULL || ctx->buffer == NULL)
hash.c:       |       ~~~~~^~~~~~~~    ~~~~
hash.c: hash.c:104:37: warning: comparison of array 'ctx->buffer' equal to a null pointer is always false [-Wtautological-pointer-compare]
hash.c:   104 |   if (ctx->chaining == NULL || ctx->buffer == NULL)
hash.c:       |                                ~~~~~^~~~~~    ~~~~
hash.c: In file included from hash.c:19:
hash.c: ./groestl-asm-vperm.h:705:3: error: invalid operand for instruction
hash.c:   705 |   VPERM_Transform_RoundConst();
hash.c:       |   ^
hash.c: ./groestl-asm-vperm.h:685:8: note: expanded from macro 'VPERM_Transform_RoundConst'
hash.c:   685 |   asm ("movaps xmm0, [ROUND_CONST_Lx]");\
hash.c:       |        ^
hash.c: <inline asm>:1:15: note: instantiated into assembly here
hash.c:     1 |         movaps xmm0, [ROUND_CONST_Lx]
hash.c:       |                      ^~~~~~~~~~~~~~~~
hash.c: In file included from hash.c:19:
hash.c: ./groestl-asm-vperm.h:705:3: error: invalid operand for instruction
hash.c:   705 |   VPERM_Transform_RoundConst();
hash.c:       |   ^
hash.c: ./groestl-asm-vperm.h:686:3: note: expanded from macro 'VPERM_Transform_RoundConst'
hash.c:   686 |   VPERM_Transform(0, 1, VPERM_IPT, 4, 5, 6, 7, 8, 9, 10);\
hash.c:       |   ^
hash.c: ./groestl-asm-vperm.h:142:3: note: expanded from macro 'VPERM_Transform'
hash.c:   142 |   VPERM_Transform_Set_Const(table, c0, c1, c2);\
hash.c: ...

Number of similar (implementation,compiler) pairs: 4, namely:
ImplementationCompiler
T:vpermclang -march=native -O2 -fwrapv -Qunused-arguments -fPIC -fPIE -gdwarf-4 -Wall (Ubuntu_Clang_21.1.8_(6ubuntu1))
T:vpermclang -march=native -O3 -fwrapv -Qunused-arguments -fPIC -fPIE -gdwarf-4 -Wall (Ubuntu_Clang_21.1.8_(6ubuntu1))
T:vpermclang -march=native -O -fwrapv -Qunused-arguments -fPIC -fPIE -gdwarf-4 -Wall (Ubuntu_Clang_21.1.8_(6ubuntu1))
T:vpermclang -march=native -Os -fwrapv -Qunused-arguments -fPIC -fPIE -gdwarf-4 -Wall (Ubuntu_Clang_21.1.8_(6ubuntu1))

Compiler output


hash.c: hash.c: In function 'Init':
hash.c: hash.c:104:21: warning: the comparison will always evaluate as 'false' for the address of 'chaining' will never be NULL [-Waddress]
hash.c:   104 |   if (ctx->chaining == NULL || ctx->buffer == NULL)
hash.c:       |                     ^~
hash.c: In file included from groestl-asm-vperm.h:13,
hash.c:                  from hash.c:19:
hash.c: hash.h:83:38: note: 'chaining' declared here
hash.c:    83 |   __attribute__ ((aligned (32))) u64 chaining[SIZE/8];      /* actual state */
hash.c:       |                                      ^~~~~~~~
hash.c: hash.c:104:44: warning: the comparison will always evaluate as 'false' for the address of 'buffer' will never be NULL [-Waddress]
hash.c:   104 |   if (ctx->chaining == NULL || ctx->buffer == NULL)
hash.c:       |                                            ^~
hash.c: hash.h:84:46: note: 'buffer' declared here
hash.c:    84 |   __attribute__ ((aligned (32))) BitSequence buffer[SIZE];  /* data buffer */
hash.c:       |                                              ^~~~~~
try.c: /usr/bin/x86_64-linux-gnu-ld.bfd: libcrypto_hash_groestl256.a(hash.o): relocation R_X86_64_32S against symbol `ROUND_CONST_Lx' can not be used when making a PIE object; recompile with -fPIE
try.c: /usr/bin/x86_64-linux-gnu-ld.bfd: failed to set dynamic section sizes: bad value
try.c: collect2: error: ld returned 1 exit status

Number of similar (implementation,compiler) pairs: 4, namely:
ImplementationCompiler
T:vpermgcc -march=native -mtune=native -O2 -fwrapv -fPIC -fPIE -gdwarf-4 -Wall (15.2.0)
T:vpermgcc -march=native -mtune=native -O3 -fwrapv -fPIC -fPIE -gdwarf-4 -Wall (15.2.0)
T:vpermgcc -march=native -mtune=native -O -fwrapv -fPIC -fPIE -gdwarf-4 -Wall (15.2.0)
T:vpermgcc -march=native -mtune=native -Os -fwrapv -fPIC -fPIE -gdwarf-4 -Wall (15.2.0)

Compiler output


hash.c: hash.c: In function 'Init':
hash.c: hash.c:104:21: warning: the comparison will always evaluate as 'false' for the address of 'chaining' will never be NULL [-Waddress]
hash.c:   104 |   if (ctx->chaining == NULL || ctx->buffer == NULL)
hash.c:       |                     ^~
hash.c: In file included from groestl-intr-vperm.h:14,
hash.c:                  from hash.c:34:
hash.c: hash.h:83:38: note: 'chaining' declared here
hash.c:    83 |   __attribute__ ((aligned (32))) u64 chaining[SIZE/8];      /* actual state */
hash.c:       |                                      ^~~~~~~~
hash.c: hash.c:104:44: warning: the comparison will always evaluate as 'false' for the address of 'buffer' will never be NULL [-Waddress]
hash.c:   104 |   if (ctx->chaining == NULL || ctx->buffer == NULL)
hash.c:       |                                            ^~
hash.c: hash.h:84:46: note: 'buffer' declared here
hash.c:    84 |   __attribute__ ((aligned (32))) BitSequence buffer[SIZE];  /* data buffer */
hash.c:       |                                              ^~~~~~

Number of similar (implementation,compiler) pairs: 4, namely:
ImplementationCompiler
T:vperm-intrgcc -march=native -mtune=native -O2 -fwrapv -fPIC -fPIE -gdwarf-4 -Wall (15.2.0)
T:vperm-intrgcc -march=native -mtune=native -O3 -fwrapv -fPIC -fPIE -gdwarf-4 -Wall (15.2.0)
T:vperm-intrgcc -march=native -mtune=native -O -fwrapv -fPIC -fPIE -gdwarf-4 -Wall (15.2.0)
T:vperm-intrgcc -march=native -mtune=native -Os -fwrapv -fPIC -fPIE -gdwarf-4 -Wall (15.2.0)

Namespace violations


hash.o F512 T
hash.o Final T
hash.o Hash T
hash.o Init T
hash.o OutputTransformation T
hash.o RND512P T
hash.o RND512Q T
hash.o T R
hash.o Transform T
hash.o Update T
hash.o indices_cyclic R
hash.o shift_Values R

Number of similar (implementation,compiler) pairs: 8, namely:
ImplementationCompiler
T:32bit-2ktableclang -march=native -O2 -fwrapv -Qunused-arguments -fPIC -fPIE -gdwarf-4 -Wall (Ubuntu_Clang_21.1.8_(6ubuntu1))
T:32bit-2ktableclang -march=native -O3 -fwrapv -Qunused-arguments -fPIC -fPIE -gdwarf-4 -Wall (Ubuntu_Clang_21.1.8_(6ubuntu1))
T:32bit-2ktableclang -march=native -O -fwrapv -Qunused-arguments -fPIC -fPIE -gdwarf-4 -Wall (Ubuntu_Clang_21.1.8_(6ubuntu1))
T:32bit-2ktableclang -march=native -Os -fwrapv -Qunused-arguments -fPIC -fPIE -gdwarf-4 -Wall (Ubuntu_Clang_21.1.8_(6ubuntu1))
T:32bit-2ktablegcc -march=native -mtune=native -O2 -fwrapv -fPIC -fPIE -gdwarf-4 -Wall (15.2.0)
T:32bit-2ktablegcc -march=native -mtune=native -O3 -fwrapv -fPIC -fPIE -gdwarf-4 -Wall (15.2.0)
T:32bit-2ktablegcc -march=native -mtune=native -O -fwrapv -fPIC -fPIE -gdwarf-4 -Wall (15.2.0)
T:32bit-2ktablegcc -march=native -mtune=native -Os -fwrapv -fPIC -fPIE -gdwarf-4 -Wall (15.2.0)

Namespace violations


hash.o F512 T
hash.o MUL2_32Bit T
hash.o P T
hash.o Q T
hash.o RND512P T
hash.o RND512Q T
hash.o S R
hash.o mixBytes T
hash.o mix_bytes_half_state T
hash.o rotate_line_left T
hash.o subBytes T

Number of similar (implementation,compiler) pairs: 8, namely:
ImplementationCompiler
T:32bit-bytesliced-c-fastclang -march=native -O2 -fwrapv -Qunused-arguments -fPIC -fPIE -gdwarf-4 -Wall (Ubuntu_Clang_21.1.8_(6ubuntu1))
T:32bit-bytesliced-c-fastclang -march=native -O3 -fwrapv -Qunused-arguments -fPIC -fPIE -gdwarf-4 -Wall (Ubuntu_Clang_21.1.8_(6ubuntu1))
T:32bit-bytesliced-c-fastclang -march=native -O -fwrapv -Qunused-arguments -fPIC -fPIE -gdwarf-4 -Wall (Ubuntu_Clang_21.1.8_(6ubuntu1))
T:32bit-bytesliced-c-fastclang -march=native -Os -fwrapv -Qunused-arguments -fPIC -fPIE -gdwarf-4 -Wall (Ubuntu_Clang_21.1.8_(6ubuntu1))
T:32bit-bytesliced-c-fastgcc -march=native -mtune=native -O2 -fwrapv -fPIC -fPIE -gdwarf-4 -Wall (15.2.0)
T:32bit-bytesliced-c-fastgcc -march=native -mtune=native -O3 -fwrapv -fPIC -fPIE -gdwarf-4 -Wall (15.2.0)
T:32bit-bytesliced-c-fastgcc -march=native -mtune=native -O -fwrapv -fPIC -fPIE -gdwarf-4 -Wall (15.2.0)
T:32bit-bytesliced-c-fastgcc -march=native -mtune=native -Os -fwrapv -fPIC -fPIE -gdwarf-4 -Wall (15.2.0)

Namespace violations


hash.o memxor T
hash.o mixbytes T
hash.o permutation T
hash.o setmessage T

Number of similar (implementation,compiler) pairs: 8, namely:
ImplementationCompiler
T:32bit-bytesliced-c-smallclang -march=native -O2 -fwrapv -Qunused-arguments -fPIC -fPIE -gdwarf-4 -Wall (Ubuntu_Clang_21.1.8_(6ubuntu1))
T:32bit-bytesliced-c-smallclang -march=native -O3 -fwrapv -Qunused-arguments -fPIC -fPIE -gdwarf-4 -Wall (Ubuntu_Clang_21.1.8_(6ubuntu1))
T:32bit-bytesliced-c-smallclang -march=native -O -fwrapv -Qunused-arguments -fPIC -fPIE -gdwarf-4 -Wall (Ubuntu_Clang_21.1.8_(6ubuntu1))
T:32bit-bytesliced-c-smallclang -march=native -Os -fwrapv -Qunused-arguments -fPIC -fPIE -gdwarf-4 -Wall (Ubuntu_Clang_21.1.8_(6ubuntu1))
T:32bit-bytesliced-c-smallgcc -march=native -mtune=native -O2 -fwrapv -fPIC -fPIE -gdwarf-4 -Wall (15.2.0)
T:32bit-bytesliced-c-smallgcc -march=native -mtune=native -O3 -fwrapv -fPIC -fPIE -gdwarf-4 -Wall (15.2.0)
T:32bit-bytesliced-c-smallgcc -march=native -mtune=native -O -fwrapv -fPIC -fPIE -gdwarf-4 -Wall (15.2.0)
T:32bit-bytesliced-c-smallgcc -march=native -mtune=native -Os -fwrapv -fPIC -fPIE -gdwarf-4 -Wall (15.2.0)

Namespace violations


hash.o mix_bytes T
hash.o mul2 R
hash.o perm_P T
hash.o perm_Q T
hash.o sbox R

Number of similar (implementation,compiler) pairs: 8, namely:
ImplementationCompiler
T:8bit_cclang -march=native -O2 -fwrapv -Qunused-arguments -fPIC -fPIE -gdwarf-4 -Wall (Ubuntu_Clang_21.1.8_(6ubuntu1))
T:8bit_cclang -march=native -O3 -fwrapv -Qunused-arguments -fPIC -fPIE -gdwarf-4 -Wall (Ubuntu_Clang_21.1.8_(6ubuntu1))
T:8bit_cclang -march=native -O -fwrapv -Qunused-arguments -fPIC -fPIE -gdwarf-4 -Wall (Ubuntu_Clang_21.1.8_(6ubuntu1))
T:8bit_cclang -march=native -Os -fwrapv -Qunused-arguments -fPIC -fPIE -gdwarf-4 -Wall (Ubuntu_Clang_21.1.8_(6ubuntu1))
T:8bit_cgcc -march=native -mtune=native -O2 -fwrapv -fPIC -fPIE -gdwarf-4 -Wall (15.2.0)
T:8bit_cgcc -march=native -mtune=native -O3 -fwrapv -fPIC -fPIE -gdwarf-4 -Wall (15.2.0)
T:8bit_cgcc -march=native -mtune=native -O -fwrapv -fPIC -fPIE -gdwarf-4 -Wall (15.2.0)
T:8bit_cgcc -march=native -mtune=native -Os -fwrapv -fPIC -fPIE -gdwarf-4 -Wall (15.2.0)

Namespace violations


hash.o ALL_1B B
hash.o ALL_FF B
hash.o Final T
hash.o Hash T
hash.o INIT T
hash.o Init T
hash.o OF512 T
hash.o OutputTransformation T
hash.o ROUND_CONST_L0 B
hash.o ROUND_CONST_L7 B
hash.o ROUND_CONST_Lx B
hash.o ROUND_CONST_P B
hash.o ROUND_CONST_Q B
hash.o SUBSH_MASK B
hash.o TF512 T
hash.o TRANSP_MASK B
hash.o Transform T
hash.o Update T

Number of similar (implementation,compiler) pairs: 16, namely:
ImplementationCompiler
T:aesni-intrclang -march=native -O2 -fwrapv -Qunused-arguments -fPIC -fPIE -gdwarf-4 -Wall (Ubuntu_Clang_21.1.8_(6ubuntu1))
T:aesni-intrclang -march=native -O3 -fwrapv -Qunused-arguments -fPIC -fPIE -gdwarf-4 -Wall (Ubuntu_Clang_21.1.8_(6ubuntu1))
T:aesni-intrclang -march=native -O -fwrapv -Qunused-arguments -fPIC -fPIE -gdwarf-4 -Wall (Ubuntu_Clang_21.1.8_(6ubuntu1))
T:aesni-intrclang -march=native -Os -fwrapv -Qunused-arguments -fPIC -fPIE -gdwarf-4 -Wall (Ubuntu_Clang_21.1.8_(6ubuntu1))
T:aesni-intrgcc -march=native -mtune=native -O2 -fwrapv -fPIC -fPIE -gdwarf-4 -Wall (15.2.0)
T:aesni-intrgcc -march=native -mtune=native -O3 -fwrapv -fPIC -fPIE -gdwarf-4 -Wall (15.2.0)
T:aesni-intrgcc -march=native -mtune=native -O -fwrapv -fPIC -fPIE -gdwarf-4 -Wall (15.2.0)
T:aesni-intrgcc -march=native -mtune=native -Os -fwrapv -fPIC -fPIE -gdwarf-4 -Wall (15.2.0)
T:avx-intrclang -march=native -O2 -fwrapv -Qunused-arguments -fPIC -fPIE -gdwarf-4 -Wall (Ubuntu_Clang_21.1.8_(6ubuntu1))
T:avx-intrclang -march=native -O3 -fwrapv -Qunused-arguments -fPIC -fPIE -gdwarf-4 -Wall (Ubuntu_Clang_21.1.8_(6ubuntu1))
T:avx-intrclang -march=native -O -fwrapv -Qunused-arguments -fPIC -fPIE -gdwarf-4 -Wall (Ubuntu_Clang_21.1.8_(6ubuntu1))
T:avx-intrclang -march=native -Os -fwrapv -Qunused-arguments -fPIC -fPIE -gdwarf-4 -Wall (Ubuntu_Clang_21.1.8_(6ubuntu1))
T:avx-intrgcc -march=native -mtune=native -O2 -fwrapv -fPIC -fPIE -gdwarf-4 -Wall (15.2.0)
T:avx-intrgcc -march=native -mtune=native -O3 -fwrapv -fPIC -fPIE -gdwarf-4 -Wall (15.2.0)
T:avx-intrgcc -march=native -mtune=native -O -fwrapv -fPIC -fPIE -gdwarf-4 -Wall (15.2.0)
T:avx-intrgcc -march=native -mtune=native -Os -fwrapv -fPIC -fPIE -gdwarf-4 -Wall (15.2.0)

Namespace violations


hash.o Final T
hash.o Hash T
hash.o Init T
hash.o OutputTransformation T
hash.o OutputTransformation1024 T
hash.o OutputTransformation512 T
hash.o PrintHash T
hash.o ROUNDP1024 T
hash.o ROUNDQ1024 T
hash.o T R
hash.o Transform T
hash.o Transform1024 T
hash.o Transform512 T
hash.o Update T

Number of similar (implementation,compiler) pairs: 8, namely:
ImplementationCompiler
T:mmxclang -march=native -O2 -fwrapv -Qunused-arguments -fPIC -fPIE -gdwarf-4 -Wall (Ubuntu_Clang_21.1.8_(6ubuntu1))
T:mmxclang -march=native -O3 -fwrapv -Qunused-arguments -fPIC -fPIE -gdwarf-4 -Wall (Ubuntu_Clang_21.1.8_(6ubuntu1))
T:mmxclang -march=native -O -fwrapv -Qunused-arguments -fPIC -fPIE -gdwarf-4 -Wall (Ubuntu_Clang_21.1.8_(6ubuntu1))
T:mmxclang -march=native -Os -fwrapv -Qunused-arguments -fPIC -fPIE -gdwarf-4 -Wall (Ubuntu_Clang_21.1.8_(6ubuntu1))
T:mmxgcc -march=native -mtune=native -O2 -fwrapv -fPIC -fPIE -gdwarf-4 -Wall (15.2.0)
T:mmxgcc -march=native -mtune=native -O3 -fwrapv -fPIC -fPIE -gdwarf-4 -Wall (15.2.0)
T:mmxgcc -march=native -mtune=native -O -fwrapv -fPIC -fPIE -gdwarf-4 -Wall (15.2.0)
T:mmxgcc -march=native -mtune=native -Os -fwrapv -fPIC -fPIE -gdwarf-4 -Wall (15.2.0)

Namespace violations


hash.o F1024 T
hash.o F512 T
hash.o Final T
hash.o Hash T
hash.o Init T
hash.o OutputTransformation T
hash.o PrintHash T
hash.o RND1024P T
hash.o RND1024Q T
hash.o RND512P T
hash.o RND512Q T
hash.o T R
hash.o Transform T
hash.o Update T

Number of similar (implementation,compiler) pairs: 8, namely:
ImplementationCompiler
T:opt32clang -march=native -O2 -fwrapv -Qunused-arguments -fPIC -fPIE -gdwarf-4 -Wall (Ubuntu_Clang_21.1.8_(6ubuntu1))
T:opt32clang -march=native -O3 -fwrapv -Qunused-arguments -fPIC -fPIE -gdwarf-4 -Wall (Ubuntu_Clang_21.1.8_(6ubuntu1))
T:opt32clang -march=native -O -fwrapv -Qunused-arguments -fPIC -fPIE -gdwarf-4 -Wall (Ubuntu_Clang_21.1.8_(6ubuntu1))
T:opt32clang -march=native -Os -fwrapv -Qunused-arguments -fPIC -fPIE -gdwarf-4 -Wall (Ubuntu_Clang_21.1.8_(6ubuntu1))
T:opt32gcc -march=native -mtune=native -O2 -fwrapv -fPIC -fPIE -gdwarf-4 -Wall (15.2.0)
T:opt32gcc -march=native -mtune=native -O3 -fwrapv -fPIC -fPIE -gdwarf-4 -Wall (15.2.0)
T:opt32gcc -march=native -mtune=native -O -fwrapv -fPIC -fPIE -gdwarf-4 -Wall (15.2.0)
T:opt32gcc -march=native -mtune=native -Os -fwrapv -fPIC -fPIE -gdwarf-4 -Wall (15.2.0)

Namespace violations


groestl.o sph_groestl224 T
groestl.o sph_groestl224_addbits_and_close T
groestl.o sph_groestl224_close T
groestl.o sph_groestl224_init T
groestl.o sph_groestl256 T
groestl.o sph_groestl256_addbits_and_close T
groestl.o sph_groestl256_close T
groestl.o sph_groestl256_init T
groestl.o sph_groestl384 T
groestl.o sph_groestl384_addbits_and_close T
groestl.o sph_groestl384_close T
groestl.o sph_groestl384_init T
groestl.o sph_groestl512 T
groestl.o sph_groestl512_addbits_and_close T
groestl.o sph_groestl512_close T
groestl.o sph_groestl512_init T

Number of similar (implementation,compiler) pairs: 24, namely:
ImplementationCompiler
T:sphlibclang -march=native -O2 -fwrapv -Qunused-arguments -fPIC -fPIE -gdwarf-4 -Wall (Ubuntu_Clang_21.1.8_(6ubuntu1))
T:sphlibclang -march=native -O3 -fwrapv -Qunused-arguments -fPIC -fPIE -gdwarf-4 -Wall (Ubuntu_Clang_21.1.8_(6ubuntu1))
T:sphlibclang -march=native -O -fwrapv -Qunused-arguments -fPIC -fPIE -gdwarf-4 -Wall (Ubuntu_Clang_21.1.8_(6ubuntu1))
T:sphlibclang -march=native -Os -fwrapv -Qunused-arguments -fPIC -fPIE -gdwarf-4 -Wall (Ubuntu_Clang_21.1.8_(6ubuntu1))
T:sphlibgcc -march=native -mtune=native -O2 -fwrapv -fPIC -fPIE -gdwarf-4 -Wall (15.2.0)
T:sphlibgcc -march=native -mtune=native -O3 -fwrapv -fPIC -fPIE -gdwarf-4 -Wall (15.2.0)
T:sphlibgcc -march=native -mtune=native -O -fwrapv -fPIC -fPIE -gdwarf-4 -Wall (15.2.0)
T:sphlibgcc -march=native -mtune=native -Os -fwrapv -fPIC -fPIE -gdwarf-4 -Wall (15.2.0)
T:sphlib-adaptedclang -march=native -O2 -fwrapv -Qunused-arguments -fPIC -fPIE -gdwarf-4 -Wall (Ubuntu_Clang_21.1.8_(6ubuntu1))
T:sphlib-adaptedclang -march=native -O3 -fwrapv -Qunused-arguments -fPIC -fPIE -gdwarf-4 -Wall (Ubuntu_Clang_21.1.8_(6ubuntu1))
T:sphlib-adaptedclang -march=native -O -fwrapv -Qunused-arguments -fPIC -fPIE -gdwarf-4 -Wall (Ubuntu_Clang_21.1.8_(6ubuntu1))
T:sphlib-adaptedclang -march=native -Os -fwrapv -Qunused-arguments -fPIC -fPIE -gdwarf-4 -Wall (Ubuntu_Clang_21.1.8_(6ubuntu1))
T:sphlib-adaptedgcc -march=native -mtune=native -O2 -fwrapv -fPIC -fPIE -gdwarf-4 -Wall (15.2.0)
T:sphlib-adaptedgcc -march=native -mtune=native -O3 -fwrapv -fPIC -fPIE -gdwarf-4 -Wall (15.2.0)
T:sphlib-adaptedgcc -march=native -mtune=native -O -fwrapv -fPIC -fPIE -gdwarf-4 -Wall (15.2.0)
T:sphlib-adaptedgcc -march=native -mtune=native -Os -fwrapv -fPIC -fPIE -gdwarf-4 -Wall (15.2.0)
T:sphlib-smallclang -march=native -O2 -fwrapv -Qunused-arguments -fPIC -fPIE -gdwarf-4 -Wall (Ubuntu_Clang_21.1.8_(6ubuntu1))
T:sphlib-smallclang -march=native -O3 -fwrapv -Qunused-arguments -fPIC -fPIE -gdwarf-4 -Wall (Ubuntu_Clang_21.1.8_(6ubuntu1))
T:sphlib-smallclang -march=native -O -fwrapv -Qunused-arguments -fPIC -fPIE -gdwarf-4 -Wall (Ubuntu_Clang_21.1.8_(6ubuntu1))
T:sphlib-smallclang -march=native -Os -fwrapv -Qunused-arguments -fPIC -fPIE -gdwarf-4 -Wall (Ubuntu_Clang_21.1.8_(6ubuntu1))
T:sphlib-smallgcc -march=native -mtune=native -O2 -fwrapv -fPIC -fPIE -gdwarf-4 -Wall (15.2.0)
T:sphlib-smallgcc -march=native -mtune=native -O3 -fwrapv -fPIC -fPIE -gdwarf-4 -Wall (15.2.0)
T:sphlib-smallgcc -march=native -mtune=native -O -fwrapv -fPIC -fPIE -gdwarf-4 -Wall (15.2.0)
T:sphlib-smallgcc -march=native -mtune=native -Os -fwrapv -fPIC -fPIE -gdwarf-4 -Wall (15.2.0)

Namespace violations


hash.o ALL_0F B
hash.o ALL_15 B
hash.o ALL_1B B
hash.o ALL_63 B
hash.o ALL_FF B
hash.o Final T
hash.o Hash T
hash.o INIT T
hash.o Init T
hash.o OF512 T
hash.o OutputTransformation T
hash.o ROUND_CONST_L0 B
hash.o ROUND_CONST_L7 B
hash.o ROUND_CONST_Lx B
hash.o ROUND_CONST_P B
hash.o ROUND_CONST_Q B
hash.o SUBSH_MASK B
hash.o TF512 T
hash.o TRANSP_MASK B
hash.o Transform T
hash.o Update T
hash.o VPERM_INV B
hash.o VPERM_IPT B
hash.o VPERM_OPT B
hash.o VPERM_SB1 B
hash.o VPERM_SB2 B
hash.o VPERM_SB4 B
hash.o VPERM_SBO B

Number of similar (implementation,compiler) pairs: 8, namely:
ImplementationCompiler
T:vperm-intrclang -march=native -O2 -fwrapv -Qunused-arguments -fPIC -fPIE -gdwarf-4 -Wall (Ubuntu_Clang_21.1.8_(6ubuntu1))
T:vperm-intrclang -march=native -O3 -fwrapv -Qunused-arguments -fPIC -fPIE -gdwarf-4 -Wall (Ubuntu_Clang_21.1.8_(6ubuntu1))
T:vperm-intrclang -march=native -O -fwrapv -Qunused-arguments -fPIC -fPIE -gdwarf-4 -Wall (Ubuntu_Clang_21.1.8_(6ubuntu1))
T:vperm-intrclang -march=native -Os -fwrapv -Qunused-arguments -fPIC -fPIE -gdwarf-4 -Wall (Ubuntu_Clang_21.1.8_(6ubuntu1))
T:vperm-intrgcc -march=native -mtune=native -O2 -fwrapv -fPIC -fPIE -gdwarf-4 -Wall (15.2.0)
T:vperm-intrgcc -march=native -mtune=native -O3 -fwrapv -fPIC -fPIE -gdwarf-4 -Wall (15.2.0)
T:vperm-intrgcc -march=native -mtune=native -O -fwrapv -fPIC -fPIE -gdwarf-4 -Wall (15.2.0)
T:vperm-intrgcc -march=native -mtune=native -Os -fwrapv -fPIC -fPIE -gdwarf-4 -Wall (15.2.0)