Test results for amd64, hertz, crypto_core/multsntrup653

[Page version: 20250310 13:41:42]

Measurements for amd64, hertz, crypto_core Test results for amd64, hertz, crypto_core Test results for crypto_core/multsntrup653
Computer: hertz
Microarchitecture: amd64; Zen 4 (a60f12)
Architecture: amd64
CPU ID: AuthenticAMD-00a60f12-178bfbff
SUPERCOP version: 20250307
Operation: crypto_core
Primitive: multsntrup653
TimeObject sizeTest sizeImplementationCompilerBenchmark dateSUPERCOP version
1062221289 0 037678 828 1032avxclang -march=native -O3 -fwrapv -Qunused-arguments -fPIC -fPIE -gdwarf-4 -Wall2025030820250307
1065020387 0 036718 828 1032avxclang -march=native -O2 -fwrapv -Qunused-arguments -fPIC -fPIE -gdwarf-4 -Wall2025030820250307
1065917701 0 030520 820 1032avx800clang -march=native -Os -fwrapv -Qunused-arguments -fPIC -fPIE -gdwarf-4 -Wall2025030820250307
1066120171 0 036502 828 1032avx800clang -march=native -O2 -fwrapv -Qunused-arguments -fPIC -fPIE -gdwarf-4 -Wall2025030820250307
1066121073 0 037462 828 1032avx800clang -march=native -O3 -fwrapv -Qunused-arguments -fPIC -fPIE -gdwarf-4 -Wall2025030820250307
1071917776 0 030592 820 1032avxclang -march=native -Os -fwrapv -Qunused-arguments -fPIC -fPIE -gdwarf-4 -Wall2025030820250307
1173917697 0 034022 828 1032round2clang -march=native -O3 -fwrapv -Qunused-arguments -fPIC -fPIE -gdwarf-4 -Wall2025030820250307
1175716763 0 033030 828 1032round2clang -march=native -O2 -fwrapv -Qunused-arguments -fPIC -fPIE -gdwarf-4 -Wall2025030820250307
1179113550 0 026336 820 1032round2clang -march=native -Os -fwrapv -Qunused-arguments -fPIC -fPIE -gdwarf-4 -Wall2025030820250307
1184317169 0 031605 804 1064round2gcc -march=native -mtune=native -O3 -fwrapv -fPIC -fPIE -gdwarf-4 -Wall2025030820250307
1188514761 0 027405 804 1064round2gcc -march=native -mtune=native -O2 -fwrapv -fPIC -fPIE -gdwarf-4 -Wall2025030820250307
1233413947 0 025260 788 968round2gcc -march=native -mtune=native -Os -fwrapv -fPIC -fPIE -gdwarf-4 -Wall2025030820250307
1262017550 0 028884 788 968avx800gcc -march=native -mtune=native -Os -fwrapv -fPIC -fPIE -gdwarf-4 -Wall2025030820250307
1287818021 0 029332 788 968avxgcc -march=native -mtune=native -Os -fwrapv -fPIC -fPIE -gdwarf-4 -Wall2025030820250307
1295219486 0 033957 804 1064avx800gcc -march=native -mtune=native -O3 -fwrapv -fPIC -fPIE -gdwarf-4 -Wall2025030820250307
1299817982 0 030629 804 1064avx800gcc -march=native -mtune=native -O2 -fwrapv -fPIC -fPIE -gdwarf-4 -Wall2025030820250307
1332319906 0 034341 804 1064avxgcc -march=native -mtune=native -O3 -fwrapv -fPIC -fPIE -gdwarf-4 -Wall2025030820250307
1334018402 0 031013 804 1064avxgcc -march=native -mtune=native -O2 -fwrapv -fPIC -fPIE -gdwarf-4 -Wall2025030820250307
763946450 0 022950 828 1032compactclang -march=native -O3 -fwrapv -Qunused-arguments -fPIC -fPIE -gdwarf-4 -Wall2025030820250307
802193729 0 020150 828 1032refclang -march=native -O2 -fwrapv -Qunused-arguments -fPIC -fPIE -gdwarf-4 -Wall2025030820250307
803004472 0 020934 828 1032refclang -march=native -O3 -fwrapv -Qunused-arguments -fPIC -fPIE -gdwarf-4 -Wall2025030820250307
856044966 0 021414 828 1032compactclang -march=native -O2 -fwrapv -Qunused-arguments -fPIC -fPIE -gdwarf-4 -Wall2025030820250307
873502109 0 016605 804 1064compactgcc -march=native -mtune=native -O3 -fwrapv -fPIC -fPIE -gdwarf-4 -Wall2025030820250307
913134507 0 018925 804 1064refgcc -march=native -mtune=native -O3 -fwrapv -fPIC -fPIE -gdwarf-4 -Wall2025030820250307
1523501114 0 014064 820 1032compactclang -march=native -Os -fwrapv -Qunused-arguments -fPIC -fPIE -gdwarf-4 -Wall2025030820250307
2936122216 0 015120 820 1032refclang -march=native -Os -fwrapv -Qunused-arguments -fPIC -fPIE -gdwarf-4 -Wall2025030820250307
805502517 0 011788 788 968compactgcc -march=native -mtune=native -Os -fwrapv -fPIC -fPIE -gdwarf-4 -Wall2025030820250307
818494558 0 013165 804 1064compactgcc -march=native -mtune=native -O2 -fwrapv -fPIC -fPIE -gdwarf-4 -Wall2025030820250307
9391621129 0 013733 804 1064refgcc -march=native -mtune=native -O2 -fwrapv -fPIC -fPIE -gdwarf-4 -Wall2025030820250307
959338560 0 011844 788 968refgcc -march=native -mtune=native -Os -fwrapv -fPIC -fPIE -gdwarf-4 -Wall2025030820250307

Compiler output


try.c: clang: error: no such file or directory: '.../supercop-data/avx/amd64/lib/timecop/cpucycles.o'

Number of similar (implementation,compiler) pairs: 12, namely:
ImplementationCompiler
avxclang -march=native -O2 -fwrapv -Qunused-arguments -fPIC -fPIE -gdwarf-4 -Wall (Ubuntu_Clang_19.1.1_(1ubuntu1))
avxclang -march=native -O3 -fwrapv -Qunused-arguments -fPIC -fPIE -gdwarf-4 -Wall (Ubuntu_Clang_19.1.1_(1ubuntu1))
avxclang -march=native -Os -fwrapv -Qunused-arguments -fPIC -fPIE -gdwarf-4 -Wall (Ubuntu_Clang_19.1.1_(1ubuntu1))
avx800clang -march=native -O2 -fwrapv -Qunused-arguments -fPIC -fPIE -gdwarf-4 -Wall (Ubuntu_Clang_19.1.1_(1ubuntu1))
avx800clang -march=native -O3 -fwrapv -Qunused-arguments -fPIC -fPIE -gdwarf-4 -Wall (Ubuntu_Clang_19.1.1_(1ubuntu1))
avx800clang -march=native -Os -fwrapv -Qunused-arguments -fPIC -fPIE -gdwarf-4 -Wall (Ubuntu_Clang_19.1.1_(1ubuntu1))
compactclang -march=native -O2 -fwrapv -Qunused-arguments -fPIC -fPIE -gdwarf-4 -Wall (Ubuntu_Clang_19.1.1_(1ubuntu1))
compactclang -march=native -O3 -fwrapv -Qunused-arguments -fPIC -fPIE -gdwarf-4 -Wall (Ubuntu_Clang_19.1.1_(1ubuntu1))
compactclang -march=native -Os -fwrapv -Qunused-arguments -fPIC -fPIE -gdwarf-4 -Wall (Ubuntu_Clang_19.1.1_(1ubuntu1))
refclang -march=native -O2 -fwrapv -Qunused-arguments -fPIC -fPIE -gdwarf-4 -Wall (Ubuntu_Clang_19.1.1_(1ubuntu1))
refclang -march=native -O3 -fwrapv -Qunused-arguments -fPIC -fPIE -gdwarf-4 -Wall (Ubuntu_Clang_19.1.1_(1ubuntu1))
refclang -march=native -Os -fwrapv -Qunused-arguments -fPIC -fPIE -gdwarf-4 -Wall (Ubuntu_Clang_19.1.1_(1ubuntu1))

Compiler output


try.c: In file included from try-anything-timecop.c:3:
try.c: try-anything.c:17:10: fatal error: cpucycles.h: No such file or directory
try.c:    17 | #include "cpucycles.h"
try.c:       |          ^~~~~~~~~~~~~
try.c: compilation terminated.

Number of similar (implementation,compiler) pairs: 12, namely:
ImplementationCompiler
avxgcc -march=native -mtune=native -O2 -fwrapv -fPIC -fPIE -gdwarf-4 -Wall (14.2.0)
avxgcc -march=native -mtune=native -O3 -fwrapv -fPIC -fPIE -gdwarf-4 -Wall (14.2.0)
avxgcc -march=native -mtune=native -Os -fwrapv -fPIC -fPIE -gdwarf-4 -Wall (14.2.0)
avx800gcc -march=native -mtune=native -O2 -fwrapv -fPIC -fPIE -gdwarf-4 -Wall (14.2.0)
avx800gcc -march=native -mtune=native -O3 -fwrapv -fPIC -fPIE -gdwarf-4 -Wall (14.2.0)
avx800gcc -march=native -mtune=native -Os -fwrapv -fPIC -fPIE -gdwarf-4 -Wall (14.2.0)
compactgcc -march=native -mtune=native -O2 -fwrapv -fPIC -fPIE -gdwarf-4 -Wall (14.2.0)
compactgcc -march=native -mtune=native -O3 -fwrapv -fPIC -fPIE -gdwarf-4 -Wall (14.2.0)
compactgcc -march=native -mtune=native -Os -fwrapv -fPIC -fPIE -gdwarf-4 -Wall (14.2.0)
refgcc -march=native -mtune=native -O2 -fwrapv -fPIC -fPIE -gdwarf-4 -Wall (14.2.0)
refgcc -march=native -mtune=native -O3 -fwrapv -fPIC -fPIE -gdwarf-4 -Wall (14.2.0)
refgcc -march=native -mtune=native -Os -fwrapv -fPIC -fPIE -gdwarf-4 -Wall (14.2.0)

Compiler output


ntt.c: ntt.c:562:35: warning: unused variable 'h0' [-Wunused-variable]
ntt.c:   562 |   __m256i f0,f1,f2,f3,g0,g1,g2,g3,h0,h1,h2,h3;
ntt.c:       |                                   ^~
ntt.c: ntt.c:562:38: warning: unused variable 'h1' [-Wunused-variable]
ntt.c:   562 |   __m256i f0,f1,f2,f3,g0,g1,g2,g3,h0,h1,h2,h3;
ntt.c:       |                                      ^~
ntt.c: ntt.c:562:41: warning: unused variable 'h2' [-Wunused-variable]
ntt.c:   562 |   __m256i f0,f1,f2,f3,g0,g1,g2,g3,h0,h1,h2,h3;
ntt.c:       |                                         ^~
ntt.c: ntt.c:562:44: warning: unused variable 'h3' [-Wunused-variable]
ntt.c:   562 |   __m256i f0,f1,f2,f3,g0,g1,g2,g3,h0,h1,h2,h3;
ntt.c:       |                                            ^~
ntt.c: ntt.c:864:35: warning: unused variable 'h0' [-Wunused-variable]
ntt.c:   864 |   __m256i f0,f1,f2,f3,g0,g1,g2,g3,h0,h1,h2,h3;
ntt.c:       |                                   ^~
ntt.c: ntt.c:864:38: warning: unused variable 'h1' [-Wunused-variable]
ntt.c:   864 |   __m256i f0,f1,f2,f3,g0,g1,g2,g3,h0,h1,h2,h3;
ntt.c:       |                                      ^~
ntt.c: ntt.c:864:41: warning: unused variable 'h2' [-Wunused-variable]
ntt.c:   864 |   __m256i f0,f1,f2,f3,g0,g1,g2,g3,h0,h1,h2,h3;
ntt.c:       |                                         ^~
ntt.c: ntt.c:864:44: warning: unused variable 'h3' [-Wunused-variable]
ntt.c:   864 |   __m256i f0,f1,f2,f3,g0,g1,g2,g3,h0,h1,h2,h3;
ntt.c:       |                                            ^~
ntt.c: ntt.c:865:10: warning: unused variable 'origf' [-Wunused-variable]
ntt.c: ...
try.c: clang: error: no such file or directory: '.../supercop-data/avx/amd64/lib/timecop/cpucycles.o'

Number of similar (implementation,compiler) pairs: 3, namely:
ImplementationCompiler
round2clang -march=native -O2 -fwrapv -Qunused-arguments -fPIC -fPIE -gdwarf-4 -Wall (Ubuntu_Clang_19.1.1_(1ubuntu1))
round2clang -march=native -O3 -fwrapv -Qunused-arguments -fPIC -fPIE -gdwarf-4 -Wall (Ubuntu_Clang_19.1.1_(1ubuntu1))
round2clang -march=native -Os -fwrapv -Qunused-arguments -fPIC -fPIE -gdwarf-4 -Wall (Ubuntu_Clang_19.1.1_(1ubuntu1))

Compiler output


ntt.c: ntt.c: In function 'ntt512':
ntt.c: ntt.c:562:44: warning: unused variable 'h3' [-Wunused-variable]
ntt.c:   562 |   __m256i f0,f1,f2,f3,g0,g1,g2,g3,h0,h1,h2,h3;
ntt.c:       |                                            ^~
ntt.c: ntt.c:562:41: warning: unused variable 'h2' [-Wunused-variable]
ntt.c:   562 |   __m256i f0,f1,f2,f3,g0,g1,g2,g3,h0,h1,h2,h3;
ntt.c:       |                                         ^~
ntt.c: ntt.c:562:38: warning: unused variable 'h1' [-Wunused-variable]
ntt.c:   562 |   __m256i f0,f1,f2,f3,g0,g1,g2,g3,h0,h1,h2,h3;
ntt.c:       |                                      ^~
ntt.c: ntt.c:562:35: warning: unused variable 'h0' [-Wunused-variable]
ntt.c:   562 |   __m256i f0,f1,f2,f3,g0,g1,g2,g3,h0,h1,h2,h3;
ntt.c:       |                                   ^~
ntt.c: ntt.c: In function 'invntt512':
ntt.c: ntt.c:865:10: warning: unused variable 'origf' [-Wunused-variable]
ntt.c:   865 |   int16 *origf = f;
ntt.c:       |          ^~~~~
ntt.c: ntt.c:864:44: warning: unused variable 'h3' [-Wunused-variable]
ntt.c:   864 |   __m256i f0,f1,f2,f3,g0,g1,g2,g3,h0,h1,h2,h3;
ntt.c:       |                                            ^~
ntt.c: ntt.c:864:41: warning: unused variable 'h2' [-Wunused-variable]
ntt.c:   864 |   __m256i f0,f1,f2,f3,g0,g1,g2,g3,h0,h1,h2,h3;
ntt.c:       |                                         ^~
ntt.c: ntt.c:864:38: warning: unused variable 'h1' [-Wunused-variable]
ntt.c:   864 |   __m256i f0,f1,f2,f3,g0,g1,g2,g3,h0,h1,h2,h3;
ntt.c: ...
try.c: In file included from try-anything-timecop.c:3:
try.c: try-anything.c:17:10: fatal error: cpucycles.h: No such file or directory
try.c:    17 | #include "cpucycles.h"
try.c:       |          ^~~~~~~~~~~~~
try.c: compilation terminated.

Number of similar (implementation,compiler) pairs: 3, namely:
ImplementationCompiler
round2gcc -march=native -mtune=native -O2 -fwrapv -fPIC -fPIE -gdwarf-4 -Wall (14.2.0)
round2gcc -march=native -mtune=native -O3 -fwrapv -fPIC -fPIE -gdwarf-4 -Wall (14.2.0)
round2gcc -march=native -mtune=native -Os -fwrapv -fPIC -fPIE -gdwarf-4 -Wall (14.2.0)

TIMECOP error (can be valgrind bug)


error 127
timeout: failed to run command 'valgrind': No such file or directory

Number of similar (implementation,compiler) pairs: 30, namely:
ImplementationCompiler
avxclang -march=native -O2 -fwrapv -Qunused-arguments -fPIC -fPIE -gdwarf-4 -Wall (Ubuntu_Clang_19.1.1_(1ubuntu1))
avxclang -march=native -O3 -fwrapv -Qunused-arguments -fPIC -fPIE -gdwarf-4 -Wall (Ubuntu_Clang_19.1.1_(1ubuntu1))
avxclang -march=native -Os -fwrapv -Qunused-arguments -fPIC -fPIE -gdwarf-4 -Wall (Ubuntu_Clang_19.1.1_(1ubuntu1))
avxgcc -march=native -mtune=native -O2 -fwrapv -fPIC -fPIE -gdwarf-4 -Wall (14.2.0)
avxgcc -march=native -mtune=native -O3 -fwrapv -fPIC -fPIE -gdwarf-4 -Wall (14.2.0)
avxgcc -march=native -mtune=native -Os -fwrapv -fPIC -fPIE -gdwarf-4 -Wall (14.2.0)
avx800clang -march=native -O2 -fwrapv -Qunused-arguments -fPIC -fPIE -gdwarf-4 -Wall (Ubuntu_Clang_19.1.1_(1ubuntu1))
avx800clang -march=native -O3 -fwrapv -Qunused-arguments -fPIC -fPIE -gdwarf-4 -Wall (Ubuntu_Clang_19.1.1_(1ubuntu1))
avx800clang -march=native -Os -fwrapv -Qunused-arguments -fPIC -fPIE -gdwarf-4 -Wall (Ubuntu_Clang_19.1.1_(1ubuntu1))
avx800gcc -march=native -mtune=native -O2 -fwrapv -fPIC -fPIE -gdwarf-4 -Wall (14.2.0)
avx800gcc -march=native -mtune=native -O3 -fwrapv -fPIC -fPIE -gdwarf-4 -Wall (14.2.0)
avx800gcc -march=native -mtune=native -Os -fwrapv -fPIC -fPIE -gdwarf-4 -Wall (14.2.0)
compactclang -march=native -O2 -fwrapv -Qunused-arguments -fPIC -fPIE -gdwarf-4 -Wall (Ubuntu_Clang_19.1.1_(1ubuntu1))
compactclang -march=native -O3 -fwrapv -Qunused-arguments -fPIC -fPIE -gdwarf-4 -Wall (Ubuntu_Clang_19.1.1_(1ubuntu1))
compactclang -march=native -Os -fwrapv -Qunused-arguments -fPIC -fPIE -gdwarf-4 -Wall (Ubuntu_Clang_19.1.1_(1ubuntu1))
compactgcc -march=native -mtune=native -O2 -fwrapv -fPIC -fPIE -gdwarf-4 -Wall (14.2.0)
compactgcc -march=native -mtune=native -O3 -fwrapv -fPIC -fPIE -gdwarf-4 -Wall (14.2.0)
compactgcc -march=native -mtune=native -Os -fwrapv -fPIC -fPIE -gdwarf-4 -Wall (14.2.0)
refclang -march=native -O2 -fwrapv -Qunused-arguments -fPIC -fPIE -gdwarf-4 -Wall (Ubuntu_Clang_19.1.1_(1ubuntu1))
refclang -march=native -O3 -fwrapv -Qunused-arguments -fPIC -fPIE -gdwarf-4 -Wall (Ubuntu_Clang_19.1.1_(1ubuntu1))
refclang -march=native -Os -fwrapv -Qunused-arguments -fPIC -fPIE -gdwarf-4 -Wall (Ubuntu_Clang_19.1.1_(1ubuntu1))
refgcc -march=native -mtune=native -O2 -fwrapv -fPIC -fPIE -gdwarf-4 -Wall (14.2.0)
refgcc -march=native -mtune=native -O3 -fwrapv -fPIC -fPIE -gdwarf-4 -Wall (14.2.0)
refgcc -march=native -mtune=native -Os -fwrapv -fPIC -fPIE -gdwarf-4 -Wall (14.2.0)
round2clang -march=native -O2 -fwrapv -Qunused-arguments -fPIC -fPIE -gdwarf-4 -Wall (Ubuntu_Clang_19.1.1_(1ubuntu1))
round2clang -march=native -O3 -fwrapv -Qunused-arguments -fPIC -fPIE -gdwarf-4 -Wall (Ubuntu_Clang_19.1.1_(1ubuntu1))
round2clang -march=native -Os -fwrapv -Qunused-arguments -fPIC -fPIE -gdwarf-4 -Wall (Ubuntu_Clang_19.1.1_(1ubuntu1))
round2gcc -march=native -mtune=native -O2 -fwrapv -fPIC -fPIE -gdwarf-4 -Wall (14.2.0)
round2gcc -march=native -mtune=native -O3 -fwrapv -fPIC -fPIE -gdwarf-4 -Wall (14.2.0)
round2gcc -march=native -mtune=native -Os -fwrapv -fPIC -fPIE -gdwarf-4 -Wall (14.2.0)