Test results for amd64, hertz, crypto_core/keccakf160064bits

[Page version: 20261022 14:52:12]

Measurements for amd64, hertz, crypto_core Test results for amd64, hertz, crypto_core Test results for crypto_core/keccakf160064bits
Computer: hertz
Microarchitecture: amd64; Zen 4 (a60f12)
Architecture: amd64
CPU ID: AuthenticAMD-00a60f12-178bfbff
SUPERCOP version: 20261018
Operation: crypto_core
Primitive: keccakf160064bits
TimeObject sizeTest sizeImplementationCompilerBenchmark dateSUPERCOP version
92176070 0 0104893 1264 1664optimized1600ufullgcc -march=native -mtune=native -O3 -fwrapv -fPIC -fPIE -gdwarf-4 -Wall2026101920261018
92356217 0 081437 1264 1664optimized1600ufullgcc -march=native -mtune=native -O2 -fwrapv -fPIC -fPIE -gdwarf-4 -Wall2026101920261018
94956911 0 081013 1280 1632optimized1600ufullclang -march=native -Os -fwrapv -Qunused-arguments -fPIC -fPIE -gdwarf-4 -Wall2026101920261018
95259583 0 090827 1288 1632optimized1600ufullclang -march=native -O3 -fwrapv -Qunused-arguments -fPIC -fPIE -gdwarf-4 -Wall2026101920261018
95424170 0 048245 1280 1632optimized1600u6clang -march=native -Os -fwrapv -Qunused-arguments -fPIC -fPIE -gdwarf-4 -Wall2026101920261018
95526677 0 057931 1288 1632optimized1600u6clang -march=native -O3 -fwrapv -Qunused-arguments -fPIC -fPIE -gdwarf-4 -Wall2026101920261018
95659583 0 089355 1288 1632optimized1600ufullclang -march=native -O2 -fwrapv -Qunused-arguments -fPIC -fPIE -gdwarf-4 -Wall2026101920261018
95826677 0 056459 1288 1632optimized1600u6clang -march=native -O2 -fwrapv -Qunused-arguments -fPIC -fPIE -gdwarf-4 -Wall2026101920261018
96624462 0 049693 1264 1664optimized1600u6gcc -march=native -mtune=native -O2 -fwrapv -fPIC -fPIE -gdwarf-4 -Wall2026101920261018
96725502 0 054333 1264 1664optimized1600u6gcc -march=native -mtune=native -O3 -fwrapv -fPIC -fPIE -gdwarf-4 -Wall2026101920261018
99725653 0 048840 1240 1600optimized1600u6gcc -march=native -mtune=native -Os -fwrapv -fPIC -fPIE -gdwarf-4 -Wall2026101920261018
99966836 0 097883 1288 1632optimized1600lcufullclang -march=native -O3 -fwrapv -Qunused-arguments -fPIC -fPIE -gdwarf-4 -Wall2026101920261018
100259974 0 084125 1280 1632optimized1600lcufullclang -march=native -Os -fwrapv -Qunused-arguments -fPIC -fPIE -gdwarf-4 -Wall2026101920261018
100560547 0 085797 1264 1664optimized1600lcufullgcc -march=native -mtune=native -O2 -fwrapv -fPIC -fPIE -gdwarf-4 -Wall2026101920261018
100732386 0 062043 1288 1632optimized1600lcu6clang -march=native -O2 -fwrapv -Qunused-arguments -fPIC -fPIE -gdwarf-4 -Wall2026101920261018
100788323 0 0117221 1264 1664optimized1600lcufullgcc -march=native -mtune=native -O3 -fwrapv -fPIC -fPIE -gdwarf-4 -Wall2026101920261018
100932642 0 063707 1288 1632optimized1600lcu6clang -march=native -O3 -fwrapv -Qunused-arguments -fPIC -fPIE -gdwarf-4 -Wall2026101920261018
101825661 0 049821 1280 1632optimized1600lcu6clang -march=native -Os -fwrapv -Qunused-arguments -fPIC -fPIE -gdwarf-4 -Wall2026101920261018
103131397 0 060261 1264 1664optimized1600lcu6gcc -march=native -mtune=native -O3 -fwrapv -fPIC -fPIE -gdwarf-4 -Wall2026101920261018
103326837 0 052133 1264 1664optimized1600lcu6gcc -march=native -mtune=native -O2 -fwrapv -fPIC -fPIE -gdwarf-4 -Wall2026101920261018
104670512 0 093625 1248 1600optimized1600AsmX86-64Applegcc -march=native -mtune=native -Os -fwrapv -fPIC -fPIE -gdwarf-4 -Wall2026101920261018
113266580 0 096219 1288 1632optimized1600lcufullclang -march=native -O2 -fwrapv -Qunused-arguments -fPIC -fPIE -gdwarf-4 -Wall2026101920261018
113470554 0 0102259 1320 1632optimized1600AsmX86-64Appleclang -march=native -O3 -fwrapv -Qunused-arguments -fPIC -fPIE -gdwarf-4 -Wall2026101920261018
116870530 0 095069 1312 1632optimized1600AsmX86-64clang -march=native -Os -fwrapv -Qunused-arguments -fPIC -fPIE -gdwarf-4 -Wall2026101920261018
116970554 0 095133 1312 1632optimized1600AsmX86-64Appleclang -march=native -Os -fwrapv -Qunused-arguments -fPIC -fPIE -gdwarf-4 -Wall2026101920261018
116970600 0 099214 1272 1664optimized1600AsmX86-64Applegcc -march=native -mtune=native -O3 -fwrapv -fPIC -fPIE -gdwarf-4 -Wall2026101920261018
117070576 0 099214 1272 1664optimized1600AsmX86-64gcc -march=native -mtune=native -O3 -fwrapv -fPIC -fPIE -gdwarf-4 -Wall2026101920261018
117270600 0 095598 1272 1664optimized1600AsmX86-64Applegcc -march=native -mtune=native -O2 -fwrapv -fPIC -fPIE -gdwarf-4 -Wall2026101920261018
117970530 0 0102195 1320 1632optimized1600AsmX86-64clang -march=native -O3 -fwrapv -Qunused-arguments -fPIC -fPIE -gdwarf-4 -Wall2026101920261018
118070576 0 095598 1272 1664optimized1600AsmX86-64gcc -march=native -mtune=native -O2 -fwrapv -fPIC -fPIE -gdwarf-4 -Wall2026101920261018
118470530 0 0100723 1320 1632optimized1600AsmX86-64clang -march=native -O2 -fwrapv -Qunused-arguments -fPIC -fPIE -gdwarf-4 -Wall2026101920261018
119070488 0 093497 1248 1600optimized1600AsmX86-64gcc -march=native -mtune=native -Os -fwrapv -fPIC -fPIE -gdwarf-4 -Wall2026101920261018
119270554 0 0100787 1320 1632optimized1600AsmX86-64Appleclang -march=native -O2 -fwrapv -Qunused-arguments -fPIC -fPIE -gdwarf-4 -Wall2026101920261018
193866146 0 095771 1288 1632optimized1600lcufullshldclang -march=native -O2 -fwrapv -Qunused-arguments -fPIC -fPIE -gdwarf-4 -Wall2026101920261018
193866402 0 097499 1288 1632optimized1600lcufullshldclang -march=native -O3 -fwrapv -Qunused-arguments -fPIC -fPIE -gdwarf-4 -Wall2026101920261018
195260043 0 084189 1280 1632optimized1600lcufullshldclang -march=native -Os -fwrapv -Qunused-arguments -fPIC -fPIE -gdwarf-4 -Wall2026101920261018
195859971 0 085221 1264 1664optimized1600lcufullshldgcc -march=native -mtune=native -O2 -fwrapv -fPIC -fPIE -gdwarf-4 -Wall2026101920261018
196084851 0 0113701 1264 1664optimized1600lcufullshldgcc -march=native -mtune=native -O3 -fwrapv -fPIC -fPIE -gdwarf-4 -Wall2026101920261018
203767233 0 090408 1240 1600optimized1600ufullgcc -march=native -mtune=native -Os -fwrapv -fPIC -fPIE -gdwarf-4 -Wall2026101920261018
21657264 0 037182 1304 1632reference1600clang -march=native -O2 -fwrapv -Qunused-arguments -fPIC -fPIE -gdwarf-4 -Wall2026101920261018
22067264 0 038590 1304 1632reference1600clang -march=native -O3 -fwrapv -Qunused-arguments -fPIC -fPIE -gdwarf-4 -Wall2026101920261018
257171954 0 095152 1240 1600optimized1600lcufullgcc -march=native -mtune=native -Os -fwrapv -fPIC -fPIE -gdwarf-4 -Wall2026101920261018
261965361 0 088632 1240 1600optimized1600lcufullshldgcc -march=native -mtune=native -Os -fwrapv -fPIC -fPIE -gdwarf-4 -Wall2026101920261018
27909994 0 038734 1256 1664compact1600gcc -march=native -mtune=native -O3 -fwrapv -fPIC -fPIE -gdwarf-4 -Wall2026101920261018
27984921 0 033881 1272 1664reference1600gcc -march=native -mtune=native -O3 -fwrapv -fPIC -fPIE -gdwarf-4 -Wall2026101920261018
290428746 0 051960 1240 1600optimized1600lcu6gcc -march=native -mtune=native -Os -fwrapv -fPIC -fPIE -gdwarf-4 -Wall2026101920261018
35057715 0 038939 1288 1632compact1600clang -march=native -O3 -fwrapv -Qunused-arguments -fPIC -fPIE -gdwarf-4 -Wall2026101920261018
41542181 0 025273 1232 1600compact1600gcc -march=native -mtune=native -Os -fwrapv -fPIC -fPIE -gdwarf-4 -Wall2026101920261018
44583344 0 028502 1256 1664compact1600gcc -march=native -mtune=native -O2 -fwrapv -fPIC -fPIE -gdwarf-4 -Wall2026101920261018
50007419 0 037227 1288 1632compact1600clang -march=native -O2 -fwrapv -Qunused-arguments -fPIC -fPIE -gdwarf-4 -Wall2026101920261018
68262312 0 026509 1280 1632compact1600clang -march=native -Os -fwrapv -Qunused-arguments -fPIC -fPIE -gdwarf-4 -Wall2026101920261018
85474201 0 029561 1272 1664reference1600gcc -march=native -mtune=native -O2 -fwrapv -fPIC -fPIE -gdwarf-4 -Wall2026101920261018
148063000 0 026209 1248 1600reference1600gcc -march=native -mtune=native -Os -fwrapv -fPIC -fPIE -gdwarf-4 -Wall2026101920261018
175114468 0 028701 1296 1632reference1600clang -march=native -Os -fwrapv -Qunused-arguments -fPIC -fPIE -gdwarf-4 -Wall2026101920261018

Compiler output


try.c: /usr/bin/x86_64-linux-gnu-ld.bfd: libcrypto_core_keccakf160064bits.a(KeccakP-1600-x86-64-gas.o): warning: relocation in read-only section `.text'
try.c: /usr/bin/x86_64-linux-gnu-ld.bfd: warning: creating DT_TEXTREL in a PIE
try.c: /usr/bin/x86_64-linux-gnu-ld.bfd: libcrypto_core_keccakf160064bits.a(KeccakP-1600-x86-64-gas.o): warning: relocation in read-only section `.text'
try.c: /usr/bin/x86_64-linux-gnu-ld.bfd: warning: creating DT_TEXTREL in a PIE
try.c: /usr/bin/x86_64-linux-gnu-ld.bfd: libcrypto_core_keccakf160064bits.a(KeccakP-1600-x86-64-gas.o): warning: relocation in read-only section `.text'
try.c: /usr/bin/x86_64-linux-gnu-ld.bfd: warning: creating DT_TEXTREL in a PIE

Number of similar (implementation,compiler) pairs: 6, namely:
ImplementationCompiler
optimized1600AsmX86-64clang -march=native -O2 -fwrapv -Qunused-arguments -fPIC -fPIE -gdwarf-4 -Wall (Ubuntu_Clang_21.1.8_(6ubuntu1))
optimized1600AsmX86-64clang -march=native -O3 -fwrapv -Qunused-arguments -fPIC -fPIE -gdwarf-4 -Wall (Ubuntu_Clang_21.1.8_(6ubuntu1))
optimized1600AsmX86-64clang -march=native -Os -fwrapv -Qunused-arguments -fPIC -fPIE -gdwarf-4 -Wall (Ubuntu_Clang_21.1.8_(6ubuntu1))
optimized1600AsmX86-64gcc -march=native -mtune=native -O2 -fwrapv -fPIC -fPIE -gdwarf-4 -Wall (15.2.0)
optimized1600AsmX86-64gcc -march=native -mtune=native -O3 -fwrapv -fPIC -fPIE -gdwarf-4 -Wall (15.2.0)
optimized1600AsmX86-64gcc -march=native -mtune=native -Os -fwrapv -fPIC -fPIE -gdwarf-4 -Wall (15.2.0)

Compiler output


try.c: /usr/bin/x86_64-linux-gnu-ld.bfd: libcrypto_core_keccakf160064bits.a(keccakp.o): warning: relocation in read-only section `.text'
try.c: /usr/bin/x86_64-linux-gnu-ld.bfd: warning: creating DT_TEXTREL in a PIE
try.c: /usr/bin/x86_64-linux-gnu-ld.bfd: libcrypto_core_keccakf160064bits.a(keccakp.o): warning: relocation in read-only section `.text'
try.c: /usr/bin/x86_64-linux-gnu-ld.bfd: warning: creating DT_TEXTREL in a PIE
try.c: /usr/bin/x86_64-linux-gnu-ld.bfd: libcrypto_core_keccakf160064bits.a(keccakp.o): warning: relocation in read-only section `.text'
try.c: /usr/bin/x86_64-linux-gnu-ld.bfd: warning: creating DT_TEXTREL in a PIE

Number of similar (implementation,compiler) pairs: 6, namely:
ImplementationCompiler
optimized1600AsmX86-64Appleclang -march=native -O2 -fwrapv -Qunused-arguments -fPIC -fPIE -gdwarf-4 -Wall (Ubuntu_Clang_21.1.8_(6ubuntu1))
optimized1600AsmX86-64Appleclang -march=native -O3 -fwrapv -Qunused-arguments -fPIC -fPIE -gdwarf-4 -Wall (Ubuntu_Clang_21.1.8_(6ubuntu1))
optimized1600AsmX86-64Appleclang -march=native -Os -fwrapv -Qunused-arguments -fPIC -fPIE -gdwarf-4 -Wall (Ubuntu_Clang_21.1.8_(6ubuntu1))
optimized1600AsmX86-64Applegcc -march=native -mtune=native -O2 -fwrapv -fPIC -fPIE -gdwarf-4 -Wall (15.2.0)
optimized1600AsmX86-64Applegcc -march=native -mtune=native -O3 -fwrapv -fPIC -fPIE -gdwarf-4 -Wall (15.2.0)
optimized1600AsmX86-64Applegcc -march=native -mtune=native -Os -fwrapv -fPIC -fPIE -gdwarf-4 -Wall (15.2.0)

Compiler output


try.c: /usr/bin/x86_64-linux-gnu-ld.bfd: libcrypto_core_keccakf160064bits.a(keccakp.o): relocation R_X86_64_32S against `.text' can not be used when making a PIE object; recompile with -fPIE
try.c: /usr/bin/x86_64-linux-gnu-ld.bfd: failed to set dynamic section sizes: bad value
try.c: clang: error: linker command failed with exit code 1 (use -v to see invocation)

Number of similar (implementation,compiler) pairs: 3, namely:
ImplementationCompiler
optimized1600AsmX86-64shldclang -march=native -O2 -fwrapv -Qunused-arguments -fPIC -fPIE -gdwarf-4 -Wall (Ubuntu_Clang_21.1.8_(6ubuntu1))
optimized1600AsmX86-64shldclang -march=native -O3 -fwrapv -Qunused-arguments -fPIC -fPIE -gdwarf-4 -Wall (Ubuntu_Clang_21.1.8_(6ubuntu1))
optimized1600AsmX86-64shldclang -march=native -Os -fwrapv -Qunused-arguments -fPIC -fPIE -gdwarf-4 -Wall (Ubuntu_Clang_21.1.8_(6ubuntu1))

Compiler output


try.c: /usr/bin/x86_64-linux-gnu-ld.bfd: libcrypto_core_keccakf160064bits.a(keccakp.o): relocation R_X86_64_32S against `.text' can not be used when making a PIE object; recompile with -fPIE
try.c: /usr/bin/x86_64-linux-gnu-ld.bfd: failed to set dynamic section sizes: bad value
try.c: collect2: error: ld returned 1 exit status

Number of similar (implementation,compiler) pairs: 3, namely:
ImplementationCompiler
optimized1600AsmX86-64shldgcc -march=native -mtune=native -O2 -fwrapv -fPIC -fPIE -gdwarf-4 -Wall (15.2.0)
optimized1600AsmX86-64shldgcc -march=native -mtune=native -O3 -fwrapv -fPIC -fPIE -gdwarf-4 -Wall (15.2.0)
optimized1600AsmX86-64shldgcc -march=native -mtune=native -Os -fwrapv -fPIC -fPIE -gdwarf-4 -Wall (15.2.0)

Compiler output


KeccakP-1600-XOP.c: KeccakP-1600-XOP.c:23:10: fatal error: 'align.h' file not found
KeccakP-1600-XOP.c:    23 | #include "align.h"
KeccakP-1600-XOP.c:       |          ^~~~~~~~~
KeccakP-1600-XOP.c: 1 error generated.

Number of similar (implementation,compiler) pairs: 6, namely:
ImplementationCompiler
optimized1600XOPu6clang -march=native -O2 -fwrapv -Qunused-arguments -fPIC -fPIE -gdwarf-4 -Wall (Ubuntu_Clang_21.1.8_(6ubuntu1))
optimized1600XOPu6clang -march=native -O3 -fwrapv -Qunused-arguments -fPIC -fPIE -gdwarf-4 -Wall (Ubuntu_Clang_21.1.8_(6ubuntu1))
optimized1600XOPu6clang -march=native -Os -fwrapv -Qunused-arguments -fPIC -fPIE -gdwarf-4 -Wall (Ubuntu_Clang_21.1.8_(6ubuntu1))
optimized1600XOPufullclang -march=native -O2 -fwrapv -Qunused-arguments -fPIC -fPIE -gdwarf-4 -Wall (Ubuntu_Clang_21.1.8_(6ubuntu1))
optimized1600XOPufullclang -march=native -O3 -fwrapv -Qunused-arguments -fPIC -fPIE -gdwarf-4 -Wall (Ubuntu_Clang_21.1.8_(6ubuntu1))
optimized1600XOPufullclang -march=native -Os -fwrapv -Qunused-arguments -fPIC -fPIE -gdwarf-4 -Wall (Ubuntu_Clang_21.1.8_(6ubuntu1))

Compiler output


KeccakP-1600-XOP.c: KeccakP-1600-XOP.c:23:10: fatal error: align.h: No such file or directory
KeccakP-1600-XOP.c:    23 | #include "align.h"
KeccakP-1600-XOP.c:       |          ^~~~~~~~~
KeccakP-1600-XOP.c: compilation terminated.

Number of similar (implementation,compiler) pairs: 6, namely:
ImplementationCompiler
optimized1600XOPu6gcc -march=native -mtune=native -O2 -fwrapv -fPIC -fPIE -gdwarf-4 -Wall (15.2.0)
optimized1600XOPu6gcc -march=native -mtune=native -O3 -fwrapv -fPIC -fPIE -gdwarf-4 -Wall (15.2.0)
optimized1600XOPu6gcc -march=native -mtune=native -Os -fwrapv -fPIC -fPIE -gdwarf-4 -Wall (15.2.0)
optimized1600XOPufullgcc -march=native -mtune=native -O2 -fwrapv -fPIC -fPIE -gdwarf-4 -Wall (15.2.0)
optimized1600XOPufullgcc -march=native -mtune=native -O3 -fwrapv -fPIC -fPIE -gdwarf-4 -Wall (15.2.0)
optimized1600XOPufullgcc -march=native -mtune=native -Os -fwrapv -fPIC -fPIE -gdwarf-4 -Wall (15.2.0)

Compiler output


KeccakP-1600-reference.c: KeccakP-1600-reference.c:256:13: warning: unused function 'fromBytesToWords' [-Wunused-function]
KeccakP-1600-reference.c:   256 | static void fromBytesToWords(tKeccakLane *stateAsWords, const unsigned char *state)
KeccakP-1600-reference.c:       |             ^~~~~~~~~~~~~~~~
KeccakP-1600-reference.c: KeccakP-1600-reference.c:267:13: warning: unused function 'fromWordsToBytes' [-Wunused-function]
KeccakP-1600-reference.c:   267 | static void fromWordsToBytes(unsigned char *state, const tKeccakLane *stateAsWords)
KeccakP-1600-reference.c:       |             ^~~~~~~~~~~~~~~~
KeccakP-1600-reference.c: 2 warnings generated.

Number of similar (implementation,compiler) pairs: 3, namely:
ImplementationCompiler
reference1600clang -march=native -O2 -fwrapv -Qunused-arguments -fPIC -fPIE -gdwarf-4 -Wall (Ubuntu_Clang_21.1.8_(6ubuntu1))
reference1600clang -march=native -O3 -fwrapv -Qunused-arguments -fPIC -fPIE -gdwarf-4 -Wall (Ubuntu_Clang_21.1.8_(6ubuntu1))
reference1600clang -march=native -Os -fwrapv -Qunused-arguments -fPIC -fPIE -gdwarf-4 -Wall (Ubuntu_Clang_21.1.8_(6ubuntu1))

Compiler output


KeccakP-1600-reference.c: KeccakP-1600-reference.c:267:13: warning: 'fromWordsToBytes' defined but not used [-Wunused-function]
KeccakP-1600-reference.c:   267 | static void fromWordsToBytes(unsigned char *state, const tKeccakLane *stateAsWords)
KeccakP-1600-reference.c:       |             ^~~~~~~~~~~~~~~~
KeccakP-1600-reference.c: KeccakP-1600-reference.c:256:13: warning: 'fromBytesToWords' defined but not used [-Wunused-function]
KeccakP-1600-reference.c:   256 | static void fromBytesToWords(tKeccakLane *stateAsWords, const unsigned char *state)
KeccakP-1600-reference.c:       |             ^~~~~~~~~~~~~~~~

Number of similar (implementation,compiler) pairs: 3, namely:
ImplementationCompiler
reference1600gcc -march=native -mtune=native -O2 -fwrapv -fPIC -fPIE -gdwarf-4 -Wall (15.2.0)
reference1600gcc -march=native -mtune=native -O3 -fwrapv -fPIC -fPIE -gdwarf-4 -Wall (15.2.0)
reference1600gcc -march=native -mtune=native -Os -fwrapv -fPIC -fPIE -gdwarf-4 -Wall (15.2.0)

Namespace violations


KeccakP-1600-x86-64-gas.o InlinePerm a
KeccakP-1600-x86-64-gas.o KeccakP1600_AddByte T
KeccakP-1600-x86-64-gas.o KeccakP1600_StaticInitialize T
KeccakP-1600-x86-64-gas.o UseSIMD a
KeccakP-1600-x86-64-gas.o _ba a
KeccakP-1600-x86-64-gas.o _be a
KeccakP-1600-x86-64-gas.o _bi a
KeccakP-1600-x86-64-gas.o _bo a
KeccakP-1600-x86-64-gas.o _bu a
KeccakP-1600-x86-64-gas.o _ga a
KeccakP-1600-x86-64-gas.o _ge a
KeccakP-1600-x86-64-gas.o _gi a
KeccakP-1600-x86-64-gas.o _go a
KeccakP-1600-x86-64-gas.o _gu a
KeccakP-1600-x86-64-gas.o _ka a
KeccakP-1600-x86-64-gas.o _ke a
KeccakP-1600-x86-64-gas.o _ki a
KeccakP-1600-x86-64-gas.o _ko a
KeccakP-1600-x86-64-gas.o _ku a
KeccakP-1600-x86-64-gas.o _ma a
KeccakP-1600-x86-64-gas.o _me a
KeccakP-1600-x86-64-gas.o _mi a
KeccakP-1600-x86-64-gas.o _mo a
KeccakP-1600-x86-64-gas.o _mu a
KeccakP-1600-x86-64-gas.o _sa a
KeccakP-1600-x86-64-gas.o _se a
KeccakP-1600-x86-64-gas.o _si a
KeccakP-1600-x86-64-gas.o _so a
KeccakP-1600-x86-64-gas.o _su a

Number of similar (implementation,compiler) pairs: 6, namely:
ImplementationCompiler
optimized1600AsmX86-64clang -march=native -O2 -fwrapv -Qunused-arguments -fPIC -fPIE -gdwarf-4 -Wall (Ubuntu_Clang_21.1.8_(6ubuntu1))
optimized1600AsmX86-64clang -march=native -O3 -fwrapv -Qunused-arguments -fPIC -fPIE -gdwarf-4 -Wall (Ubuntu_Clang_21.1.8_(6ubuntu1))
optimized1600AsmX86-64clang -march=native -Os -fwrapv -Qunused-arguments -fPIC -fPIE -gdwarf-4 -Wall (Ubuntu_Clang_21.1.8_(6ubuntu1))
optimized1600AsmX86-64gcc -march=native -mtune=native -O2 -fwrapv -fPIC -fPIE -gdwarf-4 -Wall (15.2.0)
optimized1600AsmX86-64gcc -march=native -mtune=native -O3 -fwrapv -fPIC -fPIE -gdwarf-4 -Wall (15.2.0)
optimized1600AsmX86-64gcc -march=native -mtune=native -Os -fwrapv -fPIC -fPIE -gdwarf-4 -Wall (15.2.0)

Namespace violations


keccakp.o _KeccakF1600_FastLoop_Absorb T
keccakp.o _KeccakP1600_AddByte T
keccakp.o _KeccakP1600_AddBytes T
keccakp.o _KeccakP1600_ExtractAndAddBytes T
keccakp.o _KeccakP1600_ExtractBytes T
keccakp.o _KeccakP1600_Initialize T
keccakp.o _KeccakP1600_OverwriteBytes T
keccakp.o _KeccakP1600_OverwriteWithZeroes T
keccakp.o _KeccakP1600_Permute_12rounds T
keccakp.o _KeccakP1600_Permute_Nrounds T
keccakp.o _KeccakP1600_StaticInitialize T

Number of similar (implementation,compiler) pairs: 6, namely:
ImplementationCompiler
optimized1600AsmX86-64Appleclang -march=native -O2 -fwrapv -Qunused-arguments -fPIC -fPIE -gdwarf-4 -Wall (Ubuntu_Clang_21.1.8_(6ubuntu1))
optimized1600AsmX86-64Appleclang -march=native -O3 -fwrapv -Qunused-arguments -fPIC -fPIE -gdwarf-4 -Wall (Ubuntu_Clang_21.1.8_(6ubuntu1))
optimized1600AsmX86-64Appleclang -march=native -Os -fwrapv -Qunused-arguments -fPIC -fPIE -gdwarf-4 -Wall (Ubuntu_Clang_21.1.8_(6ubuntu1))
optimized1600AsmX86-64Applegcc -march=native -mtune=native -O2 -fwrapv -fPIC -fPIE -gdwarf-4 -Wall (15.2.0)
optimized1600AsmX86-64Applegcc -march=native -mtune=native -O3 -fwrapv -fPIC -fPIE -gdwarf-4 -Wall (15.2.0)
optimized1600AsmX86-64Applegcc -march=native -mtune=native -Os -fwrapv -fPIC -fPIE -gdwarf-4 -Wall (15.2.0)

TIMECOP error (can be valgrind bug)


error 132

Process terminating with default action of signal 4 (SIGILL)
 Illegal opcode at address 0x40068D8
   at 0x...: memset (string_fortified.h:59)
   by 0x...: cpucycles_works (wrapper.c:59)
   by 0x...: supercop_cpucycles_ticks_amd64_tsc_setup (amd64-tsc.c:28)
   by 0x...: cpucycles_init (wrapper.c:314)
   by 0x...: main (try-anything.c:330)
Illegal instruction (core dumped)

Number of similar (implementation,compiler) pairs: 1, namely:
ImplementationCompiler
compact1600clang -march=native -O2 -fwrapv -Qunused-arguments -fPIC -fPIE -gdwarf-4 -Wall (Ubuntu_Clang_21.1.8_(6ubuntu1))

TIMECOP error (can be valgrind bug)


error 132

Process terminating with default action of signal 4 (SIGILL)
 Illegal opcode at address 0x4006A58
   at 0x...: memset (string_fortified.h:59)
   by 0x...: cpucycles_works (wrapper.c:59)
   by 0x...: supercop_cpucycles_ticks_amd64_tsc_setup (amd64-tsc.c:28)
   by 0x...: cpucycles_init (wrapper.c:314)
   by 0x...: main (try-anything.c:330)
Illegal instruction (core dumped)

Number of similar (implementation,compiler) pairs: 1, namely:
ImplementationCompiler
compact1600clang -march=native -O3 -fwrapv -Qunused-arguments -fPIC -fPIE -gdwarf-4 -Wall (Ubuntu_Clang_21.1.8_(6ubuntu1))

TIMECOP error (can be valgrind bug)


error 132

Process terminating with default action of signal 4 (SIGILL)
 Illegal opcode at address 0x4004F98
   at 0x...: memset (string_fortified.h:59)
   by 0x...: cpucycles_works (wrapper.c:59)
   by 0x...: supercop_cpucycles_ticks_amd64_tsc_setup (amd64-tsc.c:28)
   by 0x...: cpucycles_init (wrapper.c:314)
   by 0x...: main (try-anything.c:330)
Illegal instruction (core dumped)

Number of similar (implementation,compiler) pairs: 1, namely:
ImplementationCompiler
compact1600clang -march=native -Os -fwrapv -Qunused-arguments -fPIC -fPIE -gdwarf-4 -Wall (Ubuntu_Clang_21.1.8_(6ubuntu1))

TIMECOP error (can be valgrind bug)


error 132

Process terminating with default action of signal 4 (SIGILL)
 Illegal opcode at address 0x4005898
   at 0x...: memset (string_fortified.h:59)
   by 0x...: cpucycles_works (wrapper.c:59)
   by 0x...: supercop_cpucycles_ticks_amd64_tsc_setup (amd64-tsc.c:28)
   by 0x...: cpucycles_init (wrapper.c:314)
   by 0x...: main (try-anything.c:330)
Illegal instruction (core dumped)

Number of similar (implementation,compiler) pairs: 1, namely:
ImplementationCompiler
compact1600gcc -march=native -mtune=native -O2 -fwrapv -fPIC -fPIE -gdwarf-4 -Wall (15.2.0)

TIMECOP error (can be valgrind bug)


error 132

Process terminating with default action of signal 4 (SIGILL)
 Illegal opcode at address 0x40076D8
   at 0x...: memset (string_fortified.h:59)
   by 0x...: cpucycles_works (wrapper.c:59)
   by 0x...: supercop_cpucycles_ticks_amd64_tsc_setup (amd64-tsc.c:28)
   by 0x...: cpucycles_init (wrapper.c:314)
   by 0x...: main (try-anything.c:330)
Illegal instruction (core dumped)

Number of similar (implementation,compiler) pairs: 1, namely:
ImplementationCompiler
compact1600gcc -march=native -mtune=native -O3 -fwrapv -fPIC -fPIE -gdwarf-4 -Wall (15.2.0)

TIMECOP error (can be valgrind bug)


error 132

Process terminating with default action of signal 4 (SIGILL)
 Illegal opcode at address 0x4004C58
   at 0x...: memset (string_fortified.h:59)
   by 0x...: cpucycles_works (wrapper.c:59)
   by 0x...: supercop_cpucycles_ticks_amd64_tsc_setup (amd64-tsc.c:28)
   by 0x...: cpucycles_init (wrapper.c:314)
   by 0x...: main (try-anything.c:330)
Illegal instruction (core dumped)

Number of similar (implementation,compiler) pairs: 1, namely:
ImplementationCompiler
compact1600gcc -march=native -mtune=native -Os -fwrapv -fPIC -fPIE -gdwarf-4 -Wall (15.2.0)

TIMECOP error (can be valgrind bug)


error 132

Process terminating with default action of signal 4 (SIGILL)
 Illegal opcode at address 0x40164D8
   at 0x...: memset (string_fortified.h:59)
   by 0x...: cpucycles_works (wrapper.c:59)
   by 0x...: supercop_cpucycles_ticks_amd64_tsc_setup (amd64-tsc.c:28)
   by 0x...: cpucycles_init (wrapper.c:314)
   by 0x...: main (try-anything.c:330)
Illegal instruction (core dumped)

Number of similar (implementation,compiler) pairs: 2, namely:
ImplementationCompiler
optimized1600AsmX86-64clang -march=native -O2 -fwrapv -Qunused-arguments -fPIC -fPIE -gdwarf-4 -Wall (Ubuntu_Clang_21.1.8_(6ubuntu1))
optimized1600AsmX86-64Appleclang -march=native -O2 -fwrapv -Qunused-arguments -fPIC -fPIE -gdwarf-4 -Wall (Ubuntu_Clang_21.1.8_(6ubuntu1))

TIMECOP error (can be valgrind bug)


error 132

Process terminating with default action of signal 4 (SIGILL)
 Illegal opcode at address 0x4016698
   at 0x...: memset (string_fortified.h:59)
   by 0x...: cpucycles_works (wrapper.c:59)
   by 0x...: supercop_cpucycles_ticks_amd64_tsc_setup (amd64-tsc.c:28)
   by 0x...: cpucycles_init (wrapper.c:314)
   by 0x...: main (try-anything.c:330)
Illegal instruction (core dumped)

Number of similar (implementation,compiler) pairs: 2, namely:
ImplementationCompiler
optimized1600AsmX86-64clang -march=native -O3 -fwrapv -Qunused-arguments -fPIC -fPIE -gdwarf-4 -Wall (Ubuntu_Clang_21.1.8_(6ubuntu1))
optimized1600AsmX86-64Appleclang -march=native -O3 -fwrapv -Qunused-arguments -fPIC -fPIE -gdwarf-4 -Wall (Ubuntu_Clang_21.1.8_(6ubuntu1))

TIMECOP error (can be valgrind bug)


error 132

Process terminating with default action of signal 4 (SIGILL)
 Illegal opcode at address 0x4015C98
   at 0x...: memset (string_fortified.h:59)
   by 0x...: cpucycles_works (wrapper.c:59)
   by 0x...: supercop_cpucycles_ticks_amd64_tsc_setup (amd64-tsc.c:28)
   by 0x...: cpucycles_init (wrapper.c:314)
   by 0x...: main (try-anything.c:330)
Illegal instruction (core dumped)

Number of similar (implementation,compiler) pairs: 1, namely:
ImplementationCompiler
optimized1600AsmX86-64clang -march=native -Os -fwrapv -Qunused-arguments -fPIC -fPIE -gdwarf-4 -Wall (Ubuntu_Clang_21.1.8_(6ubuntu1))

TIMECOP error (can be valgrind bug)


error 132

Process terminating with default action of signal 4 (SIGILL)
 Illegal opcode at address 0x4015F58
   at 0x...: memset (string_fortified.h:59)
   by 0x...: cpucycles_works (wrapper.c:59)
   by 0x...: supercop_cpucycles_ticks_amd64_tsc_setup (amd64-tsc.c:28)
   by 0x...: cpucycles_init (wrapper.c:314)
   by 0x...: main (try-anything.c:330)
Illegal instruction (core dumped)

Number of similar (implementation,compiler) pairs: 1, namely:
ImplementationCompiler
optimized1600AsmX86-64gcc -march=native -mtune=native -O2 -fwrapv -fPIC -fPIE -gdwarf-4 -Wall (15.2.0)

TIMECOP error (can be valgrind bug)


error 132

Process terminating with default action of signal 4 (SIGILL)
 Illegal opcode at address 0x4016498
   at 0x...: memset (string_fortified.h:59)
   by 0x...: cpucycles_works (wrapper.c:59)
   by 0x...: supercop_cpucycles_ticks_amd64_tsc_setup (amd64-tsc.c:28)
   by 0x...: cpucycles_init (wrapper.c:314)
   by 0x...: main (try-anything.c:330)
Illegal instruction (core dumped)

Number of similar (implementation,compiler) pairs: 2, namely:
ImplementationCompiler
optimized1600AsmX86-64gcc -march=native -mtune=native -O3 -fwrapv -fPIC -fPIE -gdwarf-4 -Wall (15.2.0)
optimized1600AsmX86-64Applegcc -march=native -mtune=native -O3 -fwrapv -fPIC -fPIE -gdwarf-4 -Wall (15.2.0)

TIMECOP error (can be valgrind bug)


error 132

Process terminating with default action of signal 4 (SIGILL)
 Illegal opcode at address 0x4015818
   at 0x...: memset (string_fortified.h:59)
   by 0x...: cpucycles_works (wrapper.c:59)
   by 0x...: supercop_cpucycles_ticks_amd64_tsc_setup (amd64-tsc.c:28)
   by 0x...: cpucycles_init (wrapper.c:314)
   by 0x...: main (try-anything.c:330)
Illegal instruction (core dumped)

Number of similar (implementation,compiler) pairs: 1, namely:
ImplementationCompiler
optimized1600AsmX86-64gcc -march=native -mtune=native -Os -fwrapv -fPIC -fPIE -gdwarf-4 -Wall (15.2.0)

TIMECOP error (can be valgrind bug)


error 132

Process terminating with default action of signal 4 (SIGILL)
 Illegal opcode at address 0x4015CD8
   at 0x...: memset (string_fortified.h:59)
   by 0x...: cpucycles_works (wrapper.c:59)
   by 0x...: supercop_cpucycles_ticks_amd64_tsc_setup (amd64-tsc.c:28)
   by 0x...: cpucycles_init (wrapper.c:314)
   by 0x...: main (try-anything.c:330)
Illegal instruction (core dumped)

Number of similar (implementation,compiler) pairs: 1, namely:
ImplementationCompiler
optimized1600AsmX86-64Appleclang -march=native -Os -fwrapv -Qunused-arguments -fPIC -fPIE -gdwarf-4 -Wall (Ubuntu_Clang_21.1.8_(6ubuntu1))

TIMECOP error (can be valgrind bug)


error 132

Process terminating with default action of signal 4 (SIGILL)
 Illegal opcode at address 0x4015F98
   at 0x...: memset (string_fortified.h:59)
   by 0x...: cpucycles_works (wrapper.c:59)
   by 0x...: supercop_cpucycles_ticks_amd64_tsc_setup (amd64-tsc.c:28)
   by 0x...: cpucycles_init (wrapper.c:314)
   by 0x...: main (try-anything.c:330)
Illegal instruction (core dumped)

Number of similar (implementation,compiler) pairs: 1, namely:
ImplementationCompiler
optimized1600AsmX86-64Applegcc -march=native -mtune=native -O2 -fwrapv -fPIC -fPIE -gdwarf-4 -Wall (15.2.0)

TIMECOP error (can be valgrind bug)


error 132

Process terminating with default action of signal 4 (SIGILL)
 Illegal opcode at address 0x4015858
   at 0x...: memset (string_fortified.h:59)
   by 0x...: cpucycles_works (wrapper.c:59)
   by 0x...: supercop_cpucycles_ticks_amd64_tsc_setup (amd64-tsc.c:28)
   by 0x...: cpucycles_init (wrapper.c:314)
   by 0x...: main (try-anything.c:330)
Illegal instruction (core dumped)

Number of similar (implementation,compiler) pairs: 1, namely:
ImplementationCompiler
optimized1600AsmX86-64Applegcc -march=native -mtune=native -Os -fwrapv -fPIC -fPIE -gdwarf-4 -Wall (15.2.0)

TIMECOP error (can be valgrind bug)


error 132

Process terminating with default action of signal 4 (SIGILL)
 Illegal opcode at address 0x400CA58
   at 0x...: memset (string_fortified.h:59)
   by 0x...: cpucycles_works (wrapper.c:59)
   by 0x...: supercop_cpucycles_ticks_amd64_tsc_setup (amd64-tsc.c:28)
   by 0x...: cpucycles_init (wrapper.c:314)
   by 0x...: main (try-anything.c:330)
Illegal instruction (core dumped)

Number of similar (implementation,compiler) pairs: 1, namely:
ImplementationCompiler
optimized1600lcu6clang -march=native -O2 -fwrapv -Qunused-arguments -fPIC -fPIE -gdwarf-4 -Wall (Ubuntu_Clang_21.1.8_(6ubuntu1))

TIMECOP error (can be valgrind bug)


error 132

Process terminating with default action of signal 4 (SIGILL)
 Illegal opcode at address 0x400CD18
   at 0x...: memset (string_fortified.h:59)
   by 0x...: cpucycles_works (wrapper.c:59)
   by 0x...: supercop_cpucycles_ticks_amd64_tsc_setup (amd64-tsc.c:28)
   by 0x...: cpucycles_init (wrapper.c:314)
   by 0x...: main (try-anything.c:330)
Illegal instruction (core dumped)

Number of similar (implementation,compiler) pairs: 1, namely:
ImplementationCompiler
optimized1600lcu6clang -march=native -O3 -fwrapv -Qunused-arguments -fPIC -fPIE -gdwarf-4 -Wall (Ubuntu_Clang_21.1.8_(6ubuntu1))

TIMECOP error (can be valgrind bug)


error 132

Process terminating with default action of signal 4 (SIGILL)
 Illegal opcode at address 0x400A898
   at 0x...: memset (string_fortified.h:59)
   by 0x...: cpucycles_works (wrapper.c:59)
   by 0x...: supercop_cpucycles_ticks_amd64_tsc_setup (amd64-tsc.c:28)
   by 0x...: cpucycles_init (wrapper.c:314)
   by 0x...: main (try-anything.c:330)
Illegal instruction (core dumped)

Number of similar (implementation,compiler) pairs: 1, namely:
ImplementationCompiler
optimized1600lcu6clang -march=native -Os -fwrapv -Qunused-arguments -fPIC -fPIE -gdwarf-4 -Wall (Ubuntu_Clang_21.1.8_(6ubuntu1))

TIMECOP error (can be valgrind bug)


error 132

Process terminating with default action of signal 4 (SIGILL)
 Illegal opcode at address 0x400B1D8
   at 0x...: memset (string_fortified.h:59)
   by 0x...: cpucycles_works (wrapper.c:59)
   by 0x...: supercop_cpucycles_ticks_amd64_tsc_setup (amd64-tsc.c:28)
   by 0x...: cpucycles_init (wrapper.c:314)
   by 0x...: main (try-anything.c:330)
Illegal instruction (core dumped)

Number of similar (implementation,compiler) pairs: 1, namely:
ImplementationCompiler
optimized1600lcu6gcc -march=native -mtune=native -O2 -fwrapv -fPIC -fPIE -gdwarf-4 -Wall (15.2.0)

TIMECOP error (can be valgrind bug)


error 132

Process terminating with default action of signal 4 (SIGILL)
 Illegal opcode at address 0x400C958
   at 0x...: memset (string_fortified.h:59)
   by 0x...: cpucycles_works (wrapper.c:59)
   by 0x...: supercop_cpucycles_ticks_amd64_tsc_setup (amd64-tsc.c:28)
   by 0x...: cpucycles_init (wrapper.c:314)
   by 0x...: main (try-anything.c:330)
Illegal instruction (core dumped)

Number of similar (implementation,compiler) pairs: 1, namely:
ImplementationCompiler
optimized1600lcu6gcc -march=native -mtune=native -O3 -fwrapv -fPIC -fPIE -gdwarf-4 -Wall (15.2.0)

TIMECOP error (can be valgrind bug)


error 132

Process terminating with default action of signal 4 (SIGILL)
 Illegal opcode at address 0x400B298
   at 0x...: memset (string_fortified.h:59)
   by 0x...: cpucycles_works (wrapper.c:59)
   by 0x...: supercop_cpucycles_ticks_amd64_tsc_setup (amd64-tsc.c:28)
   by 0x...: cpucycles_init (wrapper.c:314)
   by 0x...: main (try-anything.c:330)
Illegal instruction (core dumped)

Number of similar (implementation,compiler) pairs: 2, namely:
ImplementationCompiler
optimized1600lcu6gcc -march=native -mtune=native -Os -fwrapv -fPIC -fPIE -gdwarf-4 -Wall (15.2.0)
optimized1600u6gcc -march=native -mtune=native -O3 -fwrapv -fPIC -fPIE -gdwarf-4 -Wall (15.2.0)

TIMECOP error (can be valgrind bug)


error 132

Process terminating with default action of signal 4 (SIGILL)
 Illegal opcode at address 0x4015018
   at 0x...: memset (string_fortified.h:59)
   by 0x...: cpucycles_works (wrapper.c:59)
   by 0x...: supercop_cpucycles_ticks_amd64_tsc_setup (amd64-tsc.c:28)
   by 0x...: cpucycles_init (wrapper.c:314)
   by 0x...: main (try-anything.c:330)
Illegal instruction (core dumped)

Number of similar (implementation,compiler) pairs: 1, namely:
ImplementationCompiler
optimized1600lcufullclang -march=native -O2 -fwrapv -Qunused-arguments -fPIC -fPIE -gdwarf-4 -Wall (Ubuntu_Clang_21.1.8_(6ubuntu1))

TIMECOP error (can be valgrind bug)


error 132

Process terminating with default action of signal 4 (SIGILL)
 Illegal opcode at address 0x40152D8
   at 0x...: memset (string_fortified.h:59)
   by 0x...: cpucycles_works (wrapper.c:59)
   by 0x...: supercop_cpucycles_ticks_amd64_tsc_setup (amd64-tsc.c:28)
   by 0x...: cpucycles_init (wrapper.c:314)
   by 0x...: main (try-anything.c:330)
Illegal instruction (core dumped)

Number of similar (implementation,compiler) pairs: 1, namely:
ImplementationCompiler
optimized1600lcufullclang -march=native -O3 -fwrapv -Qunused-arguments -fPIC -fPIE -gdwarf-4 -Wall (Ubuntu_Clang_21.1.8_(6ubuntu1))

TIMECOP error (can be valgrind bug)


error 132

Process terminating with default action of signal 4 (SIGILL)
 Illegal opcode at address 0x4012E98
   at 0x...: memset (string_fortified.h:59)
   by 0x...: cpucycles_works (wrapper.c:59)
   by 0x...: supercop_cpucycles_ticks_amd64_tsc_setup (amd64-tsc.c:28)
   by 0x...: cpucycles_init (wrapper.c:314)
   by 0x...: main (try-anything.c:330)
Illegal instruction (core dumped)

Number of similar (implementation,compiler) pairs: 1, namely:
ImplementationCompiler
optimized1600lcufullclang -march=native -Os -fwrapv -Qunused-arguments -fPIC -fPIE -gdwarf-4 -Wall (Ubuntu_Clang_21.1.8_(6ubuntu1))

TIMECOP error (can be valgrind bug)


error 132

Process terminating with default action of signal 4 (SIGILL)
 Illegal opcode at address 0x4013558
   at 0x...: memset (string_fortified.h:59)
   by 0x...: cpucycles_works (wrapper.c:59)
   by 0x...: supercop_cpucycles_ticks_amd64_tsc_setup (amd64-tsc.c:28)
   by 0x...: cpucycles_init (wrapper.c:314)
   by 0x...: main (try-anything.c:330)
Illegal instruction (core dumped)

Number of similar (implementation,compiler) pairs: 1, namely:
ImplementationCompiler
optimized1600lcufullgcc -march=native -mtune=native -O2 -fwrapv -fPIC -fPIE -gdwarf-4 -Wall (15.2.0)

TIMECOP error (can be valgrind bug)


error 132

Process terminating with default action of signal 4 (SIGILL)
 Illegal opcode at address 0x401A7D8
   at 0x...: memset (string_fortified.h:59)
   by 0x...: cpucycles_works (wrapper.c:59)
   by 0x...: supercop_cpucycles_ticks_amd64_tsc_setup (amd64-tsc.c:28)
   by 0x...: cpucycles_init (wrapper.c:314)
   by 0x...: main (try-anything.c:330)
Illegal instruction (core dumped)

Number of similar (implementation,compiler) pairs: 1, namely:
ImplementationCompiler
optimized1600lcufullgcc -march=native -mtune=native -O3 -fwrapv -fPIC -fPIE -gdwarf-4 -Wall (15.2.0)

TIMECOP error (can be valgrind bug)


error 132

Process terminating with default action of signal 4 (SIGILL)
 Illegal opcode at address 0x4015B98
   at 0x...: memset (string_fortified.h:59)
   by 0x...: cpucycles_works (wrapper.c:59)
   by 0x...: supercop_cpucycles_ticks_amd64_tsc_setup (amd64-tsc.c:28)
   by 0x...: cpucycles_init (wrapper.c:314)
   by 0x...: main (try-anything.c:330)
Illegal instruction (core dumped)

Number of similar (implementation,compiler) pairs: 1, namely:
ImplementationCompiler
optimized1600lcufullgcc -march=native -mtune=native -Os -fwrapv -fPIC -fPIE -gdwarf-4 -Wall (15.2.0)

TIMECOP error (can be valgrind bug)


error 132

Process terminating with default action of signal 4 (SIGILL)
 Illegal opcode at address 0x4014B58
   at 0x...: memset (string_fortified.h:59)
   by 0x...: cpucycles_works (wrapper.c:59)
   by 0x...: supercop_cpucycles_ticks_amd64_tsc_setup (amd64-tsc.c:28)
   by 0x...: cpucycles_init (wrapper.c:314)
   by 0x...: main (try-anything.c:330)
Illegal instruction (core dumped)

Number of similar (implementation,compiler) pairs: 1, namely:
ImplementationCompiler
optimized1600lcufullshldclang -march=native -O2 -fwrapv -Qunused-arguments -fPIC -fPIE -gdwarf-4 -Wall (Ubuntu_Clang_21.1.8_(6ubuntu1))

TIMECOP error (can be valgrind bug)


error 132

Process terminating with default action of signal 4 (SIGILL)
 Illegal opcode at address 0x4014E18
   at 0x...: memset (string_fortified.h:59)
   by 0x...: cpucycles_works (wrapper.c:59)
   by 0x...: supercop_cpucycles_ticks_amd64_tsc_setup (amd64-tsc.c:28)
   by 0x...: cpucycles_init (wrapper.c:314)
   by 0x...: main (try-anything.c:330)
Illegal instruction (core dumped)

Number of similar (implementation,compiler) pairs: 1, namely:
ImplementationCompiler
optimized1600lcufullshldclang -march=native -O3 -fwrapv -Qunused-arguments -fPIC -fPIE -gdwarf-4 -Wall (Ubuntu_Clang_21.1.8_(6ubuntu1))

TIMECOP error (can be valgrind bug)


error 132

Process terminating with default action of signal 4 (SIGILL)
 Illegal opcode at address 0x4012B98
   at 0x...: memset (string_fortified.h:59)
   by 0x...: cpucycles_works (wrapper.c:59)
   by 0x...: supercop_cpucycles_ticks_amd64_tsc_setup (amd64-tsc.c:28)
   by 0x...: cpucycles_init (wrapper.c:314)
   by 0x...: main (try-anything.c:330)
Illegal instruction (core dumped)

Number of similar (implementation,compiler) pairs: 1, namely:
ImplementationCompiler
optimized1600lcufullshldclang -march=native -Os -fwrapv -Qunused-arguments -fPIC -fPIE -gdwarf-4 -Wall (Ubuntu_Clang_21.1.8_(6ubuntu1))

TIMECOP error (can be valgrind bug)


error 132

Process terminating with default action of signal 4 (SIGILL)
 Illegal opcode at address 0x4013318
   at 0x...: memset (string_fortified.h:59)
   by 0x...: cpucycles_works (wrapper.c:59)
   by 0x...: supercop_cpucycles_ticks_amd64_tsc_setup (amd64-tsc.c:28)
   by 0x...: cpucycles_init (wrapper.c:314)
   by 0x...: main (try-anything.c:330)
Illegal instruction (core dumped)

Number of similar (implementation,compiler) pairs: 1, namely:
ImplementationCompiler
optimized1600lcufullshldgcc -march=native -mtune=native -O2 -fwrapv -fPIC -fPIE -gdwarf-4 -Wall (15.2.0)

TIMECOP error (can be valgrind bug)


error 132

Process terminating with default action of signal 4 (SIGILL)
 Illegal opcode at address 0x4019A18
   at 0x...: memset (string_fortified.h:59)
   by 0x...: cpucycles_works (wrapper.c:59)
   by 0x...: supercop_cpucycles_ticks_amd64_tsc_setup (amd64-tsc.c:28)
   by 0x...: cpucycles_init (wrapper.c:314)
   by 0x...: main (try-anything.c:330)
Illegal instruction (core dumped)

Number of similar (implementation,compiler) pairs: 1, namely:
ImplementationCompiler
optimized1600lcufullshldgcc -march=native -mtune=native -O3 -fwrapv -fPIC -fPIE -gdwarf-4 -Wall (15.2.0)

TIMECOP error (can be valgrind bug)


error 132

Process terminating with default action of signal 4 (SIGILL)
 Illegal opcode at address 0x40141D8
   at 0x...: memset (string_fortified.h:59)
   by 0x...: cpucycles_works (wrapper.c:59)
   by 0x...: supercop_cpucycles_ticks_amd64_tsc_setup (amd64-tsc.c:28)
   by 0x...: cpucycles_init (wrapper.c:314)
   by 0x...: main (try-anything.c:330)
Illegal instruction (core dumped)

Number of similar (implementation,compiler) pairs: 1, namely:
ImplementationCompiler
optimized1600lcufullshldgcc -march=native -mtune=native -Os -fwrapv -fPIC -fPIE -gdwarf-4 -Wall (15.2.0)

TIMECOP error (can be valgrind bug)


error 132

Process terminating with default action of signal 4 (SIGILL)
 Illegal opcode at address 0x400B558
   at 0x...: memset (string_fortified.h:59)
   by 0x...: cpucycles_works (wrapper.c:59)
   by 0x...: supercop_cpucycles_ticks_amd64_tsc_setup (amd64-tsc.c:28)
   by 0x...: cpucycles_init (wrapper.c:314)
   by 0x...: main (try-anything.c:330)
Illegal instruction (core dumped)

Number of similar (implementation,compiler) pairs: 1, namely:
ImplementationCompiler
optimized1600u6clang -march=native -O2 -fwrapv -Qunused-arguments -fPIC -fPIE -gdwarf-4 -Wall (Ubuntu_Clang_21.1.8_(6ubuntu1))

TIMECOP error (can be valgrind bug)


error 132

Process terminating with default action of signal 4 (SIGILL)
 Illegal opcode at address 0x400B718
   at 0x...: memset (string_fortified.h:59)
   by 0x...: cpucycles_works (wrapper.c:59)
   by 0x...: supercop_cpucycles_ticks_amd64_tsc_setup (amd64-tsc.c:28)
   by 0x...: cpucycles_init (wrapper.c:314)
   by 0x...: main (try-anything.c:330)
Illegal instruction (core dumped)

Number of similar (implementation,compiler) pairs: 1, namely:
ImplementationCompiler
optimized1600u6clang -march=native -O3 -fwrapv -Qunused-arguments -fPIC -fPIE -gdwarf-4 -Wall (Ubuntu_Clang_21.1.8_(6ubuntu1))

TIMECOP error (can be valgrind bug)


error 132

Process terminating with default action of signal 4 (SIGILL)
 Illegal opcode at address 0x400A3D8
   at 0x...: memset (string_fortified.h:59)
   by 0x...: cpucycles_works (wrapper.c:59)
   by 0x...: supercop_cpucycles_ticks_amd64_tsc_setup (amd64-tsc.c:28)
   by 0x...: cpucycles_init (wrapper.c:314)
   by 0x...: main (try-anything.c:330)
Illegal instruction (core dumped)

Number of similar (implementation,compiler) pairs: 1, namely:
ImplementationCompiler
optimized1600u6clang -march=native -Os -fwrapv -Qunused-arguments -fPIC -fPIE -gdwarf-4 -Wall (Ubuntu_Clang_21.1.8_(6ubuntu1))

TIMECOP error (can be valgrind bug)


error 132

Process terminating with default action of signal 4 (SIGILL)
 Illegal opcode at address 0x400A998
   at 0x...: memset (string_fortified.h:59)
   by 0x...: cpucycles_works (wrapper.c:59)
   by 0x...: supercop_cpucycles_ticks_amd64_tsc_setup (amd64-tsc.c:28)
   by 0x...: cpucycles_init (wrapper.c:314)
   by 0x...: main (try-anything.c:330)
Illegal instruction (core dumped)

Number of similar (implementation,compiler) pairs: 1, namely:
ImplementationCompiler
optimized1600u6gcc -march=native -mtune=native -O2 -fwrapv -fPIC -fPIE -gdwarf-4 -Wall (15.2.0)

TIMECOP error (can be valgrind bug)


error 132

Process terminating with default action of signal 4 (SIGILL)
 Illegal opcode at address 0x400A758
   at 0x...: memset (string_fortified.h:59)
   by 0x...: cpucycles_works (wrapper.c:59)
   by 0x...: supercop_cpucycles_ticks_amd64_tsc_setup (amd64-tsc.c:28)
   by 0x...: cpucycles_init (wrapper.c:314)
   by 0x...: main (try-anything.c:330)
Illegal instruction (core dumped)

Number of similar (implementation,compiler) pairs: 1, namely:
ImplementationCompiler
optimized1600u6gcc -march=native -mtune=native -Os -fwrapv -fPIC -fPIE -gdwarf-4 -Wall (15.2.0)

TIMECOP error (can be valgrind bug)


error 132

Process terminating with default action of signal 4 (SIGILL)
 Illegal opcode at address 0x40135D8
   at 0x...: memset (string_fortified.h:59)
   by 0x...: cpucycles_works (wrapper.c:59)
   by 0x...: supercop_cpucycles_ticks_amd64_tsc_setup (amd64-tsc.c:28)
   by 0x...: cpucycles_init (wrapper.c:314)
   by 0x...: main (try-anything.c:330)
Illegal instruction (core dumped)

Number of similar (implementation,compiler) pairs: 1, namely:
ImplementationCompiler
optimized1600ufullclang -march=native -O2 -fwrapv -Qunused-arguments -fPIC -fPIE -gdwarf-4 -Wall (Ubuntu_Clang_21.1.8_(6ubuntu1))

TIMECOP error (can be valgrind bug)


error 132

Process terminating with default action of signal 4 (SIGILL)
 Illegal opcode at address 0x4013798
   at 0x...: memset (string_fortified.h:59)
   by 0x...: cpucycles_works (wrapper.c:59)
   by 0x...: supercop_cpucycles_ticks_amd64_tsc_setup (amd64-tsc.c:28)
   by 0x...: cpucycles_init (wrapper.c:314)
   by 0x...: main (try-anything.c:330)
Illegal instruction (core dumped)

Number of similar (implementation,compiler) pairs: 1, namely:
ImplementationCompiler
optimized1600ufullclang -march=native -O3 -fwrapv -Qunused-arguments -fPIC -fPIE -gdwarf-4 -Wall (Ubuntu_Clang_21.1.8_(6ubuntu1))

TIMECOP error (can be valgrind bug)


error 132

Process terminating with default action of signal 4 (SIGILL)
 Illegal opcode at address 0x4012398
   at 0x...: memset (string_fortified.h:59)
   by 0x...: cpucycles_works (wrapper.c:59)
   by 0x...: supercop_cpucycles_ticks_amd64_tsc_setup (amd64-tsc.c:28)
   by 0x...: cpucycles_init (wrapper.c:314)
   by 0x...: main (try-anything.c:330)
Illegal instruction (core dumped)

Number of similar (implementation,compiler) pairs: 1, namely:
ImplementationCompiler
optimized1600ufullclang -march=native -Os -fwrapv -Qunused-arguments -fPIC -fPIE -gdwarf-4 -Wall (Ubuntu_Clang_21.1.8_(6ubuntu1))

TIMECOP error (can be valgrind bug)


error 132

Process terminating with default action of signal 4 (SIGILL)
 Illegal opcode at address 0x4012598
   at 0x...: memset (string_fortified.h:59)
   by 0x...: cpucycles_works (wrapper.c:59)
   by 0x...: supercop_cpucycles_ticks_amd64_tsc_setup (amd64-tsc.c:28)
   by 0x...: cpucycles_init (wrapper.c:314)
   by 0x...: main (try-anything.c:330)
Illegal instruction (core dumped)

Number of similar (implementation,compiler) pairs: 1, namely:
ImplementationCompiler
optimized1600ufullgcc -march=native -mtune=native -O2 -fwrapv -fPIC -fPIE -gdwarf-4 -Wall (15.2.0)

TIMECOP error (can be valgrind bug)


error 132

Process terminating with default action of signal 4 (SIGILL)
 Illegal opcode at address 0x4017818
   at 0x...: memset (string_fortified.h:59)
   by 0x...: cpucycles_works (wrapper.c:59)
   by 0x...: supercop_cpucycles_ticks_amd64_tsc_setup (amd64-tsc.c:28)
   by 0x...: cpucycles_init (wrapper.c:314)
   by 0x...: main (try-anything.c:330)
Illegal instruction (core dumped)

Number of similar (implementation,compiler) pairs: 1, namely:
ImplementationCompiler
optimized1600ufullgcc -march=native -mtune=native -O3 -fwrapv -fPIC -fPIE -gdwarf-4 -Wall (15.2.0)

TIMECOP error (can be valgrind bug)


error 132

Process terminating with default action of signal 4 (SIGILL)
 Illegal opcode at address 0x40148D8
   at 0x...: memset (string_fortified.h:59)
   by 0x...: cpucycles_works (wrapper.c:59)
   by 0x...: supercop_cpucycles_ticks_amd64_tsc_setup (amd64-tsc.c:28)
   by 0x...: cpucycles_init (wrapper.c:314)
   by 0x...: main (try-anything.c:330)
Illegal instruction (core dumped)

Number of similar (implementation,compiler) pairs: 1, namely:
ImplementationCompiler
optimized1600ufullgcc -march=native -mtune=native -Os -fwrapv -fPIC -fPIE -gdwarf-4 -Wall (15.2.0)

TIMECOP error (can be valgrind bug)


error 132

Process terminating with default action of signal 4 (SIGILL)
 Illegal opcode at address 0x4006098
   at 0x...: memset (string_fortified.h:59)
   by 0x...: cpucycles_works (wrapper.c:59)
   by 0x...: supercop_cpucycles_ticks_amd64_tsc_setup (amd64-tsc.c:28)
   by 0x...: cpucycles_init (wrapper.c:314)
   by 0x...: main (try-anything.c:330)
Illegal instruction (core dumped)

Number of similar (implementation,compiler) pairs: 1, namely:
ImplementationCompiler
reference1600clang -march=native -O2 -fwrapv -Qunused-arguments -fPIC -fPIE -gdwarf-4 -Wall (Ubuntu_Clang_21.1.8_(6ubuntu1))

TIMECOP error (can be valgrind bug)


error 132

Process terminating with default action of signal 4 (SIGILL)
 Illegal opcode at address 0x4006258
   at 0x...: memset (string_fortified.h:59)
   by 0x...: cpucycles_works (wrapper.c:59)
   by 0x...: supercop_cpucycles_ticks_amd64_tsc_setup (amd64-tsc.c:28)
   by 0x...: cpucycles_init (wrapper.c:314)
   by 0x...: main (try-anything.c:330)
Illegal instruction (core dumped)

Number of similar (implementation,compiler) pairs: 1, namely:
ImplementationCompiler
reference1600clang -march=native -O3 -fwrapv -Qunused-arguments -fPIC -fPIE -gdwarf-4 -Wall (Ubuntu_Clang_21.1.8_(6ubuntu1))

TIMECOP error (can be valgrind bug)


error 132

Process terminating with default action of signal 4 (SIGILL)
 Illegal opcode at address 0x4005118
   at 0x...: memset (string_fortified.h:59)
   by 0x...: cpucycles_works (wrapper.c:59)
   by 0x...: supercop_cpucycles_ticks_amd64_tsc_setup (amd64-tsc.c:28)
   by 0x...: cpucycles_init (wrapper.c:314)
   by 0x...: main (try-anything.c:330)
Illegal instruction (core dumped)

Number of similar (implementation,compiler) pairs: 1, namely:
ImplementationCompiler
reference1600clang -march=native -Os -fwrapv -Qunused-arguments -fPIC -fPIE -gdwarf-4 -Wall (Ubuntu_Clang_21.1.8_(6ubuntu1))

TIMECOP error (can be valgrind bug)


error 132

Process terminating with default action of signal 4 (SIGILL)
 Illegal opcode at address 0x4005798
   at 0x...: memset (string_fortified.h:59)
   by 0x...: cpucycles_works (wrapper.c:59)
   by 0x...: supercop_cpucycles_ticks_amd64_tsc_setup (amd64-tsc.c:28)
   by 0x...: cpucycles_init (wrapper.c:314)
   by 0x...: main (try-anything.c:330)
Illegal instruction (core dumped)

Number of similar (implementation,compiler) pairs: 1, namely:
ImplementationCompiler
reference1600gcc -march=native -mtune=native -O2 -fwrapv -fPIC -fPIE -gdwarf-4 -Wall (15.2.0)

TIMECOP error (can be valgrind bug)


error 132

Process terminating with default action of signal 4 (SIGILL)
 Illegal opcode at address 0x4005FD8
   at 0x...: memset (string_fortified.h:59)
   by 0x...: cpucycles_works (wrapper.c:59)
   by 0x...: supercop_cpucycles_ticks_amd64_tsc_setup (amd64-tsc.c:28)
   by 0x...: cpucycles_init (wrapper.c:314)
   by 0x...: main (try-anything.c:330)
Illegal instruction (core dumped)

Number of similar (implementation,compiler) pairs: 1, namely:
ImplementationCompiler
reference1600gcc -march=native -mtune=native -O3 -fwrapv -fPIC -fPIE -gdwarf-4 -Wall (15.2.0)

TIMECOP error (can be valgrind bug)


error 132

Process terminating with default action of signal 4 (SIGILL)
 Illegal opcode at address 0x4004C98
   at 0x...: memset (string_fortified.h:59)
   by 0x...: cpucycles_works (wrapper.c:59)
   by 0x...: supercop_cpucycles_ticks_amd64_tsc_setup (amd64-tsc.c:28)
   by 0x...: cpucycles_init (wrapper.c:314)
   by 0x...: main (try-anything.c:330)
Illegal instruction (core dumped)

Number of similar (implementation,compiler) pairs: 1, namely:
ImplementationCompiler
reference1600gcc -march=native -mtune=native -Os -fwrapv -fPIC -fPIE -gdwarf-4 -Wall (15.2.0)