Test results for amd64, h2atom, crypto_hashblocks/sha512

[Page version: 20260919 18:54:16]

Measurements for amd64, h2atom, crypto_hashblocks Test results for amd64, h2atom, crypto_hashblocks Test results for crypto_hashblocks/sha512
Computer: h2atom
Microarchitecture: amd64; Bonnell (106ca)
Architecture: amd64
CPU ID: GenuineIntel-000106ca-bfe9fbff
SUPERCOP version: 20260330
Operation: crypto_hashblocks
Primitive: sha512
TimeObject sizeTest sizeImplementationCompilerBenchmark dateSUPERCOP version
2991116733 0 038396 1240 1480refclang -march=native -O2 -fwrapv -Qunused-arguments -fPIC -fPIE -gdwarf-4 -Wall2026051320260330
2991116733 0 039588 1240 1480refclang -march=native -O3 -fwrapv -Qunused-arguments -fPIC -fPIE -gdwarf-4 -Wall2026051320260330
3017416922 0 038588 1240 1480inplaceclang -march=native -O2 -fwrapv -Qunused-arguments -fPIC -fPIE -gdwarf-4 -Wall2026051320260330
3017416922 0 039780 1240 1480inplaceclang -march=native -O3 -fwrapv -Qunused-arguments -fPIC -fPIE -gdwarf-4 -Wall2026051320260330
3132216733 0 037132 1240 1480refclang -march=native -O -fwrapv -Qunused-arguments -fPIC -fPIE -gdwarf-4 -Wall2026051320260330
3158516922 0 037324 1240 1480inplaceclang -march=native -O -fwrapv -Qunused-arguments -fPIC -fPIE -gdwarf-4 -Wall2026051320260330
316415029 0 027908 1240 1480compactclang -march=native -O3 -fwrapv -Qunused-arguments -fPIC -fPIE -gdwarf-4 -Wall2026051320260330
317274725 0 026412 1240 1480compactclang -march=native -O2 -fwrapv -Qunused-arguments -fPIC -fPIE -gdwarf-4 -Wall2026051320260330
3212917096 0 036894 1232 1480inplaceclang -march=native -Os -fwrapv -Qunused-arguments -fPIC -fPIE -gdwarf-4 -Wall2026051320260330
3228217132 0 036926 1232 1480refclang -march=native -Os -fwrapv -Qunused-arguments -fPIC -fPIE -gdwarf-4 -Wall2026051320260330
336634389 0 024812 1240 1480compactclang -march=native -O -fwrapv -Qunused-arguments -fPIC -fPIE -gdwarf-4 -Wall2026051320260330
338154364 0 024174 1232 1480compactclang -march=native -Os -fwrapv -Qunused-arguments -fPIC -fPIE -gdwarf-4 -Wall2026051320260330
3394716425 0 039491 1224 1576refgcc -march=native -mtune=native -O3 -fwrapv -fPIC -fPIE -gdwarf-4 -Wall2026051320260330
343683526 0 023302 1232 1480wflipclang -march=native -Os -fwrapv -Qunused-arguments -fPIC -fPIE -gdwarf-4 -Wall2026051320260330
347623942 0 025612 1240 1480wflipclang -march=native -O2 -fwrapv -Qunused-arguments -fPIC -fPIE -gdwarf-4 -Wall2026051320260330
347623942 0 026804 1240 1480wflipclang -march=native -O3 -fwrapv -Qunused-arguments -fPIC -fPIE -gdwarf-4 -Wall2026051320260330
3484916509 0 039603 1224 1576inplacegcc -march=native -mtune=native -O3 -fwrapv -fPIC -fPIE -gdwarf-4 -Wall2026051320260330
3524216734 0 038723 1224 1576refgcc -march=native -mtune=native -O2 -fwrapv -fPIC -fPIE -gdwarf-4 -Wall2026051320260330
356201998 0 024860 1240 1480compact4clang -march=native -O3 -fwrapv -Qunused-arguments -fPIC -fPIE -gdwarf-4 -Wall2026051320260330
3595516826 0 038851 1224 1576inplacegcc -march=native -mtune=native -O2 -fwrapv -fPIC -fPIE -gdwarf-4 -Wall2026051320260330
360424805 0 027931 1224 1576compactgcc -march=native -mtune=native -O3 -fwrapv -fPIC -fPIE -gdwarf-4 -Wall2026051320260330
361004568 0 026595 1224 1576compactgcc -march=native -mtune=native -O2 -fwrapv -fPIC -fPIE -gdwarf-4 -Wall2026051320260330
362373468 0 026499 1224 1576wflipgcc -march=native -mtune=native -O3 -fwrapv -fPIC -fPIE -gdwarf-4 -Wall2026051320260330
364343786 0 025739 1224 1576wflipgcc -march=native -mtune=native -O2 -fwrapv -fPIC -fPIE -gdwarf-4 -Wall2026051320260330
365691726 0 023396 1240 1480compact4clang -march=native -O2 -fwrapv -Qunused-arguments -fPIC -fPIE -gdwarf-4 -Wall2026051320260330
366553577 0 023980 1240 1480wflipclang -march=native -O -fwrapv -Qunused-arguments -fPIC -fPIE -gdwarf-4 -Wall2026051320260330
3692416870 0 039748 1240 1480refclang -mcpu=native -O3 -fwrapv -Qunused-arguments -fPIC -fPIE -gdwarf-4 -Wall2026051320260330
3708217036 0 039924 1240 1480inplaceclang -mcpu=native -O3 -fwrapv -Qunused-arguments -fPIC -fPIE -gdwarf-4 -Wall2026051320260330
375534946 0 027852 1240 1480compactclang -mcpu=native -O3 -fwrapv -Qunused-arguments -fPIC -fPIE -gdwarf-4 -Wall2026051320260330
3764816643 0 036737 1200 1544refgcc -march=native -mtune=native -Os -fwrapv -fPIC -fPIE -gdwarf-4 -Wall2026051320260330
378321244 0 021652 1240 1480compact4clang -march=native -O -fwrapv -Qunused-arguments -fPIC -fPIE -gdwarf-4 -Wall2026051320260330
380261311 0 021110 1232 1480compact4clang -march=native -Os -fwrapv -Qunused-arguments -fPIC -fPIE -gdwarf-4 -Wall2026051320260330
3859916636 0 036737 1200 1544inplacegcc -march=native -mtune=native -Os -fwrapv -fPIC -fPIE -gdwarf-4 -Wall2026051320260330
388423842 0 026724 1240 1480wflipclang -mcpu=native -O3 -fwrapv -Qunused-arguments -fPIC -fPIE -gdwarf-4 -Wall2026051320260330
403341697 0 023731 1224 1576compact4gcc -march=native -mtune=native -O2 -fwrapv -fPIC -fPIE -gdwarf-4 -Wall2026051320260330
405234472 0 024577 1200 1544compactgcc -march=native -mtune=native -Os -fwrapv -fPIC -fPIE -gdwarf-4 -Wall2026051320260330
411073777 0 023817 1200 1544wflipgcc -march=native -mtune=native -Os -fwrapv -fPIC -fPIE -gdwarf-4 -Wall2026051320260330
417562120 0 025227 1224 1576compact4gcc -march=native -mtune=native -O3 -fwrapv -fPIC -fPIE -gdwarf-4 -Wall2026051320260330
4263516991 0 038314 1216 1576refgcc -march=native -mtune=native -O -fwrapv -fPIC -fPIE -gdwarf-4 -Wall2026051320260330
426451981 0 024876 1240 1480compact4clang -mcpu=native -O3 -fwrapv -Qunused-arguments -fPIC -fPIE -gdwarf-4 -Wall2026051320260330
443294647 0 026018 1216 1576compactgcc -march=native -mtune=native -O -fwrapv -fPIC -fPIE -gdwarf-4 -Wall2026051320260330
4444117213 0 038570 1216 1576inplacegcc -march=native -mtune=native -O -fwrapv -fPIC -fPIE -gdwarf-4 -Wall2026051320260330
451155607 0 026874 1216 1576wflipgcc -march=native -mtune=native -O -fwrapv -fPIC -fPIE -gdwarf-4 -Wall2026051320260330
460241397 0 021489 1200 1544compact4gcc -march=native -mtune=native -Os -fwrapv -fPIC -fPIE -gdwarf-4 -Wall2026051320260330
525411561 0 022914 1216 1576compact4gcc -march=native -mtune=native -O -fwrapv -fPIC -fPIE -gdwarf-4 -Wall2026051320260330
681922009 0 024876 1240 1480compact3clang -march=native -O3 -fwrapv -Qunused-arguments -fPIC -fPIE -gdwarf-4 -Wall2026051320260330
688863334 0 026188 1240 1480compact2clang -march=native -O3 -fwrapv -Qunused-arguments -fPIC -fPIE -gdwarf-4 -Wall2026051320260330
691691609 0 023284 1240 1480compact3clang -march=native -O2 -fwrapv -Qunused-arguments -fPIC -fPIE -gdwarf-4 -Wall2026051320260330
693382251 0 023932 1240 1480compact2clang -march=native -O2 -fwrapv -Qunused-arguments -fPIC -fPIE -gdwarf-4 -Wall2026051320260330
708231549 0 021374 1232 1480compact2clang -march=native -Os -fwrapv -Qunused-arguments -fPIC -fPIE -gdwarf-4 -Wall2026051320260330
723541365 0 021174 1232 1480compact3clang -march=native -Os -fwrapv -Qunused-arguments -fPIC -fPIE -gdwarf-4 -Wall2026051320260330
742491324 0 021732 1240 1480compact3clang -march=native -O -fwrapv -Qunused-arguments -fPIC -fPIE -gdwarf-4 -Wall2026051320260330
747651883 0 022300 1240 1480compact2clang -march=native -O -fwrapv -Qunused-arguments -fPIC -fPIE -gdwarf-4 -Wall2026051320260330
810121737 0 023763 1224 1576compact3gcc -march=native -mtune=native -O2 -fwrapv -fPIC -fPIE -gdwarf-4 -Wall2026051320260330
905933271 0 026156 1240 1480compact2clang -mcpu=native -O3 -fwrapv -Qunused-arguments -fPIC -fPIE -gdwarf-4 -Wall2026051320260330
917491522 0 021617 1200 1544compact3gcc -march=native -mtune=native -Os -fwrapv -fPIC -fPIE -gdwarf-4 -Wall2026051320260330
924651982 0 024876 1240 1480compact3clang -mcpu=native -O3 -fwrapv -Qunused-arguments -fPIC -fPIE -gdwarf-4 -Wall2026051320260330
967251763 0 021865 1200 1544compact2gcc -march=native -mtune=native -Os -fwrapv -fPIC -fPIE -gdwarf-4 -Wall2026051320260330
1028241956 0 025067 1224 1576compact3gcc -march=native -mtune=native -O3 -fwrapv -fPIC -fPIE -gdwarf-4 -Wall2026051320260330
1059012061 0 025187 1224 1576compact2gcc -march=native -mtune=native -O3 -fwrapv -fPIC -fPIE -gdwarf-4 -Wall2026051320260330
1059401824 0 023851 1224 1576compact2gcc -march=native -mtune=native -O2 -fwrapv -fPIC -fPIE -gdwarf-4 -Wall2026051320260330
1080621894 0 023258 1216 1576compact2gcc -march=native -mtune=native -O -fwrapv -fPIC -fPIE -gdwarf-4 -Wall2026051320260330
1093341709 0 023058 1216 1576compact3gcc -march=native -mtune=native -O -fwrapv -fPIC -fPIE -gdwarf-4 -Wall2026051320260330

Test failure


error 132
timeout: the monitored command dumped core
Illegal instruction

Number of similar (implementation,compiler) pairs: 9, namely:
ImplementationCompiler
avx2clang -march=native -O2 -fwrapv -Qunused-arguments -fPIC -fPIE -gdwarf-4 -Wall (Ubuntu_Clang_18.1.3_(1ubuntu1))
avx2clang -march=native -O3 -fwrapv -Qunused-arguments -fPIC -fPIE -gdwarf-4 -Wall (Ubuntu_Clang_18.1.3_(1ubuntu1))
avx2clang -march=native -O -fwrapv -Qunused-arguments -fPIC -fPIE -gdwarf-4 -Wall (Ubuntu_Clang_18.1.3_(1ubuntu1))
avx2clang -march=native -Os -fwrapv -Qunused-arguments -fPIC -fPIE -gdwarf-4 -Wall (Ubuntu_Clang_18.1.3_(1ubuntu1))
avx2clang -mcpu=native -O3 -fwrapv -Qunused-arguments -fPIC -fPIE -gdwarf-4 -Wall (Ubuntu_Clang_18.1.3_(1ubuntu1))
avx2gcc -march=native -mtune=native -O2 -fwrapv -fPIC -fPIE -gdwarf-4 -Wall (13.3.0)
avx2gcc -march=native -mtune=native -O3 -fwrapv -fPIC -fPIE -gdwarf-4 -Wall (13.3.0)
avx2gcc -march=native -mtune=native -O -fwrapv -fPIC -fPIE -gdwarf-4 -Wall (13.3.0)
avx2gcc -march=native -mtune=native -Os -fwrapv -fPIC -fPIE -gdwarf-4 -Wall (13.3.0)

Compiler output


inner.c: inner.c:88:14: error: always_inline function '_mm256_loadu_si256' requires target feature 'avx', but would be inlined into function 'crypto_hashblocks_sha512_avx_constbranchindex_inner' that is compiled without support for 'avx'
inner.c:    88 |         X0 = _mm256_loadu_si256((void *) (in+0));
inner.c:       |              ^
inner.c: inner.c:88:14: error: AVX vector return of type '__m256i' (vector of 4 'long long' values) without 'avx' enabled changes the ABI
inner.c: inner.c:89:37: error: always_inline function '_mm256_set_epi8' requires target feature 'avx', but would be inlined into function 'crypto_hashblocks_sha512_avx_constbranchindex_inner' that is compiled without support for 'avx'
inner.c:    89 |         X0 = _mm256_shuffle_epi8(X0,bigendian64);
inner.c:       |                                     ^
inner.c: inner.c:26:21: note: expanded from macro 'bigendian64'
inner.c:    26 | #define bigendian64 _mm256_set_epi8(8,9,10,11,12,13,14,15,0,1,2,3,4,5,6,7,8,9,10,11,12,13,14,15,0,1,2,3,4,5,6,7)
inner.c:       |                     ^
inner.c: inner.c:89:37: error: AVX vector return of type '__m256i' (vector of 4 'long long' values) without 'avx' enabled changes the ABI
inner.c: inner.c:26:21: note: expanded from macro 'bigendian64'
inner.c:    26 | #define bigendian64 _mm256_set_epi8(8,9,10,11,12,13,14,15,0,1,2,3,4,5,6,7,8,9,10,11,12,13,14,15,0,1,2,3,4,5,6,7)
inner.c:       |                     ^
inner.c: inner.c:89:14: error: always_inline function '_mm256_shuffle_epi8' requires target feature 'avx2', but would be inlined into function 'crypto_hashblocks_sha512_avx_constbranchindex_inner' that is compiled without support for 'avx2'
inner.c:    89 |         X0 = _mm256_shuffle_epi8(X0,bigendian64);
inner.c:       |              ^
inner.c: inner.c:89:14: error: AVX vector argument of type '__m256i' (vector of 4 'long long' values) without 'avx' enabled changes the ABI
inner.c: inner.c:90:14: error: always_inline function '_mm256_loadu_si256' requires target feature 'avx', but would be inlined into function 'crypto_hashblocks_sha512_avx_constbranchindex_inner' that is compiled without support for 'avx'
inner.c:    90 |         D0 = _mm256_loadu_si256((void *) &constants[0]);
inner.c:       |              ^
inner.c: inner.c:90:14: error: AVX vector return of type '__m256i' (vector of 4 'long long' values) without 'avx' enabled changes the ABI
inner.c: inner.c:91:14: error: always_inline function '_mm256_add_epi64' requires target feature 'avx2', but would be inlined into function 'crypto_hashblocks_sha512_avx_constbranchindex_inner' that is compiled without support for 'avx2'
inner.c:    91 |         D0 = _mm256_add_epi64(X0,D0);
inner.c:       |              ^
inner.c: ...

Number of similar (implementation,compiler) pairs: 5, namely:
ImplementationCompiler
avxclang -march=native -O2 -fwrapv -Qunused-arguments -fPIC -fPIE -gdwarf-4 -Wall (Ubuntu_Clang_18.1.3_(1ubuntu1))
avxclang -march=native -O3 -fwrapv -Qunused-arguments -fPIC -fPIE -gdwarf-4 -Wall (Ubuntu_Clang_18.1.3_(1ubuntu1))
avxclang -march=native -O -fwrapv -Qunused-arguments -fPIC -fPIE -gdwarf-4 -Wall (Ubuntu_Clang_18.1.3_(1ubuntu1))
avxclang -march=native -Os -fwrapv -Qunused-arguments -fPIC -fPIE -gdwarf-4 -Wall (Ubuntu_Clang_18.1.3_(1ubuntu1))
avxclang -mcpu=native -O3 -fwrapv -Qunused-arguments -fPIC -fPIE -gdwarf-4 -Wall (Ubuntu_Clang_18.1.3_(1ubuntu1))

Compiler output


inner.c: inner.c: In function 'crypto_hashblocks_sha512_avx_constbranchindex_inner':
inner.c: inner.c:88:12: warning: AVX vector return without AVX enabled changes the ABI [-Wpsabi]
inner.c:    88 |         X0 = _mm256_loadu_si256((void *) (in+0));
inner.c:       |         ~~~^~~~~~~~~~~~~~~~~~~~~~~~~~~~~~~~~~~~~
inner.c: In file included from /usr/lib/gcc/x86_64-linux-gnu/13/include/immintrin.h:51,
inner.c:                  from inner.c:3:
inner.c: /usr/lib/gcc/x86_64-linux-gnu/13/include/avx2intrin.h:126:1: error: inlining failed in call to 'always_inline' '_mm256_add_epi64': target specific option mismatch
inner.c:   126 | _mm256_add_epi64 (__m256i __A, __m256i __B)
inner.c:       | ^~~~~~~~~~~~~~~~
inner.c: inner.c:122:15: note: called from here
inner.c:   122 |         D12 = _mm256_add_epi64(X12,D12);
inner.c:       |               ^~~~~~~~~~~~~~~~~~~~~~~~~
inner.c: In file included from /usr/lib/gcc/x86_64-linux-gnu/13/include/immintrin.h:43:
inner.c: /usr/lib/gcc/x86_64-linux-gnu/13/include/avxintrin.h:927:1: error: inlining failed in call to 'always_inline' '_mm256_loadu_si256': target specific option mismatch
inner.c:   927 | _mm256_loadu_si256 (__m256i_u const *__P)
inner.c:       | ^~~~~~~~~~~~~~~~~~
inner.c: inner.c:121:15: note: called from here
inner.c:   121 |         D12 = _mm256_loadu_si256((void *) &constants[12]);
inner.c:       |               ^~~~~~~~~~~~~~~~~~~~~~~~~~~~~~~~~~~~~~~~~~~
inner.c: /usr/lib/gcc/x86_64-linux-gnu/13/include/avx2intrin.h:588:1: error: inlining failed in call to 'always_inline' '_mm256_shuffle_epi8': target specific option mismatch
inner.c:   588 | _mm256_shuffle_epi8 (__m256i __X, __m256i __Y)
inner.c:       | ^~~~~~~~~~~~~~~~~~~
inner.c: inner.c:120:15: note: called from here
inner.c:   120 |         X12 = _mm256_shuffle_epi8(X12,bigendian64);
inner.c:       |               ^~~~~~~~~~~~~~~~~~~~~~~~~~~~~~~~~~~~
inner.c: ...

Number of similar (implementation,compiler) pairs: 4, namely:
ImplementationCompiler
avxgcc -march=native -mtune=native -O2 -fwrapv -fPIC -fPIE -gdwarf-4 -Wall (13.3.0)
avxgcc -march=native -mtune=native -O3 -fwrapv -fPIC -fPIE -gdwarf-4 -Wall (13.3.0)
avxgcc -march=native -mtune=native -O -fwrapv -fPIC -fPIE -gdwarf-4 -Wall (13.3.0)
avxgcc -march=native -mtune=native -Os -fwrapv -fPIC -fPIE -gdwarf-4 -Wall (13.3.0)

Compiler output


try.c: /usr/bin/ld: libcrypto_hashblocks_sha512.a(blocks.o): in function `crypto_hashblocks_sha512_dolbeau_intelavx2rorxasm_constbranchindex':
try.c: .../supercop-data/h2atom/amd64/try/c/clang_-march=native_-O2_-fwrapv_-Qunused-arguments_-fPIC_-fPIE_-gdwarf-4_-Wall/constbranchindex/crypto_hashblocks/sha512/dolbeau/intelavx2rorxasm/work/blocks.c:45:(.text+0x...): undefined reference to `sha512_rorx'
try.c: clang: error: linker command failed with exit code 1 (use -v to see invocation)

Number of similar (implementation,compiler) pairs: 1, namely:
ImplementationCompiler
dolbeau/intelavx2rorxasmclang -march=native -O2 -fwrapv -Qunused-arguments -fPIC -fPIE -gdwarf-4 -Wall (Ubuntu_Clang_18.1.3_(1ubuntu1))

Compiler output


try.c: /usr/bin/ld: libcrypto_hashblocks_sha512.a(blocks.o): in function `crypto_hashblocks_sha512_dolbeau_intelavx2rorxasm_constbranchindex':
try.c: .../supercop-data/h2atom/amd64/try/c/clang_-march=native_-O3_-fwrapv_-Qunused-arguments_-fPIC_-fPIE_-gdwarf-4_-Wall/constbranchindex/crypto_hashblocks/sha512/dolbeau/intelavx2rorxasm/work/blocks.c:45:(.text+0x...): undefined reference to `sha512_rorx'
try.c: clang: error: linker command failed with exit code 1 (use -v to see invocation)

Number of similar (implementation,compiler) pairs: 1, namely:
ImplementationCompiler
dolbeau/intelavx2rorxasmclang -march=native -O3 -fwrapv -Qunused-arguments -fPIC -fPIE -gdwarf-4 -Wall (Ubuntu_Clang_18.1.3_(1ubuntu1))

Compiler output


try.c: /usr/bin/ld: libcrypto_hashblocks_sha512.a(blocks.o): in function `crypto_hashblocks_sha512_dolbeau_intelavx2rorxasm_constbranchindex':
try.c: .../supercop-data/h2atom/amd64/try/c/clang_-march=native_-O_-fwrapv_-Qunused-arguments_-fPIC_-fPIE_-gdwarf-4_-Wall/constbranchindex/crypto_hashblocks/sha512/dolbeau/intelavx2rorxasm/work/blocks.c:45:(.text+0x...): undefined reference to `sha512_rorx'
try.c: clang: error: linker command failed with exit code 1 (use -v to see invocation)

Number of similar (implementation,compiler) pairs: 1, namely:
ImplementationCompiler
dolbeau/intelavx2rorxasmclang -march=native -O -fwrapv -Qunused-arguments -fPIC -fPIE -gdwarf-4 -Wall (Ubuntu_Clang_18.1.3_(1ubuntu1))

Compiler output


try.c: /usr/bin/ld: libcrypto_hashblocks_sha512.a(blocks.o): in function `crypto_hashblocks_sha512_dolbeau_intelavx2rorxasm_constbranchindex':
try.c: .../supercop-data/h2atom/amd64/try/c/clang_-march=native_-Os_-fwrapv_-Qunused-arguments_-fPIC_-fPIE_-gdwarf-4_-Wall/constbranchindex/crypto_hashblocks/sha512/dolbeau/intelavx2rorxasm/work/blocks.c:45:(.text+0x...): undefined reference to `sha512_rorx'
try.c: clang: error: linker command failed with exit code 1 (use -v to see invocation)

Number of similar (implementation,compiler) pairs: 1, namely:
ImplementationCompiler
dolbeau/intelavx2rorxasmclang -march=native -Os -fwrapv -Qunused-arguments -fPIC -fPIE -gdwarf-4 -Wall (Ubuntu_Clang_18.1.3_(1ubuntu1))

Compiler output


try.c: /usr/bin/ld: libcrypto_hashblocks_sha512.a(blocks.o): in function `crypto_hashblocks_sha512_dolbeau_intelavx2rorxasm_constbranchindex':
try.c: .../supercop-data/h2atom/amd64/try/c/clang_-mcpu=native_-O3_-fwrapv_-Qunused-arguments_-fPIC_-fPIE_-gdwarf-4_-Wall/constbranchindex/crypto_hashblocks/sha512/dolbeau/intelavx2rorxasm/work/blocks.c:45:(.text+0x...): undefined reference to `sha512_rorx'
try.c: clang: error: linker command failed with exit code 1 (use -v to see invocation)

Number of similar (implementation,compiler) pairs: 1, namely:
ImplementationCompiler
dolbeau/intelavx2rorxasmclang -mcpu=native -O3 -fwrapv -Qunused-arguments -fPIC -fPIE -gdwarf-4 -Wall (Ubuntu_Clang_18.1.3_(1ubuntu1))

Compiler output


try.c: /usr/bin/ld: libcrypto_hashblocks_sha512.a(blocks.o): in function `crypto_hashblocks_sha512_dolbeau_intelavx2rorxasm_constbranchindex':
try.c: .../supercop-data/h2atom/amd64/try/c/gcc_-march=native_-mtune=native_-O2_-fwrapv_-fPIC_-fPIE_-gdwarf-4_-Wall/constbranchindex/crypto_hashblocks/sha512/dolbeau/intelavx2rorxasm/work/blocks.c:45:(.text+0x...): undefined reference to `sha512_rorx'
try.c: collect2: error: ld returned 1 exit status

Number of similar (implementation,compiler) pairs: 1, namely:
ImplementationCompiler
dolbeau/intelavx2rorxasmgcc -march=native -mtune=native -O2 -fwrapv -fPIC -fPIE -gdwarf-4 -Wall (13.3.0)

Compiler output


try.c: /usr/bin/ld: libcrypto_hashblocks_sha512.a(blocks.o): in function `crypto_hashblocks_sha512_dolbeau_intelavx2rorxasm_constbranchindex':
try.c: .../supercop-data/h2atom/amd64/try/c/gcc_-march=native_-mtune=native_-O3_-fwrapv_-fPIC_-fPIE_-gdwarf-4_-Wall/constbranchindex/crypto_hashblocks/sha512/dolbeau/intelavx2rorxasm/work/blocks.c:45:(.text+0x...): undefined reference to `sha512_rorx'
try.c: /usr/bin/ld: .../supercop-data/h2atom/amd64/try/c/gcc_-march=native_-mtune=native_-O3_-fwrapv_-fPIC_-fPIE_-gdwarf-4_-Wall/constbranchindex/crypto_hashblocks/sha512/dolbeau/intelavx2rorxasm/work/blocks.c:45:(.text+0x...): undefined reference to `sha512_rorx'
try.c: collect2: error: ld returned 1 exit status

Number of similar (implementation,compiler) pairs: 1, namely:
ImplementationCompiler
dolbeau/intelavx2rorxasmgcc -march=native -mtune=native -O3 -fwrapv -fPIC -fPIE -gdwarf-4 -Wall (13.3.0)

Compiler output


try.c: /usr/bin/ld: libcrypto_hashblocks_sha512.a(blocks.o): in function `crypto_hashblocks_sha512_dolbeau_intelavx2rorxasm_constbranchindex':
try.c: .../supercop-data/h2atom/amd64/try/c/gcc_-march=native_-mtune=native_-O_-fwrapv_-fPIC_-fPIE_-gdwarf-4_-Wall/constbranchindex/crypto_hashblocks/sha512/dolbeau/intelavx2rorxasm/work/blocks.c:45:(.text+0x...): undefined reference to `sha512_rorx'
try.c: collect2: error: ld returned 1 exit status

Number of similar (implementation,compiler) pairs: 1, namely:
ImplementationCompiler
dolbeau/intelavx2rorxasmgcc -march=native -mtune=native -O -fwrapv -fPIC -fPIE -gdwarf-4 -Wall (13.3.0)

Compiler output


try.c: /usr/bin/ld: libcrypto_hashblocks_sha512.a(blocks.o): in function `crypto_hashblocks_sha512_dolbeau_intelavx2rorxasm_constbranchindex':
try.c: .../supercop-data/h2atom/amd64/try/c/gcc_-march=native_-mtune=native_-Os_-fwrapv_-fPIC_-fPIE_-gdwarf-4_-Wall/constbranchindex/crypto_hashblocks/sha512/dolbeau/intelavx2rorxasm/work/blocks.c:45:(.text+0x...): undefined reference to `sha512_rorx'
try.c: collect2: error: ld returned 1 exit status

Number of similar (implementation,compiler) pairs: 1, namely:
ImplementationCompiler
dolbeau/intelavx2rorxasmgcc -march=native -mtune=native -Os -fwrapv -fPIC -fPIE -gdwarf-4 -Wall (13.3.0)

Compiler output


try.c: /usr/bin/ld: libcrypto_hashblocks_sha512.a(blocks.o): in function `crypto_hashblocks_sha512_dolbeau_intelavxasm_constbranchindex':
try.c: .../supercop-data/h2atom/amd64/try/c/clang_-march=native_-O2_-fwrapv_-Qunused-arguments_-fPIC_-fPIE_-gdwarf-4_-Wall/constbranchindex/crypto_hashblocks/sha512/dolbeau/intelavxasm/work/blocks.c:45:(.text+0x...): undefined reference to `sha512_avx'
try.c: clang: error: linker command failed with exit code 1 (use -v to see invocation)

Number of similar (implementation,compiler) pairs: 1, namely:
ImplementationCompiler
dolbeau/intelavxasmclang -march=native -O2 -fwrapv -Qunused-arguments -fPIC -fPIE -gdwarf-4 -Wall (Ubuntu_Clang_18.1.3_(1ubuntu1))

Compiler output


try.c: /usr/bin/ld: libcrypto_hashblocks_sha512.a(blocks.o): in function `crypto_hashblocks_sha512_dolbeau_intelavxasm_constbranchindex':
try.c: .../supercop-data/h2atom/amd64/try/c/clang_-march=native_-O3_-fwrapv_-Qunused-arguments_-fPIC_-fPIE_-gdwarf-4_-Wall/constbranchindex/crypto_hashblocks/sha512/dolbeau/intelavxasm/work/blocks.c:45:(.text+0x...): undefined reference to `sha512_avx'
try.c: clang: error: linker command failed with exit code 1 (use -v to see invocation)

Number of similar (implementation,compiler) pairs: 1, namely:
ImplementationCompiler
dolbeau/intelavxasmclang -march=native -O3 -fwrapv -Qunused-arguments -fPIC -fPIE -gdwarf-4 -Wall (Ubuntu_Clang_18.1.3_(1ubuntu1))

Compiler output


try.c: /usr/bin/ld: libcrypto_hashblocks_sha512.a(blocks.o): in function `crypto_hashblocks_sha512_dolbeau_intelavxasm_constbranchindex':
try.c: .../supercop-data/h2atom/amd64/try/c/clang_-march=native_-O_-fwrapv_-Qunused-arguments_-fPIC_-fPIE_-gdwarf-4_-Wall/constbranchindex/crypto_hashblocks/sha512/dolbeau/intelavxasm/work/blocks.c:45:(.text+0x...): undefined reference to `sha512_avx'
try.c: clang: error: linker command failed with exit code 1 (use -v to see invocation)

Number of similar (implementation,compiler) pairs: 1, namely:
ImplementationCompiler
dolbeau/intelavxasmclang -march=native -O -fwrapv -Qunused-arguments -fPIC -fPIE -gdwarf-4 -Wall (Ubuntu_Clang_18.1.3_(1ubuntu1))

Compiler output


try.c: /usr/bin/ld: libcrypto_hashblocks_sha512.a(blocks.o): in function `crypto_hashblocks_sha512_dolbeau_intelavxasm_constbranchindex':
try.c: .../supercop-data/h2atom/amd64/try/c/clang_-march=native_-Os_-fwrapv_-Qunused-arguments_-fPIC_-fPIE_-gdwarf-4_-Wall/constbranchindex/crypto_hashblocks/sha512/dolbeau/intelavxasm/work/blocks.c:45:(.text+0x...): undefined reference to `sha512_avx'
try.c: clang: error: linker command failed with exit code 1 (use -v to see invocation)

Number of similar (implementation,compiler) pairs: 1, namely:
ImplementationCompiler
dolbeau/intelavxasmclang -march=native -Os -fwrapv -Qunused-arguments -fPIC -fPIE -gdwarf-4 -Wall (Ubuntu_Clang_18.1.3_(1ubuntu1))

Compiler output


try.c: /usr/bin/ld: libcrypto_hashblocks_sha512.a(blocks.o): in function `crypto_hashblocks_sha512_dolbeau_intelavxasm_constbranchindex':
try.c: .../supercop-data/h2atom/amd64/try/c/clang_-mcpu=native_-O3_-fwrapv_-Qunused-arguments_-fPIC_-fPIE_-gdwarf-4_-Wall/constbranchindex/crypto_hashblocks/sha512/dolbeau/intelavxasm/work/blocks.c:45:(.text+0x...): undefined reference to `sha512_avx'
try.c: clang: error: linker command failed with exit code 1 (use -v to see invocation)

Number of similar (implementation,compiler) pairs: 1, namely:
ImplementationCompiler
dolbeau/intelavxasmclang -mcpu=native -O3 -fwrapv -Qunused-arguments -fPIC -fPIE -gdwarf-4 -Wall (Ubuntu_Clang_18.1.3_(1ubuntu1))

Compiler output


try.c: /usr/bin/ld: libcrypto_hashblocks_sha512.a(blocks.o): in function `crypto_hashblocks_sha512_dolbeau_intelavxasm_constbranchindex':
try.c: .../supercop-data/h2atom/amd64/try/c/gcc_-march=native_-mtune=native_-O2_-fwrapv_-fPIC_-fPIE_-gdwarf-4_-Wall/constbranchindex/crypto_hashblocks/sha512/dolbeau/intelavxasm/work/blocks.c:45:(.text+0x...): undefined reference to `sha512_avx'
try.c: collect2: error: ld returned 1 exit status

Number of similar (implementation,compiler) pairs: 1, namely:
ImplementationCompiler
dolbeau/intelavxasmgcc -march=native -mtune=native -O2 -fwrapv -fPIC -fPIE -gdwarf-4 -Wall (13.3.0)

Compiler output


try.c: /usr/bin/ld: libcrypto_hashblocks_sha512.a(blocks.o): in function `crypto_hashblocks_sha512_dolbeau_intelavxasm_constbranchindex':
try.c: .../supercop-data/h2atom/amd64/try/c/gcc_-march=native_-mtune=native_-O3_-fwrapv_-fPIC_-fPIE_-gdwarf-4_-Wall/constbranchindex/crypto_hashblocks/sha512/dolbeau/intelavxasm/work/blocks.c:45:(.text+0x...): undefined reference to `sha512_avx'
try.c: /usr/bin/ld: .../supercop-data/h2atom/amd64/try/c/gcc_-march=native_-mtune=native_-O3_-fwrapv_-fPIC_-fPIE_-gdwarf-4_-Wall/constbranchindex/crypto_hashblocks/sha512/dolbeau/intelavxasm/work/blocks.c:45:(.text+0x...): undefined reference to `sha512_avx'
try.c: collect2: error: ld returned 1 exit status

Number of similar (implementation,compiler) pairs: 1, namely:
ImplementationCompiler
dolbeau/intelavxasmgcc -march=native -mtune=native -O3 -fwrapv -fPIC -fPIE -gdwarf-4 -Wall (13.3.0)

Compiler output


try.c: /usr/bin/ld: libcrypto_hashblocks_sha512.a(blocks.o): in function `crypto_hashblocks_sha512_dolbeau_intelavxasm_constbranchindex':
try.c: .../supercop-data/h2atom/amd64/try/c/gcc_-march=native_-mtune=native_-O_-fwrapv_-fPIC_-fPIE_-gdwarf-4_-Wall/constbranchindex/crypto_hashblocks/sha512/dolbeau/intelavxasm/work/blocks.c:45:(.text+0x...): undefined reference to `sha512_avx'
try.c: collect2: error: ld returned 1 exit status

Number of similar (implementation,compiler) pairs: 1, namely:
ImplementationCompiler
dolbeau/intelavxasmgcc -march=native -mtune=native -O -fwrapv -fPIC -fPIE -gdwarf-4 -Wall (13.3.0)

Compiler output


try.c: /usr/bin/ld: libcrypto_hashblocks_sha512.a(blocks.o): in function `crypto_hashblocks_sha512_dolbeau_intelavxasm_constbranchindex':
try.c: .../supercop-data/h2atom/amd64/try/c/gcc_-march=native_-mtune=native_-Os_-fwrapv_-fPIC_-fPIE_-gdwarf-4_-Wall/constbranchindex/crypto_hashblocks/sha512/dolbeau/intelavxasm/work/blocks.c:45:(.text+0x...): undefined reference to `sha512_avx'
try.c: collect2: error: ld returned 1 exit status

Number of similar (implementation,compiler) pairs: 1, namely:
ImplementationCompiler
dolbeau/intelavxasmgcc -march=native -mtune=native -Os -fwrapv -fPIC -fPIE -gdwarf-4 -Wall (13.3.0)

Compiler output


try.c: /usr/bin/ld: libcrypto_hashblocks_sha512.a(blocks.o): in function `crypto_hashblocks_sha512_dolbeau_intelsse4asm_constbranchindex':
try.c: .../supercop-data/h2atom/amd64/try/c/clang_-march=native_-O2_-fwrapv_-Qunused-arguments_-fPIC_-fPIE_-gdwarf-4_-Wall/constbranchindex/crypto_hashblocks/sha512/dolbeau/intelsse4asm/work/blocks.c:45:(.text+0x...): undefined reference to `sha512_sse4'
try.c: clang: error: linker command failed with exit code 1 (use -v to see invocation)

Number of similar (implementation,compiler) pairs: 1, namely:
ImplementationCompiler
dolbeau/intelsse4asmclang -march=native -O2 -fwrapv -Qunused-arguments -fPIC -fPIE -gdwarf-4 -Wall (Ubuntu_Clang_18.1.3_(1ubuntu1))

Compiler output


try.c: /usr/bin/ld: libcrypto_hashblocks_sha512.a(blocks.o): in function `crypto_hashblocks_sha512_dolbeau_intelsse4asm_constbranchindex':
try.c: .../supercop-data/h2atom/amd64/try/c/clang_-march=native_-O3_-fwrapv_-Qunused-arguments_-fPIC_-fPIE_-gdwarf-4_-Wall/constbranchindex/crypto_hashblocks/sha512/dolbeau/intelsse4asm/work/blocks.c:45:(.text+0x...): undefined reference to `sha512_sse4'
try.c: clang: error: linker command failed with exit code 1 (use -v to see invocation)

Number of similar (implementation,compiler) pairs: 1, namely:
ImplementationCompiler
dolbeau/intelsse4asmclang -march=native -O3 -fwrapv -Qunused-arguments -fPIC -fPIE -gdwarf-4 -Wall (Ubuntu_Clang_18.1.3_(1ubuntu1))

Compiler output


try.c: /usr/bin/ld: libcrypto_hashblocks_sha512.a(blocks.o): in function `crypto_hashblocks_sha512_dolbeau_intelsse4asm_constbranchindex':
try.c: .../supercop-data/h2atom/amd64/try/c/clang_-march=native_-O_-fwrapv_-Qunused-arguments_-fPIC_-fPIE_-gdwarf-4_-Wall/constbranchindex/crypto_hashblocks/sha512/dolbeau/intelsse4asm/work/blocks.c:45:(.text+0x...): undefined reference to `sha512_sse4'
try.c: clang: error: linker command failed with exit code 1 (use -v to see invocation)

Number of similar (implementation,compiler) pairs: 1, namely:
ImplementationCompiler
dolbeau/intelsse4asmclang -march=native -O -fwrapv -Qunused-arguments -fPIC -fPIE -gdwarf-4 -Wall (Ubuntu_Clang_18.1.3_(1ubuntu1))

Compiler output


try.c: /usr/bin/ld: libcrypto_hashblocks_sha512.a(blocks.o): in function `crypto_hashblocks_sha512_dolbeau_intelsse4asm_constbranchindex':
try.c: .../supercop-data/h2atom/amd64/try/c/clang_-march=native_-Os_-fwrapv_-Qunused-arguments_-fPIC_-fPIE_-gdwarf-4_-Wall/constbranchindex/crypto_hashblocks/sha512/dolbeau/intelsse4asm/work/blocks.c:45:(.text+0x...): undefined reference to `sha512_sse4'
try.c: clang: error: linker command failed with exit code 1 (use -v to see invocation)

Number of similar (implementation,compiler) pairs: 1, namely:
ImplementationCompiler
dolbeau/intelsse4asmclang -march=native -Os -fwrapv -Qunused-arguments -fPIC -fPIE -gdwarf-4 -Wall (Ubuntu_Clang_18.1.3_(1ubuntu1))

Compiler output


try.c: /usr/bin/ld: libcrypto_hashblocks_sha512.a(blocks.o): in function `crypto_hashblocks_sha512_dolbeau_intelsse4asm_constbranchindex':
try.c: .../supercop-data/h2atom/amd64/try/c/clang_-mcpu=native_-O3_-fwrapv_-Qunused-arguments_-fPIC_-fPIE_-gdwarf-4_-Wall/constbranchindex/crypto_hashblocks/sha512/dolbeau/intelsse4asm/work/blocks.c:45:(.text+0x...): undefined reference to `sha512_sse4'
try.c: clang: error: linker command failed with exit code 1 (use -v to see invocation)

Number of similar (implementation,compiler) pairs: 1, namely:
ImplementationCompiler
dolbeau/intelsse4asmclang -mcpu=native -O3 -fwrapv -Qunused-arguments -fPIC -fPIE -gdwarf-4 -Wall (Ubuntu_Clang_18.1.3_(1ubuntu1))

Compiler output


try.c: /usr/bin/ld: libcrypto_hashblocks_sha512.a(blocks.o): in function `crypto_hashblocks_sha512_dolbeau_intelsse4asm_constbranchindex':
try.c: .../supercop-data/h2atom/amd64/try/c/gcc_-march=native_-mtune=native_-O2_-fwrapv_-fPIC_-fPIE_-gdwarf-4_-Wall/constbranchindex/crypto_hashblocks/sha512/dolbeau/intelsse4asm/work/blocks.c:45:(.text+0x...): undefined reference to `sha512_sse4'
try.c: collect2: error: ld returned 1 exit status

Number of similar (implementation,compiler) pairs: 1, namely:
ImplementationCompiler
dolbeau/intelsse4asmgcc -march=native -mtune=native -O2 -fwrapv -fPIC -fPIE -gdwarf-4 -Wall (13.3.0)

Compiler output


try.c: /usr/bin/ld: libcrypto_hashblocks_sha512.a(blocks.o): in function `crypto_hashblocks_sha512_dolbeau_intelsse4asm_constbranchindex':
try.c: .../supercop-data/h2atom/amd64/try/c/gcc_-march=native_-mtune=native_-O3_-fwrapv_-fPIC_-fPIE_-gdwarf-4_-Wall/constbranchindex/crypto_hashblocks/sha512/dolbeau/intelsse4asm/work/blocks.c:45:(.text+0x...): undefined reference to `sha512_sse4'
try.c: /usr/bin/ld: .../supercop-data/h2atom/amd64/try/c/gcc_-march=native_-mtune=native_-O3_-fwrapv_-fPIC_-fPIE_-gdwarf-4_-Wall/constbranchindex/crypto_hashblocks/sha512/dolbeau/intelsse4asm/work/blocks.c:45:(.text+0x...): undefined reference to `sha512_sse4'
try.c: collect2: error: ld returned 1 exit status

Number of similar (implementation,compiler) pairs: 1, namely:
ImplementationCompiler
dolbeau/intelsse4asmgcc -march=native -mtune=native -O3 -fwrapv -fPIC -fPIE -gdwarf-4 -Wall (13.3.0)

Compiler output


try.c: /usr/bin/ld: libcrypto_hashblocks_sha512.a(blocks.o): in function `crypto_hashblocks_sha512_dolbeau_intelsse4asm_constbranchindex':
try.c: .../supercop-data/h2atom/amd64/try/c/gcc_-march=native_-mtune=native_-O_-fwrapv_-fPIC_-fPIE_-gdwarf-4_-Wall/constbranchindex/crypto_hashblocks/sha512/dolbeau/intelsse4asm/work/blocks.c:45:(.text+0x...): undefined reference to `sha512_sse4'
try.c: collect2: error: ld returned 1 exit status

Number of similar (implementation,compiler) pairs: 1, namely:
ImplementationCompiler
dolbeau/intelsse4asmgcc -march=native -mtune=native -O -fwrapv -fPIC -fPIE -gdwarf-4 -Wall (13.3.0)

Compiler output


try.c: /usr/bin/ld: libcrypto_hashblocks_sha512.a(blocks.o): in function `crypto_hashblocks_sha512_dolbeau_intelsse4asm_constbranchindex':
try.c: .../supercop-data/h2atom/amd64/try/c/gcc_-march=native_-mtune=native_-Os_-fwrapv_-fPIC_-fPIE_-gdwarf-4_-Wall/constbranchindex/crypto_hashblocks/sha512/dolbeau/intelsse4asm/work/blocks.c:45:(.text+0x...): undefined reference to `sha512_sse4'
try.c: collect2: error: ld returned 1 exit status

Number of similar (implementation,compiler) pairs: 1, namely:
ImplementationCompiler
dolbeau/intelsse4asmgcc -march=native -mtune=native -Os -fwrapv -fPIC -fPIE -gdwarf-4 -Wall (13.3.0)

Passed TIMECOP


TIMECOP iterations: 10

Number of similar (implementation,compiler) pairs: 63, namely:
ImplementationCompiler
compactclang -march=native -O2 -fwrapv -Qunused-arguments -fPIC -fPIE -gdwarf-4 -Wall (Ubuntu_Clang_18.1.3_(1ubuntu1))
compactclang -march=native -O3 -fwrapv -Qunused-arguments -fPIC -fPIE -gdwarf-4 -Wall (Ubuntu_Clang_18.1.3_(1ubuntu1))
compactclang -march=native -O -fwrapv -Qunused-arguments -fPIC -fPIE -gdwarf-4 -Wall (Ubuntu_Clang_18.1.3_(1ubuntu1))
compactclang -march=native -Os -fwrapv -Qunused-arguments -fPIC -fPIE -gdwarf-4 -Wall (Ubuntu_Clang_18.1.3_(1ubuntu1))
compactclang -mcpu=native -O3 -fwrapv -Qunused-arguments -fPIC -fPIE -gdwarf-4 -Wall (Ubuntu_Clang_18.1.3_(1ubuntu1))
compactgcc -march=native -mtune=native -O2 -fwrapv -fPIC -fPIE -gdwarf-4 -Wall (13.3.0)
compactgcc -march=native -mtune=native -O3 -fwrapv -fPIC -fPIE -gdwarf-4 -Wall (13.3.0)
compactgcc -march=native -mtune=native -O -fwrapv -fPIC -fPIE -gdwarf-4 -Wall (13.3.0)
compactgcc -march=native -mtune=native -Os -fwrapv -fPIC -fPIE -gdwarf-4 -Wall (13.3.0)
compact2clang -march=native -O2 -fwrapv -Qunused-arguments -fPIC -fPIE -gdwarf-4 -Wall (Ubuntu_Clang_18.1.3_(1ubuntu1))
compact2clang -march=native -O3 -fwrapv -Qunused-arguments -fPIC -fPIE -gdwarf-4 -Wall (Ubuntu_Clang_18.1.3_(1ubuntu1))
compact2clang -march=native -O -fwrapv -Qunused-arguments -fPIC -fPIE -gdwarf-4 -Wall (Ubuntu_Clang_18.1.3_(1ubuntu1))
compact2clang -march=native -Os -fwrapv -Qunused-arguments -fPIC -fPIE -gdwarf-4 -Wall (Ubuntu_Clang_18.1.3_(1ubuntu1))
compact2clang -mcpu=native -O3 -fwrapv -Qunused-arguments -fPIC -fPIE -gdwarf-4 -Wall (Ubuntu_Clang_18.1.3_(1ubuntu1))
compact2gcc -march=native -mtune=native -O2 -fwrapv -fPIC -fPIE -gdwarf-4 -Wall (13.3.0)
compact2gcc -march=native -mtune=native -O3 -fwrapv -fPIC -fPIE -gdwarf-4 -Wall (13.3.0)
compact2gcc -march=native -mtune=native -O -fwrapv -fPIC -fPIE -gdwarf-4 -Wall (13.3.0)
compact2gcc -march=native -mtune=native -Os -fwrapv -fPIC -fPIE -gdwarf-4 -Wall (13.3.0)
compact3clang -march=native -O2 -fwrapv -Qunused-arguments -fPIC -fPIE -gdwarf-4 -Wall (Ubuntu_Clang_18.1.3_(1ubuntu1))
compact3clang -march=native -O3 -fwrapv -Qunused-arguments -fPIC -fPIE -gdwarf-4 -Wall (Ubuntu_Clang_18.1.3_(1ubuntu1))
compact3clang -march=native -O -fwrapv -Qunused-arguments -fPIC -fPIE -gdwarf-4 -Wall (Ubuntu_Clang_18.1.3_(1ubuntu1))
compact3clang -march=native -Os -fwrapv -Qunused-arguments -fPIC -fPIE -gdwarf-4 -Wall (Ubuntu_Clang_18.1.3_(1ubuntu1))
compact3clang -mcpu=native -O3 -fwrapv -Qunused-arguments -fPIC -fPIE -gdwarf-4 -Wall (Ubuntu_Clang_18.1.3_(1ubuntu1))
compact3gcc -march=native -mtune=native -O2 -fwrapv -fPIC -fPIE -gdwarf-4 -Wall (13.3.0)
compact3gcc -march=native -mtune=native -O3 -fwrapv -fPIC -fPIE -gdwarf-4 -Wall (13.3.0)
compact3gcc -march=native -mtune=native -O -fwrapv -fPIC -fPIE -gdwarf-4 -Wall (13.3.0)
compact3gcc -march=native -mtune=native -Os -fwrapv -fPIC -fPIE -gdwarf-4 -Wall (13.3.0)
compact4clang -march=native -O2 -fwrapv -Qunused-arguments -fPIC -fPIE -gdwarf-4 -Wall (Ubuntu_Clang_18.1.3_(1ubuntu1))
compact4clang -march=native -O3 -fwrapv -Qunused-arguments -fPIC -fPIE -gdwarf-4 -Wall (Ubuntu_Clang_18.1.3_(1ubuntu1))
compact4clang -march=native -O -fwrapv -Qunused-arguments -fPIC -fPIE -gdwarf-4 -Wall (Ubuntu_Clang_18.1.3_(1ubuntu1))
compact4clang -march=native -Os -fwrapv -Qunused-arguments -fPIC -fPIE -gdwarf-4 -Wall (Ubuntu_Clang_18.1.3_(1ubuntu1))
compact4clang -mcpu=native -O3 -fwrapv -Qunused-arguments -fPIC -fPIE -gdwarf-4 -Wall (Ubuntu_Clang_18.1.3_(1ubuntu1))
compact4gcc -march=native -mtune=native -O2 -fwrapv -fPIC -fPIE -gdwarf-4 -Wall (13.3.0)
compact4gcc -march=native -mtune=native -O3 -fwrapv -fPIC -fPIE -gdwarf-4 -Wall (13.3.0)
compact4gcc -march=native -mtune=native -O -fwrapv -fPIC -fPIE -gdwarf-4 -Wall (13.3.0)
compact4gcc -march=native -mtune=native -Os -fwrapv -fPIC -fPIE -gdwarf-4 -Wall (13.3.0)
inplaceclang -march=native -O2 -fwrapv -Qunused-arguments -fPIC -fPIE -gdwarf-4 -Wall (Ubuntu_Clang_18.1.3_(1ubuntu1))
inplaceclang -march=native -O3 -fwrapv -Qunused-arguments -fPIC -fPIE -gdwarf-4 -Wall (Ubuntu_Clang_18.1.3_(1ubuntu1))
inplaceclang -march=native -O -fwrapv -Qunused-arguments -fPIC -fPIE -gdwarf-4 -Wall (Ubuntu_Clang_18.1.3_(1ubuntu1))
inplaceclang -march=native -Os -fwrapv -Qunused-arguments -fPIC -fPIE -gdwarf-4 -Wall (Ubuntu_Clang_18.1.3_(1ubuntu1))
inplaceclang -mcpu=native -O3 -fwrapv -Qunused-arguments -fPIC -fPIE -gdwarf-4 -Wall (Ubuntu_Clang_18.1.3_(1ubuntu1))
inplacegcc -march=native -mtune=native -O2 -fwrapv -fPIC -fPIE -gdwarf-4 -Wall (13.3.0)
inplacegcc -march=native -mtune=native -O3 -fwrapv -fPIC -fPIE -gdwarf-4 -Wall (13.3.0)
inplacegcc -march=native -mtune=native -O -fwrapv -fPIC -fPIE -gdwarf-4 -Wall (13.3.0)
inplacegcc -march=native -mtune=native -Os -fwrapv -fPIC -fPIE -gdwarf-4 -Wall (13.3.0)
refclang -march=native -O2 -fwrapv -Qunused-arguments -fPIC -fPIE -gdwarf-4 -Wall (Ubuntu_Clang_18.1.3_(1ubuntu1))
refclang -march=native -O3 -fwrapv -Qunused-arguments -fPIC -fPIE -gdwarf-4 -Wall (Ubuntu_Clang_18.1.3_(1ubuntu1))
refclang -march=native -O -fwrapv -Qunused-arguments -fPIC -fPIE -gdwarf-4 -Wall (Ubuntu_Clang_18.1.3_(1ubuntu1))
refclang -march=native -Os -fwrapv -Qunused-arguments -fPIC -fPIE -gdwarf-4 -Wall (Ubuntu_Clang_18.1.3_(1ubuntu1))
refclang -mcpu=native -O3 -fwrapv -Qunused-arguments -fPIC -fPIE -gdwarf-4 -Wall (Ubuntu_Clang_18.1.3_(1ubuntu1))
refgcc -march=native -mtune=native -O2 -fwrapv -fPIC -fPIE -gdwarf-4 -Wall (13.3.0)
refgcc -march=native -mtune=native -O3 -fwrapv -fPIC -fPIE -gdwarf-4 -Wall (13.3.0)
refgcc -march=native -mtune=native -O -fwrapv -fPIC -fPIE -gdwarf-4 -Wall (13.3.0)
refgcc -march=native -mtune=native -Os -fwrapv -fPIC -fPIE -gdwarf-4 -Wall (13.3.0)
wflipclang -march=native -O2 -fwrapv -Qunused-arguments -fPIC -fPIE -gdwarf-4 -Wall (Ubuntu_Clang_18.1.3_(1ubuntu1))
wflipclang -march=native -O3 -fwrapv -Qunused-arguments -fPIC -fPIE -gdwarf-4 -Wall (Ubuntu_Clang_18.1.3_(1ubuntu1))
wflipclang -march=native -O -fwrapv -Qunused-arguments -fPIC -fPIE -gdwarf-4 -Wall (Ubuntu_Clang_18.1.3_(1ubuntu1))
wflipclang -march=native -Os -fwrapv -Qunused-arguments -fPIC -fPIE -gdwarf-4 -Wall (Ubuntu_Clang_18.1.3_(1ubuntu1))
wflipclang -mcpu=native -O3 -fwrapv -Qunused-arguments -fPIC -fPIE -gdwarf-4 -Wall (Ubuntu_Clang_18.1.3_(1ubuntu1))
wflipgcc -march=native -mtune=native -O2 -fwrapv -fPIC -fPIE -gdwarf-4 -Wall (13.3.0)
wflipgcc -march=native -mtune=native -O3 -fwrapv -fPIC -fPIE -gdwarf-4 -Wall (13.3.0)
wflipgcc -march=native -mtune=native -O -fwrapv -fPIC -fPIE -gdwarf-4 -Wall (13.3.0)
wflipgcc -march=native -mtune=native -Os -fwrapv -fPIC -fPIE -gdwarf-4 -Wall (13.3.0)