Test results for amd64, h2atom, crypto_hash/groestl512
[Page version: 20260919 18:54:16]
Measurements for amd64, h2atom, crypto_hash
Test results for amd64, h2atom, crypto_hash
Test results for crypto_hash/groestl512
Computer: h2atom
Microarchitecture: amd64; Bonnell (106ca)
Architecture: amd64
CPU ID: GenuineIntel-000106ca-bfe9fbff
SUPERCOP version: 20260330
Operation: crypto_hash
Primitive: groestl512
| Time | Object size | Test size | Implementation | Compiler | Benchmark date | SUPERCOP version |
| 236722 | 73470 16384 0 | 93694 17672 1480 | T:opt64 | clang -march=native -Os -fwrapv -Qunused-arguments -fPIC -fPIE -gdwarf-4 -Wall | 20260515 | 20260330 |
| 240921 | 46114 0 0 | 66262 1232 1480 | T:sphlib | clang -march=native -Os -fwrapv -Qunused-arguments -fPIC -fPIE -gdwarf-4 -Wall | 20260515 | 20260330 |
| 242640 | 49837 0 0 | 72322 1232 1576 | T:sphlib-adapted | gcc -march=native -mtune=native -O2 -fwrapv -fPIC -fPIE -gdwarf-4 -Wall | 20260515 | 20260330 |
| 243430 | 49496 0 0 | 71265 1224 1576 | T:sphlib-adapted | gcc -march=native -mtune=native -O -fwrapv -fPIC -fPIE -gdwarf-4 -Wall | 20260515 | 20260330 |
| 245998 | 73253 16384 0 | 96614 17688 1480 | T:opt64 | clang -march=native -O3 -fwrapv -Qunused-arguments -fPIC -fPIE -gdwarf-4 -Wall | 20260515 | 20260330 |
| 246028 | 46723 0 0 | 68465 1224 1576 | T:sphlib | gcc -march=native -mtune=native -O -fwrapv -fPIC -fPIE -gdwarf-4 -Wall | 20260515 | 20260330 |
| 247197 | 49965 0 0 | 73562 1232 1576 | T:sphlib-adapted | gcc -march=native -mtune=native -O3 -fwrapv -fPIC -fPIE -gdwarf-4 -Wall | 20260515 | 20260330 |
| 247214 | 73253 16384 0 | 95422 17688 1480 | T:opt64 | clang -march=native -O2 -fwrapv -Qunused-arguments -fPIC -fPIE -gdwarf-4 -Wall | 20260515 | 20260330 |
| 248091 | 47965 0 0 | 70418 1232 1576 | T:sphlib | gcc -march=native -mtune=native -O2 -fwrapv -fPIC -fPIE -gdwarf-4 -Wall | 20260515 | 20260330 |
| 248699 | 47885 0 0 | 71450 1232 1576 | T:sphlib | gcc -march=native -mtune=native -O3 -fwrapv -fPIC -fPIE -gdwarf-4 -Wall | 20260515 | 20260330 |
| 251809 | 50004 0 0 | 70166 1232 1480 | T:sphlib-adapted | clang -march=native -Os -fwrapv -Qunused-arguments -fPIC -fPIE -gdwarf-4 -Wall | 20260515 | 20260330 |
| 254059 | 75590 16384 0 | 98107 17664 1576 | T:opt64 | gcc -march=native -mtune=native -O2 -fwrapv -fPIC -fPIE -gdwarf-4 -Wall | 20260515 | 20260330 |
| 256200 | 77494 16384 0 | 101123 17664 1576 | T:opt64 | gcc -march=native -mtune=native -O3 -fwrapv -fPIC -fPIE -gdwarf-4 -Wall | 20260515 | 20260330 |
| 265246 | 75007 16384 0 | 96810 17656 1576 | T:opt64 | gcc -march=native -mtune=native -O -fwrapv -fPIC -fPIE -gdwarf-4 -Wall | 20260515 | 20260330 |
| 267833 | 53795 0 0 | 75804 1240 1480 | T:sphlib | clang -march=native -O2 -fwrapv -Qunused-arguments -fPIC -fPIE -gdwarf-4 -Wall | 20260515 | 20260330 |
| 267865 | 53795 0 0 | 76996 1240 1480 | T:sphlib | clang -march=native -O3 -fwrapv -Qunused-arguments -fPIC -fPIE -gdwarf-4 -Wall | 20260515 | 20260330 |
| 278753 | 56995 0 0 | 79020 1240 1480 | T:sphlib-adapted | clang -march=native -O2 -fwrapv -Qunused-arguments -fPIC -fPIE -gdwarf-4 -Wall | 20260515 | 20260330 |
| 278963 | 56995 0 0 | 80212 1240 1480 | T:sphlib-adapted | clang -march=native -O3 -fwrapv -Qunused-arguments -fPIC -fPIE -gdwarf-4 -Wall | 20260515 | 20260330 |
| 284228 | 69599 16384 0 | 90145 17640 1544 | T:opt64 | gcc -march=native -mtune=native -Os -fwrapv -fPIC -fPIE -gdwarf-4 -Wall | 20260515 | 20260330 |
| 289544 | 21363 0 0 | 43148 1240 1480 | T:sphlib-small | clang -march=native -O2 -fwrapv -Qunused-arguments -fPIC -fPIE -gdwarf-4 -Wall | 20260515 | 20260330 |
| 290194 | 21363 0 0 | 44340 1240 1480 | T:sphlib-small | clang -march=native -O3 -fwrapv -Qunused-arguments -fPIC -fPIE -gdwarf-4 -Wall | 20260515 | 20260330 |
| 291930 | 74247 16384 0 | 95134 17688 1480 | T:opt64 | clang -march=native -O -fwrapv -Qunused-arguments -fPIC -fPIE -gdwarf-4 -Wall | 20260515 | 20260330 |
| 300542 | 54723 0 0 | 75452 1240 1480 | T:sphlib | clang -march=native -O -fwrapv -Qunused-arguments -fPIC -fPIE -gdwarf-4 -Wall | 20260515 | 20260330 |
| 307623 | 44636 0 0 | 65128 1208 1544 | T:sphlib-adapted | gcc -march=native -mtune=native -Os -fwrapv -fPIC -fPIE -gdwarf-4 -Wall | 20260515 | 20260330 |
| 309161 | 41782 0 0 | 62248 1208 1544 | T:sphlib | gcc -march=native -mtune=native -Os -fwrapv -fPIC -fPIE -gdwarf-4 -Wall | 20260515 | 20260330 |
| 311423 | 18993 0 0 | 38918 1232 1480 | T:sphlib-small | clang -march=native -Os -fwrapv -Qunused-arguments -fPIC -fPIE -gdwarf-4 -Wall | 20260515 | 20260330 |
| 319689 | 57091 0 0 | 77836 1240 1480 | T:sphlib-adapted | clang -march=native -O -fwrapv -Qunused-arguments -fPIC -fPIE -gdwarf-4 -Wall | 20260515 | 20260330 |
| 323995 | 50513 0 0 | 73748 1240 1480 | T:sphlib | clang -mcpu=native -O3 -fwrapv -Qunused-arguments -fPIC -fPIE -gdwarf-4 -Wall | 20260515 | 20260330 |
| 326774 | 71731 16384 0 | 95126 17688 1480 | T:opt64 | clang -mcpu=native -O3 -fwrapv -Qunused-arguments -fPIC -fPIE -gdwarf-4 -Wall | 20260515 | 20260330 |
| 333623 | 20851 0 0 | 41596 1240 1480 | T:sphlib-small | clang -march=native -O -fwrapv -Qunused-arguments -fPIC -fPIE -gdwarf-4 -Wall | 20260515 | 20260330 |
| 339211 | 54209 0 0 | 77460 1240 1480 | T:sphlib-adapted | clang -mcpu=native -O3 -fwrapv -Qunused-arguments -fPIC -fPIE -gdwarf-4 -Wall | 20260515 | 20260330 |
| 339478 | 68973 0 0 | 92366 1264 1480 | T:mmx | clang -mcpu=native -O3 -fwrapv -Qunused-arguments -fPIC -fPIE -gdwarf-4 -Wall | 20260515 | 20260330 |
| 342432 | 22605 0 0 | 45090 1232 1576 | T:sphlib-small | gcc -march=native -mtune=native -O2 -fwrapv -fPIC -fPIE -gdwarf-4 -Wall | 20260515 | 20260330 |
| 345036 | 24189 0 0 | 47786 1232 1576 | T:sphlib-small | gcc -march=native -mtune=native -O3 -fwrapv -fPIC -fPIE -gdwarf-4 -Wall | 20260515 | 20260330 |
| 346483 | 66527 0 0 | 89902 1264 1480 | T:mmx | clang -march=native -O3 -fwrapv -Qunused-arguments -fPIC -fPIE -gdwarf-4 -Wall | 20260515 | 20260330 |
| 348197 | 65751 0 0 | 87934 1264 1480 | T:mmx | clang -march=native -O2 -fwrapv -Qunused-arguments -fPIC -fPIE -gdwarf-4 -Wall | 20260515 | 20260330 |
| 351415 | 66791 0 0 | 87686 1264 1480 | T:mmx | clang -march=native -O -fwrapv -Qunused-arguments -fPIC -fPIE -gdwarf-4 -Wall | 20260515 | 20260330 |
| 360620 | 22455 0 0 | 44258 1232 1576 | T:opt32 | gcc -march=native -mtune=native -O -fwrapv -fPIC -fPIE -gdwarf-4 -Wall | 20260515 | 20260330 |
| 361284 | 59845 0 0 | 80094 1248 1480 | T:mmx | clang -march=native -Os -fwrapv -Qunused-arguments -fPIC -fPIE -gdwarf-4 -Wall | 20260515 | 20260330 |
| 371894 | 19238 0 1520 | 39688 1208 3080 | T:vperm-intr | gcc -march=native -mtune=native -Os -fwrapv -fPIC -fPIE -gdwarf-4 -Wall | 20260515 | 20260330 |
| 374645 | 24779 0 0 | 48419 1240 1576 | T:opt32 | gcc -march=native -mtune=native -O3 -fwrapv -fPIC -fPIE -gdwarf-4 -Wall | 20260515 | 20260330 |
| 375416 | 22971 0 0 | 45499 1240 1576 | T:opt32 | gcc -march=native -mtune=native -O2 -fwrapv -fPIC -fPIE -gdwarf-4 -Wall | 20260515 | 20260330 |
| 381242 | 23494 0 1520 | 45209 1224 3112 | T:vperm-intr | gcc -march=native -mtune=native -O -fwrapv -fPIC -fPIE -gdwarf-4 -Wall | 20260515 | 20260330 |
| 387268 | 72819 0 0 | 96459 1240 1576 | T:mmx | gcc -march=native -mtune=native -O3 -fwrapv -fPIC -fPIE -gdwarf-4 -Wall | 20260515 | 20260330 |
| 405537 | 24794 0 1520 | 48346 1232 3112 | T:vperm-intr | gcc -march=native -mtune=native -O3 -fwrapv -fPIC -fPIE -gdwarf-4 -Wall | 20260515 | 20260330 |
| 405880 | 24122 0 1520 | 46570 1232 3112 | T:vperm-intr | gcc -march=native -mtune=native -O2 -fwrapv -fPIC -fPIE -gdwarf-4 -Wall | 20260515 | 20260330 |
| 412303 | 30141 0 1296 | 51627 1248 2792 | T:vperm-intr | clang -march=native -O3 -fwrapv -Qunused-arguments -fPIC -fPIE -gdwarf-4 -Wall | 20260515 | 20260330 |
| 412390 | 28000 0 1296 | 49123 1248 2792 | T:vperm-intr | clang -march=native -O2 -fwrapv -Qunused-arguments -fPIC -fPIE -gdwarf-4 -Wall | 20260515 | 20260330 |
| 413532 | 25526 0 1296 | 45677 1240 2792 | T:vperm-intr | clang -march=native -Os -fwrapv -Qunused-arguments -fPIC -fPIE -gdwarf-4 -Wall | 20260515 | 20260330 |
| 417560 | 20705 0 0 | 43716 1240 1480 | T:sphlib-small | clang -mcpu=native -O3 -fwrapv -Qunused-arguments -fPIC -fPIE -gdwarf-4 -Wall | 20260515 | 20260330 |
| 419181 | 18027 0 0 | 38520 1208 1544 | T:sphlib-small | gcc -march=native -mtune=native -Os -fwrapv -fPIC -fPIE -gdwarf-4 -Wall | 20260515 | 20260330 |
| 436138 | 20697 0 0 | 42465 1224 1576 | T:sphlib-small | gcc -march=native -mtune=native -O -fwrapv -fPIC -fPIE -gdwarf-4 -Wall | 20260515 | 20260330 |
| 483734 | 22906 0 0 | 45150 1264 1480 | T:opt32 | clang -march=native -O2 -fwrapv -Qunused-arguments -fPIC -fPIE -gdwarf-4 -Wall | 20260515 | 20260330 |
| 483918 | 22954 0 0 | 46390 1264 1480 | T:opt32 | clang -march=native -O3 -fwrapv -Qunused-arguments -fPIC -fPIE -gdwarf-4 -Wall | 20260515 | 20260330 |
| 485599 | 20703 0 0 | 40974 1248 1480 | T:opt32 | clang -march=native -Os -fwrapv -Qunused-arguments -fPIC -fPIE -gdwarf-4 -Wall | 20260515 | 20260330 |
| 493502 | 21497 0 0 | 42438 1264 1480 | T:opt32 | clang -march=native -O -fwrapv -Qunused-arguments -fPIC -fPIE -gdwarf-4 -Wall | 20260515 | 20260330 |
| 495467 | 21162 0 0 | 41737 1216 1544 | T:opt32 | gcc -march=native -mtune=native -Os -fwrapv -fPIC -fPIE -gdwarf-4 -Wall | 20260515 | 20260330 |
| 500649 | 43585 0 1824 | 63451 1248 3304 | T:vperm-intr | clang -march=native -O -fwrapv -Qunused-arguments -fPIC -fPIE -gdwarf-4 -Wall | 20260515 | 20260330 |
| 504433 | 23168 0 0 | 46638 1264 1480 | T:opt32 | clang -mcpu=native -O3 -fwrapv -Qunused-arguments -fPIC -fPIE -gdwarf-4 -Wall | 20260515 | 20260330 |
| 522241 | 68933 0 0 | 90762 1232 1576 | T:mmx | gcc -march=native -mtune=native -O -fwrapv -fPIC -fPIE -gdwarf-4 -Wall | 20260515 | 20260330 |
| 535144 | 69771 0 0 | 92299 1240 1576 | T:mmx | gcc -march=native -mtune=native -O2 -fwrapv -fPIC -fPIE -gdwarf-4 -Wall | 20260515 | 20260330 |
| 599152 | 68734 0 0 | 89305 1216 1544 | T:mmx | gcc -march=native -mtune=native -Os -fwrapv -fPIC -fPIE -gdwarf-4 -Wall | 20260515 | 20260330 |
| 812262 | 7808 0 0 | 31251 1224 1576 | T:32bit-bytesliced-c-small | gcc -march=native -mtune=native -O3 -fwrapv -fPIC -fPIE -gdwarf-4 -Wall | 20260515 | 20260330 |
| 833064 | 5201 0 0 | 28316 1240 1480 | T:32bit-bytesliced-c-small | clang -march=native -O3 -fwrapv -Qunused-arguments -fPIC -fPIE -gdwarf-4 -Wall | 20260515 | 20260330 |
| 841236 | 4345 0 0 | 26268 1240 1480 | T:32bit-bytesliced-c-small | clang -march=native -O2 -fwrapv -Qunused-arguments -fPIC -fPIE -gdwarf-4 -Wall | 20260515 | 20260330 |
| 1094153 | 5691 0 0 | 28844 1240 1480 | T:32bit-bytesliced-c-small | clang -mcpu=native -O3 -fwrapv -Qunused-arguments -fPIC -fPIE -gdwarf-4 -Wall | 20260515 | 20260330 |
| 1562724 | 2196 0 0 | 22246 1232 1480 | T:32bit-bytesliced-c-small | clang -march=native -Os -fwrapv -Qunused-arguments -fPIC -fPIE -gdwarf-4 -Wall | 20260515 | 20260330 |
| 1636210 | 2813 0 0 | 25139 1224 1576 | T:32bit-bytesliced-c-small | gcc -march=native -mtune=native -O2 -fwrapv -fPIC -fPIE -gdwarf-4 -Wall | 20260515 | 20260330 |
| 1792729 | 1954 0 0 | 22289 1200 1544 | T:32bit-bytesliced-c-small | gcc -march=native -mtune=native -Os -fwrapv -fPIC -fPIE -gdwarf-4 -Wall | 20260515 | 20260330 |
| 1820676 | 3561 0 0 | 24204 1240 1480 | T:32bit-bytesliced-c-small | clang -march=native -O -fwrapv -Qunused-arguments -fPIC -fPIE -gdwarf-4 -Wall | 20260515 | 20260330 |
| 2702550 | 2836 0 0 | 24442 1216 1576 | T:32bit-bytesliced-c-small | gcc -march=native -mtune=native -O -fwrapv -fPIC -fPIE -gdwarf-4 -Wall | 20260515 | 20260330 |
Compiler output
hash.c: hash.c:104:12: warning: comparison of array 'ctx->chaining' equal to a null pointer is always false [-Wtautological-pointer-compare]
hash.c: 104 | if (ctx->chaining == NULL || ctx->buffer == NULL)
hash.c: | ~~~~~^~~~~~~~ ~~~~
hash.c: hash.c:104:37: warning: comparison of array 'ctx->buffer' equal to a null pointer is always false [-Wtautological-pointer-compare]
hash.c: 104 | if (ctx->chaining == NULL || ctx->buffer == NULL)
hash.c: | ~~~~~^~~~~~ ~~~~
hash.c: In file included from hash.c:13:
hash.c: ./groestl-asm-aes.h:851:8: error: invalid operand for instruction
hash.c: 851 | asm ("movaps xmm8, [rdi+0*16]");
hash.c: | ^
hash.c: <inline asm>:1:16: note: instantiated into assembly here
hash.c: 1 | movaps xmm8, [rdi+0*16]
hash.c: | ^~~~~~~~~~
hash.c: In file included from hash.c:13:
hash.c: ./groestl-asm-aes.h:852:8: error: invalid operand for instruction
hash.c: 852 | asm ("movaps xmm9, [rdi+1*16]");
hash.c: | ^
hash.c: <inline asm>:1:16: note: instantiated into assembly here
hash.c: 1 | movaps xmm9, [rdi+1*16]
hash.c: | ^~~~~~~~~~
hash.c: In file included from hash.c:13:
hash.c: ./groestl-asm-aes.h:853:8: error: invalid operand for instruction
hash.c: 853 | asm ("movaps xmm10, [rdi+2*16]");
hash.c: | ^
hash.c: <inline asm>:1:16: note: instantiated into assembly here
hash.c: ...
Number of similar (implementation,compiler) pairs: 5, namely:
| Implementation | Compiler |
| T:aesni | clang -march=native -O2 -fwrapv -Qunused-arguments -fPIC -fPIE -gdwarf-4 -Wall (Ubuntu_Clang_18.1.3_(1ubuntu1)) |
| T:aesni | clang -march=native -O3 -fwrapv -Qunused-arguments -fPIC -fPIE -gdwarf-4 -Wall (Ubuntu_Clang_18.1.3_(1ubuntu1)) |
| T:aesni | clang -march=native -O -fwrapv -Qunused-arguments -fPIC -fPIE -gdwarf-4 -Wall (Ubuntu_Clang_18.1.3_(1ubuntu1)) |
| T:aesni | clang -march=native -Os -fwrapv -Qunused-arguments -fPIC -fPIE -gdwarf-4 -Wall (Ubuntu_Clang_18.1.3_(1ubuntu1)) |
| T:aesni | clang -mcpu=native -O3 -fwrapv -Qunused-arguments -fPIC -fPIE -gdwarf-4 -Wall (Ubuntu_Clang_18.1.3_(1ubuntu1)) |
Compiler output
hash.c: hash.c: In function 'Init':
hash.c: hash.c:104:21: warning: the comparison will always evaluate as 'false' for the address of 'chaining' will never be NULL [-Waddress]
hash.c: 104 | if (ctx->chaining == NULL || ctx->buffer == NULL)
hash.c: | ^~
hash.c: In file included from groestl-asm-aes.h:10,
hash.c: from hash.c:13:
hash.c: hash.h:83:38: note: 'chaining' declared here
hash.c: 83 | __attribute__ ((aligned (32))) u64 chaining[SIZE/8]; /* actual state */
hash.c: | ^~~~~~~~
hash.c: hash.c:104:44: warning: the comparison will always evaluate as 'false' for the address of 'buffer' will never be NULL [-Waddress]
hash.c: 104 | if (ctx->chaining == NULL || ctx->buffer == NULL)
hash.c: | ^~
hash.c: hash.h:84:46: note: 'buffer' declared here
hash.c: 84 | __attribute__ ((aligned (32))) BitSequence buffer[SIZE]; /* data buffer */
hash.c: | ^~~~~~
try.c: /usr/bin/ld: libcrypto_hash_groestl512.a(hash.o): relocation R_X86_64_32S against symbol `TRANSP_MASK' can not be used when making a PIE object; recompile with -fPIE
try.c: /usr/bin/ld: failed to set dynamic section sizes: bad value
try.c: collect2: error: ld returned 1 exit status
Number of similar (implementation,compiler) pairs: 4, namely:
| Implementation | Compiler |
| T:aesni | gcc -march=native -mtune=native -O2 -fwrapv -fPIC -fPIE -gdwarf-4 -Wall (13.3.0) |
| T:aesni | gcc -march=native -mtune=native -O3 -fwrapv -fPIC -fPIE -gdwarf-4 -Wall (13.3.0) |
| T:aesni | gcc -march=native -mtune=native -O -fwrapv -fPIC -fPIE -gdwarf-4 -Wall (13.3.0) |
| T:aesni | gcc -march=native -mtune=native -Os -fwrapv -fPIC -fPIE -gdwarf-4 -Wall (13.3.0) |
Compiler output
hash.c: In file included from hash.c:28:
hash.c: ./groestl-intr-aes.h:850:3: error: always_inline function '_mm_aesenclast_si128' requires target feature 'aes', but would be inlined into function 'TF1024' that is compiled without support for 'aes'
hash.c: 850 | ROUNDS_P();
hash.c: | ^
hash.c: ./groestl-intr-aes.h:554:5: note: expanded from macro 'ROUNDS_P'
hash.c: 554 | SUBMIX(xmm8, xmm9, xmm10, xmm11, xmm12, xmm13, xmm14, xmm15, xmm0, xmm1, xmm2, xmm3, xmm4, xmm5, xmm6, xmm7);\
hash.c: | ^
hash.c: ./groestl-intr-aes.h:527:8: note: expanded from macro 'SUBMIX'
hash.c: 527 | a0 = _mm_aesenclast_si128(a0, b0);\
hash.c: | ^
hash.c: ./groestl-intr-aes.h:850:3: error: always_inline function '_mm_aesenclast_si128' requires target feature 'aes', but would be inlined into function 'TF1024' that is compiled without support for 'aes'
hash.c: ./groestl-intr-aes.h:554:5: note: expanded from macro 'ROUNDS_P'
hash.c: 554 | SUBMIX(xmm8, xmm9, xmm10, xmm11, xmm12, xmm13, xmm14, xmm15, xmm0, xmm1, xmm2, xmm3, xmm4, xmm5, xmm6, xmm7);\
hash.c: | ^
hash.c: ./groestl-intr-aes.h:528:8: note: expanded from macro 'SUBMIX'
hash.c: 528 | a1 = _mm_aesenclast_si128(a1, b0);\
hash.c: | ^
hash.c: ./groestl-intr-aes.h:850:3: error: always_inline function '_mm_aesenclast_si128' requires target feature 'aes', but would be inlined into function 'TF1024' that is compiled without support for 'aes'
hash.c: ./groestl-intr-aes.h:554:5: note: expanded from macro 'ROUNDS_P'
hash.c: 554 | SUBMIX(xmm8, xmm9, xmm10, xmm11, xmm12, xmm13, xmm14, xmm15, xmm0, xmm1, xmm2, xmm3, xmm4, xmm5, xmm6, xmm7);\
hash.c: | ^
hash.c: ./groestl-intr-aes.h:529:8: note: expanded from macro 'SUBMIX'
hash.c: 529 | a2 = _mm_aesenclast_si128(a2, b0);\
hash.c: | ^
hash.c: ./groestl-intr-aes.h:850:3: error: always_inline function '_mm_aesenclast_si128' requires target feature 'aes', but would be inlined into function 'TF1024' that is compiled without support for 'aes'
hash.c: ...
Number of similar (implementation,compiler) pairs: 4, namely:
| Implementation | Compiler |
| T:aesni-intr | clang -march=native -O2 -fwrapv -Qunused-arguments -fPIC -fPIE -gdwarf-4 -Wall (Ubuntu_Clang_18.1.3_(1ubuntu1)) |
| T:aesni-intr | clang -march=native -O3 -fwrapv -Qunused-arguments -fPIC -fPIE -gdwarf-4 -Wall (Ubuntu_Clang_18.1.3_(1ubuntu1)) |
| T:aesni-intr | clang -march=native -O -fwrapv -Qunused-arguments -fPIC -fPIE -gdwarf-4 -Wall (Ubuntu_Clang_18.1.3_(1ubuntu1)) |
| T:aesni-intr | clang -march=native -Os -fwrapv -Qunused-arguments -fPIC -fPIE -gdwarf-4 -Wall (Ubuntu_Clang_18.1.3_(1ubuntu1)) |
Compiler output
hash.c: In file included from hash.c:28:
hash.c: ./groestl-intr-aes.h:786:3: error: always_inline function '_mm_shuffle_epi8' requires target feature 'ssse3', but would be inlined into function 'INIT' that is compiled without support for 'ssse3'
hash.c: 786 | Matrix_Transpose(xmm8, xmm9, xmm10, xmm11, xmm12, xmm13, xmm14, xmm15, xmm0, xmm1, xmm2, xmm3, xmm4, xmm5, xmm6, xmm7);
hash.c: | ^
hash.c: ./groestl-intr-aes.h:631:8: note: expanded from macro 'Matrix_Transpose'
hash.c: 631 | i6 = _mm_shuffle_epi8(i6, t0);\
hash.c: | ^
hash.c: ./groestl-intr-aes.h:786:3: error: always_inline function '_mm_shuffle_epi8' requires target feature 'ssse3', but would be inlined into function 'INIT' that is compiled without support for 'ssse3'
hash.c: ./groestl-intr-aes.h:632:8: note: expanded from macro 'Matrix_Transpose'
hash.c: 632 | i0 = _mm_shuffle_epi8(i0, t0);\
hash.c: | ^
hash.c: ./groestl-intr-aes.h:786:3: error: always_inline function '_mm_shuffle_epi8' requires target feature 'ssse3', but would be inlined into function 'INIT' that is compiled without support for 'ssse3'
hash.c: ./groestl-intr-aes.h:633:8: note: expanded from macro 'Matrix_Transpose'
hash.c: 633 | i1 = _mm_shuffle_epi8(i1, t0);\
hash.c: | ^
hash.c: ./groestl-intr-aes.h:786:3: error: always_inline function '_mm_shuffle_epi8' requires target feature 'ssse3', but would be inlined into function 'INIT' that is compiled without support for 'ssse3'
hash.c: ./groestl-intr-aes.h:634:8: note: expanded from macro 'Matrix_Transpose'
hash.c: 634 | i2 = _mm_shuffle_epi8(i2, t0);\
hash.c: | ^
hash.c: ./groestl-intr-aes.h:786:3: error: always_inline function '_mm_shuffle_epi8' requires target feature 'ssse3', but would be inlined into function 'INIT' that is compiled without support for 'ssse3'
hash.c: ./groestl-intr-aes.h:635:8: note: expanded from macro 'Matrix_Transpose'
hash.c: 635 | i3 = _mm_shuffle_epi8(i3, t0);\
hash.c: | ^
hash.c: ./groestl-intr-aes.h:786:3: error: always_inline function '_mm_shuffle_epi8' requires target feature 'ssse3', but would be inlined into function 'INIT' that is compiled without support for 'ssse3'
hash.c: ./groestl-intr-aes.h:637:8: note: expanded from macro 'Matrix_Transpose'
hash.c: ...
Number of similar (implementation,compiler) pairs: 1, namely:
| Implementation | Compiler |
| T:aesni-intr | clang -mcpu=native -O3 -fwrapv -Qunused-arguments -fPIC -fPIE -gdwarf-4 -Wall (Ubuntu_Clang_18.1.3_(1ubuntu1)) |
Compiler output
hash.c: hash.c: In function 'Init':
hash.c: hash.c:104:21: warning: the comparison will always evaluate as 'false' for the address of 'chaining' will never be NULL [-Waddress]
hash.c: 104 | if (ctx->chaining == NULL || ctx->buffer == NULL)
hash.c: | ^~
hash.c: In file included from groestl-intr-aes.h:12,
hash.c: from hash.c:28:
hash.c: hash.h:83:38: note: 'chaining' declared here
hash.c: 83 | __attribute__ ((aligned (32))) u64 chaining[SIZE/8]; /* actual state */
hash.c: | ^~~~~~~~
hash.c: hash.c:104:44: warning: the comparison will always evaluate as 'false' for the address of 'buffer' will never be NULL [-Waddress]
hash.c: 104 | if (ctx->chaining == NULL || ctx->buffer == NULL)
hash.c: | ^~
hash.c: hash.h:84:46: note: 'buffer' declared here
hash.c: 84 | __attribute__ ((aligned (32))) BitSequence buffer[SIZE]; /* data buffer */
hash.c: | ^~~~~~
hash.c: In file included from groestl-intr-aes.h:11:
hash.c: /usr/lib/gcc/x86_64-linux-gnu/13/include/wmmintrin.h: In function 'TF1024':
hash.c: /usr/lib/gcc/x86_64-linux-gnu/13/include/wmmintrin.h:69:1: error: inlining failed in call to 'always_inline' '_mm_aesenclast_si128': target specific option mismatch
hash.c: 69 | _mm_aesenclast_si128 (__m128i __X, __m128i __Y)
hash.c: | ^~~~~~~~~~~~~~~~~~~~
hash.c: groestl-intr-aes.h:534:8: note: called from here
hash.c: 534 | a7 = _mm_aesenclast_si128(a7, b0);\
hash.c: | ^~~~~~~~~~~~~~~~~~~~~~~~~~~~
hash.c: groestl-intr-aes.h:568:5: note: in expansion of macro 'SUBMIX'
hash.c: 568 | SUBMIX(xmm0, xmm1, xmm2, xmm3, xmm4, xmm5, xmm6, xmm7, xmm8, xmm9, xmm10, xmm11, xmm12, xmm13, xmm14, xmm15);\
hash.c: ...
Number of similar (implementation,compiler) pairs: 4, namely:
| Implementation | Compiler |
| T:aesni-intr | gcc -march=native -mtune=native -O2 -fwrapv -fPIC -fPIE -gdwarf-4 -Wall (13.3.0) |
| T:aesni-intr | gcc -march=native -mtune=native -O3 -fwrapv -fPIC -fPIE -gdwarf-4 -Wall (13.3.0) |
| T:aesni-intr | gcc -march=native -mtune=native -O -fwrapv -fPIC -fPIE -gdwarf-4 -Wall (13.3.0) |
| T:aesni-intr | gcc -march=native -mtune=native -Os -fwrapv -fPIC -fPIE -gdwarf-4 -Wall (13.3.0) |
Compiler output
hash.c: hash.c:104:12: warning: comparison of array 'ctx->chaining' equal to a null pointer is always false [-Wtautological-pointer-compare]
hash.c: 104 | if (ctx->chaining == NULL || ctx->buffer == NULL)
hash.c: | ~~~~~^~~~~~~~ ~~~~
hash.c: hash.c:104:37: warning: comparison of array 'ctx->buffer' equal to a null pointer is always false [-Wtautological-pointer-compare]
hash.c: 104 | if (ctx->chaining == NULL || ctx->buffer == NULL)
hash.c: | ~~~~~^~~~~~ ~~~~
hash.c: In file included from hash.c:16:
hash.c: ./groestl-asm-avx.h:925:8: error: invalid operand for instruction
hash.c: 925 | asm ("vmovaps xmm8, [rdi+0*16]");
hash.c: | ^
hash.c: <inline asm>:1:17: note: instantiated into assembly here
hash.c: 1 | vmovaps xmm8, [rdi+0*16]
hash.c: | ^~~~~~~~~~
hash.c: In file included from hash.c:16:
hash.c: ./groestl-asm-avx.h:926:8: error: invalid operand for instruction
hash.c: 926 | asm ("vmovaps xmm9, [rdi+1*16]");
hash.c: | ^
hash.c: <inline asm>:1:17: note: instantiated into assembly here
hash.c: 1 | vmovaps xmm9, [rdi+1*16]
hash.c: | ^~~~~~~~~~
hash.c: In file included from hash.c:16:
hash.c: ./groestl-asm-avx.h:927:8: error: invalid operand for instruction
hash.c: 927 | asm ("vmovaps xmm10, [rdi+2*16]");
hash.c: | ^
hash.c: <inline asm>:1:17: note: instantiated into assembly here
hash.c: ...
Number of similar (implementation,compiler) pairs: 5, namely:
| Implementation | Compiler |
| T:avx | clang -march=native -O2 -fwrapv -Qunused-arguments -fPIC -fPIE -gdwarf-4 -Wall (Ubuntu_Clang_18.1.3_(1ubuntu1)) |
| T:avx | clang -march=native -O3 -fwrapv -Qunused-arguments -fPIC -fPIE -gdwarf-4 -Wall (Ubuntu_Clang_18.1.3_(1ubuntu1)) |
| T:avx | clang -march=native -O -fwrapv -Qunused-arguments -fPIC -fPIE -gdwarf-4 -Wall (Ubuntu_Clang_18.1.3_(1ubuntu1)) |
| T:avx | clang -march=native -Os -fwrapv -Qunused-arguments -fPIC -fPIE -gdwarf-4 -Wall (Ubuntu_Clang_18.1.3_(1ubuntu1)) |
| T:avx | clang -mcpu=native -O3 -fwrapv -Qunused-arguments -fPIC -fPIE -gdwarf-4 -Wall (Ubuntu_Clang_18.1.3_(1ubuntu1)) |
Compiler output
hash.c: hash.c: In function 'Init':
hash.c: hash.c:104:21: warning: the comparison will always evaluate as 'false' for the address of 'chaining' will never be NULL [-Waddress]
hash.c: 104 | if (ctx->chaining == NULL || ctx->buffer == NULL)
hash.c: | ^~
hash.c: In file included from groestl-asm-avx.h:10,
hash.c: from hash.c:16:
hash.c: hash.h:83:38: note: 'chaining' declared here
hash.c: 83 | __attribute__ ((aligned (32))) u64 chaining[SIZE/8]; /* actual state */
hash.c: | ^~~~~~~~
hash.c: hash.c:104:44: warning: the comparison will always evaluate as 'false' for the address of 'buffer' will never be NULL [-Waddress]
hash.c: 104 | if (ctx->chaining == NULL || ctx->buffer == NULL)
hash.c: | ^~
hash.c: hash.h:84:46: note: 'buffer' declared here
hash.c: 84 | __attribute__ ((aligned (32))) BitSequence buffer[SIZE]; /* data buffer */
hash.c: | ^~~~~~
try.c: /usr/bin/ld: libcrypto_hash_groestl512.a(hash.o): relocation R_X86_64_32S against symbol `TRANSP_MASK' can not be used when making a PIE object; recompile with -fPIE
try.c: /usr/bin/ld: failed to set dynamic section sizes: bad value
try.c: collect2: error: ld returned 1 exit status
Number of similar (implementation,compiler) pairs: 4, namely:
| Implementation | Compiler |
| T:avx | gcc -march=native -mtune=native -O2 -fwrapv -fPIC -fPIE -gdwarf-4 -Wall (13.3.0) |
| T:avx | gcc -march=native -mtune=native -O3 -fwrapv -fPIC -fPIE -gdwarf-4 -Wall (13.3.0) |
| T:avx | gcc -march=native -mtune=native -O -fwrapv -fPIC -fPIE -gdwarf-4 -Wall (13.3.0) |
| T:avx | gcc -march=native -mtune=native -Os -fwrapv -fPIC -fPIE -gdwarf-4 -Wall (13.3.0) |
Compiler output
hash.c: In file included from hash.c:31:
hash.c: ./groestl-intr-avx.h:909:11: error: '__builtin_ia32_vinsertf128_si256' needs target feature avx
hash.c: 909 | ymm8 = insert_m128i_in_m256d(ymm8, xmm8, 0);
hash.c: | ^
hash.c: ./groestl-intr-avx.h:36:67: note: expanded from macro 'insert_m128i_in_m256d'
hash.c: 36 | #define insert_m128i_in_m256d(ymm, xmm, pos) (_mm256_castsi256_pd(_mm256_insertf128_si256(_mm256_castpd_si256(ymm), xmm, pos)))
hash.c: | ^
hash.c: /usr/lib/llvm-18/lib/clang/18/include/avxintrin.h:4733:13: note: expanded from macro '_mm256_insertf128_si256'
hash.c: 4733 | ((__m256i)__builtin_ia32_vinsertf128_si256((__v8si)(__m256i)(V1), \
hash.c: | ^
hash.c: In file included from hash.c:31:
hash.c: ./groestl-intr-avx.h:909:11: error: always_inline function '_mm256_castpd_si256' requires target feature 'avx', but would be inlined into function 'TF1024' that is compiled without support for 'avx'
hash.c: ./groestl-intr-avx.h:36:91: note: expanded from macro 'insert_m128i_in_m256d'
hash.c: 36 | #define insert_m128i_in_m256d(ymm, xmm, pos) (_mm256_castsi256_pd(_mm256_insertf128_si256(_mm256_castpd_si256(ymm), xmm, pos)))
hash.c: | ^
hash.c: ./groestl-intr-avx.h:909:11: error: AVX vector argument of type '__m256d' (vector of 4 'double' values) without 'avx' enabled changes the ABI
hash.c: ./groestl-intr-avx.h:36:91: note: expanded from macro 'insert_m128i_in_m256d'
hash.c: 36 | #define insert_m128i_in_m256d(ymm, xmm, pos) (_mm256_castsi256_pd(_mm256_insertf128_si256(_mm256_castpd_si256(ymm), xmm, pos)))
hash.c: | ^
hash.c: ./groestl-intr-avx.h:909:11: error: always_inline function '_mm256_castsi256_pd' requires target feature 'avx', but would be inlined into function 'TF1024' that is compiled without support for 'avx'
hash.c: ./groestl-intr-avx.h:36:47: note: expanded from macro 'insert_m128i_in_m256d'
hash.c: 36 | #define insert_m128i_in_m256d(ymm, xmm, pos) (_mm256_castsi256_pd(_mm256_insertf128_si256(_mm256_castpd_si256(ymm), xmm, pos)))
hash.c: | ^
hash.c: ./groestl-intr-avx.h:909:11: error: AVX vector argument of type '__m256i' (vector of 4 'long long' values) without 'avx' enabled changes the ABI
hash.c: ./groestl-intr-avx.h:36:47: note: expanded from macro 'insert_m128i_in_m256d'
hash.c: ...
Number of similar (implementation,compiler) pairs: 4, namely:
| Implementation | Compiler |
| T:avx-intr | clang -march=native -O2 -fwrapv -Qunused-arguments -fPIC -fPIE -gdwarf-4 -Wall (Ubuntu_Clang_18.1.3_(1ubuntu1)) |
| T:avx-intr | clang -march=native -O3 -fwrapv -Qunused-arguments -fPIC -fPIE -gdwarf-4 -Wall (Ubuntu_Clang_18.1.3_(1ubuntu1)) |
| T:avx-intr | clang -march=native -O -fwrapv -Qunused-arguments -fPIC -fPIE -gdwarf-4 -Wall (Ubuntu_Clang_18.1.3_(1ubuntu1)) |
| T:avx-intr | clang -march=native -Os -fwrapv -Qunused-arguments -fPIC -fPIE -gdwarf-4 -Wall (Ubuntu_Clang_18.1.3_(1ubuntu1)) |
Compiler output
hash.c: In file included from hash.c:31:
hash.c: ./groestl-intr-avx.h:851:3: error: always_inline function '_mm_shuffle_epi8' requires target feature 'ssse3', but would be inlined into function 'INIT' that is compiled without support for 'ssse3'
hash.c: 851 | Matrix_Transpose(xmm8, xmm9, xmm10, xmm11, xmm12, xmm13, xmm14, xmm15, xmm0, xmm1, xmm2, xmm3, xmm4, xmm5, xmm6, xmm7);
hash.c: | ^
hash.c: ./groestl-intr-avx.h:725:8: note: expanded from macro 'Matrix_Transpose'
hash.c: 725 | i6 = _mm_shuffle_epi8(i6, t0);\
hash.c: | ^
hash.c: ./groestl-intr-avx.h:851:3: error: always_inline function '_mm_shuffle_epi8' requires target feature 'ssse3', but would be inlined into function 'INIT' that is compiled without support for 'ssse3'
hash.c: ./groestl-intr-avx.h:726:8: note: expanded from macro 'Matrix_Transpose'
hash.c: 726 | i0 = _mm_shuffle_epi8(i0, t0);\
hash.c: | ^
hash.c: ./groestl-intr-avx.h:851:3: error: always_inline function '_mm_shuffle_epi8' requires target feature 'ssse3', but would be inlined into function 'INIT' that is compiled without support for 'ssse3'
hash.c: ./groestl-intr-avx.h:727:8: note: expanded from macro 'Matrix_Transpose'
hash.c: 727 | i1 = _mm_shuffle_epi8(i1, t0);\
hash.c: | ^
hash.c: ./groestl-intr-avx.h:851:3: error: always_inline function '_mm_shuffle_epi8' requires target feature 'ssse3', but would be inlined into function 'INIT' that is compiled without support for 'ssse3'
hash.c: ./groestl-intr-avx.h:728:8: note: expanded from macro 'Matrix_Transpose'
hash.c: 728 | i2 = _mm_shuffle_epi8(i2, t0);\
hash.c: | ^
hash.c: ./groestl-intr-avx.h:851:3: error: always_inline function '_mm_shuffle_epi8' requires target feature 'ssse3', but would be inlined into function 'INIT' that is compiled without support for 'ssse3'
hash.c: ./groestl-intr-avx.h:729:8: note: expanded from macro 'Matrix_Transpose'
hash.c: 729 | i3 = _mm_shuffle_epi8(i3, t0);\
hash.c: | ^
hash.c: ./groestl-intr-avx.h:851:3: error: always_inline function '_mm_shuffle_epi8' requires target feature 'ssse3', but would be inlined into function 'INIT' that is compiled without support for 'ssse3'
hash.c: ./groestl-intr-avx.h:730:8: note: expanded from macro 'Matrix_Transpose'
hash.c: ...
Number of similar (implementation,compiler) pairs: 1, namely:
| Implementation | Compiler |
| T:avx-intr | clang -mcpu=native -O3 -fwrapv -Qunused-arguments -fPIC -fPIE -gdwarf-4 -Wall (Ubuntu_Clang_18.1.3_(1ubuntu1)) |
Compiler output
hash.c: hash.c: In function 'Init':
hash.c: hash.c:104:21: warning: the comparison will always evaluate as 'false' for the address of 'chaining' will never be NULL [-Waddress]
hash.c: 104 | if (ctx->chaining == NULL || ctx->buffer == NULL)
hash.c: | ^~
hash.c: In file included from groestl-intr-avx.h:13,
hash.c: from hash.c:31:
hash.c: hash.h:83:38: note: 'chaining' declared here
hash.c: 83 | __attribute__ ((aligned (32))) u64 chaining[SIZE/8]; /* actual state */
hash.c: | ^~~~~~~~
hash.c: hash.c:104:44: warning: the comparison will always evaluate as 'false' for the address of 'buffer' will never be NULL [-Waddress]
hash.c: 104 | if (ctx->chaining == NULL || ctx->buffer == NULL)
hash.c: | ^~
hash.c: hash.h:84:46: note: 'buffer' declared here
hash.c: 84 | __attribute__ ((aligned (32))) BitSequence buffer[SIZE]; /* data buffer */
hash.c: | ^~~~~~
hash.c: groestl-intr-avx.h: In function 'TF1024':
hash.c: groestl-intr-avx.h:909:8: warning: AVX vector return without AVX enabled changes the ABI [-Wpsabi]
hash.c: 909 | ymm8 = insert_m128i_in_m256d(ymm8, xmm8, 0);
hash.c: | ^
hash.c: hash.c: In function 'Init':
hash.c: groestl-intr-avx.h:36:47: warning: 'ymm0' is used uninitialized [-Wuninitialized]
hash.c: 36 | #define insert_m128i_in_m256d(ymm, xmm, pos) (_mm256_castsi256_pd(_mm256_insertf128_si256(_mm256_castpd_si256(ymm), xmm, pos)))
hash.c: | ~^~~~~~~~~~~~~~~~~~~~~~~~~~~~~~~~~~~~~~~~~~~~~~~~~~~~~~~~~~~~~~~~~~~~~~~~~~~~~~~~~
hash.c: groestl-intr-avx.h:496:10: note: in expansion of macro 'insert_m128i_in_m256d'
hash.c: 496 | ymm0 = insert_m128i_in_m256d(ymm0, xmm0, 0);\
hash.c: ...
Number of similar (implementation,compiler) pairs: 4, namely:
| Implementation | Compiler |
| T:avx-intr | gcc -march=native -mtune=native -O2 -fwrapv -fPIC -fPIE -gdwarf-4 -Wall (13.3.0) |
| T:avx-intr | gcc -march=native -mtune=native -O3 -fwrapv -fPIC -fPIE -gdwarf-4 -Wall (13.3.0) |
| T:avx-intr | gcc -march=native -mtune=native -O -fwrapv -fPIC -fPIE -gdwarf-4 -Wall (13.3.0) |
| T:avx-intr | gcc -march=native -mtune=native -Os -fwrapv -fPIC -fPIE -gdwarf-4 -Wall (13.3.0) |
Compiler output
try.c: /usr/bin/ld: libcrypto_hash_groestl512.a(hash.o): relocation R_X86_64_32S against symbol `T0' can not be used when making a PIE object; recompile with -fPIE
try.c: /usr/bin/ld: failed to set dynamic section sizes: bad value
try.c: clang: error: linker command failed with exit code 1 (use -v to see invocation)
Number of similar (implementation,compiler) pairs: 10, namely:
| Implementation | Compiler |
| T:core2duo | clang -march=native -O2 -fwrapv -Qunused-arguments -fPIC -fPIE -gdwarf-4 -Wall (Ubuntu_Clang_18.1.3_(1ubuntu1)) |
| T:core2duo | clang -march=native -O3 -fwrapv -Qunused-arguments -fPIC -fPIE -gdwarf-4 -Wall (Ubuntu_Clang_18.1.3_(1ubuntu1)) |
| T:core2duo | clang -march=native -O -fwrapv -Qunused-arguments -fPIC -fPIE -gdwarf-4 -Wall (Ubuntu_Clang_18.1.3_(1ubuntu1)) |
| T:core2duo | clang -march=native -Os -fwrapv -Qunused-arguments -fPIC -fPIE -gdwarf-4 -Wall (Ubuntu_Clang_18.1.3_(1ubuntu1)) |
| T:core2duo | clang -mcpu=native -O3 -fwrapv -Qunused-arguments -fPIC -fPIE -gdwarf-4 -Wall (Ubuntu_Clang_18.1.3_(1ubuntu1)) |
| T:opteron | clang -march=native -O2 -fwrapv -Qunused-arguments -fPIC -fPIE -gdwarf-4 -Wall (Ubuntu_Clang_18.1.3_(1ubuntu1)) |
| T:opteron | clang -march=native -O3 -fwrapv -Qunused-arguments -fPIC -fPIE -gdwarf-4 -Wall (Ubuntu_Clang_18.1.3_(1ubuntu1)) |
| T:opteron | clang -march=native -O -fwrapv -Qunused-arguments -fPIC -fPIE -gdwarf-4 -Wall (Ubuntu_Clang_18.1.3_(1ubuntu1)) |
| T:opteron | clang -march=native -Os -fwrapv -Qunused-arguments -fPIC -fPIE -gdwarf-4 -Wall (Ubuntu_Clang_18.1.3_(1ubuntu1)) |
| T:opteron | clang -mcpu=native -O3 -fwrapv -Qunused-arguments -fPIC -fPIE -gdwarf-4 -Wall (Ubuntu_Clang_18.1.3_(1ubuntu1)) |
Compiler output
try.c: /usr/bin/ld: libcrypto_hash_groestl512.a(hash.o): in function `Transform':
try.c: .../supercop-data/h2atom/amd64/try/c/gcc_-march=native_-mtune=native_-O2_-fwrapv_-fPIC_-fPIE_-gdwarf-4_-Wall/timingleaks/crypto_hash/groestl512/core2duo/work/hash.c:39:(.text+0x...): undefined reference to `Q1024ASM'
try.c: /usr/bin/ld: .../supercop-data/h2atom/amd64/try/c/gcc_-march=native_-mtune=native_-O2_-fwrapv_-fPIC_-fPIE_-gdwarf-4_-Wall/timingleaks/crypto_hash/groestl512/core2duo/work/hash.c:40:(.text+0x...): undefined reference to `P1024ASM'
try.c: /usr/bin/ld: libcrypto_hash_groestl512.a(hash.o): in function `OutputTransformation':
try.c: .../supercop-data/h2atom/amd64/try/c/gcc_-march=native_-mtune=native_-O2_-fwrapv_-fPIC_-fPIE_-gdwarf-4_-Wall/timingleaks/crypto_hash/groestl512/core2duo/work/hash.c:59:(.text+0x...): undefined reference to `P1024ASM'
try.c: collect2: error: ld returned 1 exit status
Number of similar (implementation,compiler) pairs: 1, namely:
| Implementation | Compiler |
| T:core2duo | gcc -march=native -mtune=native -O2 -fwrapv -fPIC -fPIE -gdwarf-4 -Wall (13.3.0) |
Compiler output
try.c: /usr/bin/ld: libcrypto_hash_groestl512.a(hash.o): in function `Transform':
try.c: .../supercop-data/h2atom/amd64/try/c/gcc_-march=native_-mtune=native_-O3_-fwrapv_-fPIC_-fPIE_-gdwarf-4_-Wall/timingleaks/crypto_hash/groestl512/core2duo/work/hash.c:39:(.text+0x...): undefined reference to `Q1024ASM'
try.c: /usr/bin/ld: .../supercop-data/h2atom/amd64/try/c/gcc_-march=native_-mtune=native_-O3_-fwrapv_-fPIC_-fPIE_-gdwarf-4_-Wall/timingleaks/crypto_hash/groestl512/core2duo/work/hash.c:40:(.text+0x...): undefined reference to `P1024ASM'
try.c: /usr/bin/ld: .../supercop-data/h2atom/amd64/try/c/gcc_-march=native_-mtune=native_-O3_-fwrapv_-fPIC_-fPIE_-gdwarf-4_-Wall/timingleaks/crypto_hash/groestl512/core2duo/work/hash.c:39:(.text+0x...): undefined reference to `Q1024ASM'
try.c: /usr/bin/ld: .../supercop-data/h2atom/amd64/try/c/gcc_-march=native_-mtune=native_-O3_-fwrapv_-fPIC_-fPIE_-gdwarf-4_-Wall/timingleaks/crypto_hash/groestl512/core2duo/work/hash.c:40:(.text+0x...): undefined reference to `P1024ASM'
try.c: /usr/bin/ld: libcrypto_hash_groestl512.a(hash.o): in function `OutputTransformation':
try.c: .../supercop-data/h2atom/amd64/try/c/gcc_-march=native_-mtune=native_-O3_-fwrapv_-fPIC_-fPIE_-gdwarf-4_-Wall/timingleaks/crypto_hash/groestl512/core2duo/work/hash.c:59:(.text+0x...): undefined reference to `P1024ASM'
try.c: /usr/bin/ld: .../supercop-data/h2atom/amd64/try/c/gcc_-march=native_-mtune=native_-O3_-fwrapv_-fPIC_-fPIE_-gdwarf-4_-Wall/timingleaks/crypto_hash/groestl512/core2duo/work/hash.c:59:(.text+0x...): undefined reference to `P1024ASM'
try.c: collect2: error: ld returned 1 exit status
Number of similar (implementation,compiler) pairs: 1, namely:
| Implementation | Compiler |
| T:core2duo | gcc -march=native -mtune=native -O3 -fwrapv -fPIC -fPIE -gdwarf-4 -Wall (13.3.0) |
Compiler output
try.c: /usr/bin/ld: libcrypto_hash_groestl512.a(hash.o): in function `Transform':
try.c: .../supercop-data/h2atom/amd64/try/c/gcc_-march=native_-mtune=native_-O_-fwrapv_-fPIC_-fPIE_-gdwarf-4_-Wall/timingleaks/crypto_hash/groestl512/core2duo/work/hash.c:39:(.text+0x...): undefined reference to `Q1024ASM'
try.c: /usr/bin/ld: .../supercop-data/h2atom/amd64/try/c/gcc_-march=native_-mtune=native_-O_-fwrapv_-fPIC_-fPIE_-gdwarf-4_-Wall/timingleaks/crypto_hash/groestl512/core2duo/work/hash.c:40:(.text+0x...): undefined reference to `P1024ASM'
try.c: /usr/bin/ld: libcrypto_hash_groestl512.a(hash.o): in function `OutputTransformation':
try.c: .../supercop-data/h2atom/amd64/try/c/gcc_-march=native_-mtune=native_-O_-fwrapv_-fPIC_-fPIE_-gdwarf-4_-Wall/timingleaks/crypto_hash/groestl512/core2duo/work/hash.c:59:(.text+0x...): undefined reference to `P1024ASM'
try.c: collect2: error: ld returned 1 exit status
Number of similar (implementation,compiler) pairs: 1, namely:
| Implementation | Compiler |
| T:core2duo | gcc -march=native -mtune=native -O -fwrapv -fPIC -fPIE -gdwarf-4 -Wall (13.3.0) |
Compiler output
try.c: /usr/bin/ld: libcrypto_hash_groestl512.a(hash.o): in function `Transform':
try.c: .../supercop-data/h2atom/amd64/try/c/gcc_-march=native_-mtune=native_-Os_-fwrapv_-fPIC_-fPIE_-gdwarf-4_-Wall/timingleaks/crypto_hash/groestl512/core2duo/work/hash.c:39:(.text+0x...): undefined reference to `Q1024ASM'
try.c: /usr/bin/ld: .../supercop-data/h2atom/amd64/try/c/gcc_-march=native_-mtune=native_-Os_-fwrapv_-fPIC_-fPIE_-gdwarf-4_-Wall/timingleaks/crypto_hash/groestl512/core2duo/work/hash.c:40:(.text+0x...): undefined reference to `P1024ASM'
try.c: /usr/bin/ld: libcrypto_hash_groestl512.a(hash.o): in function `OutputTransformation':
try.c: .../supercop-data/h2atom/amd64/try/c/gcc_-march=native_-mtune=native_-Os_-fwrapv_-fPIC_-fPIE_-gdwarf-4_-Wall/timingleaks/crypto_hash/groestl512/core2duo/work/hash.c:59:(.text+0x...): undefined reference to `P1024ASM'
try.c: collect2: error: ld returned 1 exit status
Number of similar (implementation,compiler) pairs: 1, namely:
| Implementation | Compiler |
| T:core2duo | gcc -march=native -mtune=native -Os -fwrapv -fPIC -fPIE -gdwarf-4 -Wall (13.3.0) |
Compiler output
hash.c: hash.c:563:8: warning: unused variable 'mmm' [-Wunused-variable]
hash.c: 563 | u64 *mmm = (u64*)tmp;
hash.c: | ^~~
hash.c: 1 warning generated.
Number of similar (implementation,compiler) pairs: 5, namely:
| Implementation | Compiler |
| T:mmx | clang -march=native -O2 -fwrapv -Qunused-arguments -fPIC -fPIE -gdwarf-4 -Wall (Ubuntu_Clang_18.1.3_(1ubuntu1)) |
| T:mmx | clang -march=native -O3 -fwrapv -Qunused-arguments -fPIC -fPIE -gdwarf-4 -Wall (Ubuntu_Clang_18.1.3_(1ubuntu1)) |
| T:mmx | clang -march=native -O -fwrapv -Qunused-arguments -fPIC -fPIE -gdwarf-4 -Wall (Ubuntu_Clang_18.1.3_(1ubuntu1)) |
| T:mmx | clang -march=native -Os -fwrapv -Qunused-arguments -fPIC -fPIE -gdwarf-4 -Wall (Ubuntu_Clang_18.1.3_(1ubuntu1)) |
| T:mmx | clang -mcpu=native -O3 -fwrapv -Qunused-arguments -fPIC -fPIE -gdwarf-4 -Wall (Ubuntu_Clang_18.1.3_(1ubuntu1)) |
Compiler output
hash.c: hash.c: In function 'Transform1024':
hash.c: hash.c:563:8: warning: unused variable 'mmm' [-Wunused-variable]
hash.c: 563 | u64 *mmm = (u64*)tmp;
hash.c: | ^~~
Number of similar (implementation,compiler) pairs: 4, namely:
| Implementation | Compiler |
| T:mmx | gcc -march=native -mtune=native -O2 -fwrapv -fPIC -fPIE -gdwarf-4 -Wall (13.3.0) |
| T:mmx | gcc -march=native -mtune=native -O3 -fwrapv -fPIC -fPIE -gdwarf-4 -Wall (13.3.0) |
| T:mmx | gcc -march=native -mtune=native -O -fwrapv -fPIC -fPIE -gdwarf-4 -Wall (13.3.0) |
| T:mmx | gcc -march=native -mtune=native -Os -fwrapv -fPIC -fPIE -gdwarf-4 -Wall (13.3.0) |
Compiler output
hash.c: hash.c:182:9: warning: unknown pragma ignored [-Wunknown-pragmas]
hash.c: 182 | #pragma vector aligned
hash.c: | ^
hash.c: hash.c:219:9: warning: unknown pragma ignored [-Wunknown-pragmas]
hash.c: 219 | #pragma vector aligned
hash.c: | ^
hash.c: 2 warnings generated.
Number of similar (implementation,compiler) pairs: 5, namely:
| Implementation | Compiler |
| T:opt64 | clang -march=native -O2 -fwrapv -Qunused-arguments -fPIC -fPIE -gdwarf-4 -Wall (Ubuntu_Clang_18.1.3_(1ubuntu1)) |
| T:opt64 | clang -march=native -O3 -fwrapv -Qunused-arguments -fPIC -fPIE -gdwarf-4 -Wall (Ubuntu_Clang_18.1.3_(1ubuntu1)) |
| T:opt64 | clang -march=native -O -fwrapv -Qunused-arguments -fPIC -fPIE -gdwarf-4 -Wall (Ubuntu_Clang_18.1.3_(1ubuntu1)) |
| T:opt64 | clang -march=native -Os -fwrapv -Qunused-arguments -fPIC -fPIE -gdwarf-4 -Wall (Ubuntu_Clang_18.1.3_(1ubuntu1)) |
| T:opt64 | clang -mcpu=native -O3 -fwrapv -Qunused-arguments -fPIC -fPIE -gdwarf-4 -Wall (Ubuntu_Clang_18.1.3_(1ubuntu1)) |
Compiler output
hash.c: hash.c: In function 'F512':
hash.c: hash.c:182: warning: ignoring '#pragma vector aligned' [-Wunknown-pragmas]
hash.c: 182 | #pragma vector aligned
hash.c: |
hash.c: hash.c: In function 'F1024':
hash.c: hash.c:219: warning: ignoring '#pragma vector aligned' [-Wunknown-pragmas]
hash.c: 219 | #pragma vector aligned
hash.c: |
Number of similar (implementation,compiler) pairs: 4, namely:
| Implementation | Compiler |
| T:opt64 | gcc -march=native -mtune=native -O2 -fwrapv -fPIC -fPIE -gdwarf-4 -Wall (13.3.0) |
| T:opt64 | gcc -march=native -mtune=native -O3 -fwrapv -fPIC -fPIE -gdwarf-4 -Wall (13.3.0) |
| T:opt64 | gcc -march=native -mtune=native -O -fwrapv -fPIC -fPIE -gdwarf-4 -Wall (13.3.0) |
| T:opt64 | gcc -march=native -mtune=native -Os -fwrapv -fPIC -fPIE -gdwarf-4 -Wall (13.3.0) |
Compiler output
try.c: /usr/bin/ld: libcrypto_hash_groestl512.a(hash.o): in function `Transform':
try.c: .../supercop-data/h2atom/amd64/try/c/gcc_-march=native_-mtune=native_-O2_-fwrapv_-fPIC_-fPIE_-gdwarf-4_-Wall/timingleaks/crypto_hash/groestl512/opteron/work/hash.c:36:(.text+0x...): undefined reference to `Q1024ASM'
try.c: /usr/bin/ld: .../supercop-data/h2atom/amd64/try/c/gcc_-march=native_-mtune=native_-O2_-fwrapv_-fPIC_-fPIE_-gdwarf-4_-Wall/timingleaks/crypto_hash/groestl512/opteron/work/hash.c:37:(.text+0x...): undefined reference to `P1024ASM'
try.c: /usr/bin/ld: libcrypto_hash_groestl512.a(hash.o): in function `OutputTransformation':
try.c: .../supercop-data/h2atom/amd64/try/c/gcc_-march=native_-mtune=native_-O2_-fwrapv_-fPIC_-fPIE_-gdwarf-4_-Wall/timingleaks/crypto_hash/groestl512/opteron/work/hash.c:56:(.text+0x...): undefined reference to `P1024ASM'
try.c: collect2: error: ld returned 1 exit status
Number of similar (implementation,compiler) pairs: 1, namely:
| Implementation | Compiler |
| T:opteron | gcc -march=native -mtune=native -O2 -fwrapv -fPIC -fPIE -gdwarf-4 -Wall (13.3.0) |
Compiler output
try.c: /usr/bin/ld: libcrypto_hash_groestl512.a(hash.o): in function `Transform':
try.c: .../supercop-data/h2atom/amd64/try/c/gcc_-march=native_-mtune=native_-O3_-fwrapv_-fPIC_-fPIE_-gdwarf-4_-Wall/timingleaks/crypto_hash/groestl512/opteron/work/hash.c:36:(.text+0x...): undefined reference to `Q1024ASM'
try.c: /usr/bin/ld: .../supercop-data/h2atom/amd64/try/c/gcc_-march=native_-mtune=native_-O3_-fwrapv_-fPIC_-fPIE_-gdwarf-4_-Wall/timingleaks/crypto_hash/groestl512/opteron/work/hash.c:37:(.text+0x...): undefined reference to `P1024ASM'
try.c: /usr/bin/ld: .../supercop-data/h2atom/amd64/try/c/gcc_-march=native_-mtune=native_-O3_-fwrapv_-fPIC_-fPIE_-gdwarf-4_-Wall/timingleaks/crypto_hash/groestl512/opteron/work/hash.c:36:(.text+0x...): undefined reference to `Q1024ASM'
try.c: /usr/bin/ld: .../supercop-data/h2atom/amd64/try/c/gcc_-march=native_-mtune=native_-O3_-fwrapv_-fPIC_-fPIE_-gdwarf-4_-Wall/timingleaks/crypto_hash/groestl512/opteron/work/hash.c:37:(.text+0x...): undefined reference to `P1024ASM'
try.c: /usr/bin/ld: libcrypto_hash_groestl512.a(hash.o): in function `OutputTransformation':
try.c: .../supercop-data/h2atom/amd64/try/c/gcc_-march=native_-mtune=native_-O3_-fwrapv_-fPIC_-fPIE_-gdwarf-4_-Wall/timingleaks/crypto_hash/groestl512/opteron/work/hash.c:56:(.text+0x...): undefined reference to `P1024ASM'
try.c: /usr/bin/ld: .../supercop-data/h2atom/amd64/try/c/gcc_-march=native_-mtune=native_-O3_-fwrapv_-fPIC_-fPIE_-gdwarf-4_-Wall/timingleaks/crypto_hash/groestl512/opteron/work/hash.c:56:(.text+0x...): undefined reference to `P1024ASM'
try.c: collect2: error: ld returned 1 exit status
Number of similar (implementation,compiler) pairs: 1, namely:
| Implementation | Compiler |
| T:opteron | gcc -march=native -mtune=native -O3 -fwrapv -fPIC -fPIE -gdwarf-4 -Wall (13.3.0) |
Compiler output
try.c: /usr/bin/ld: libcrypto_hash_groestl512.a(hash.o): in function `Transform':
try.c: .../supercop-data/h2atom/amd64/try/c/gcc_-march=native_-mtune=native_-O_-fwrapv_-fPIC_-fPIE_-gdwarf-4_-Wall/timingleaks/crypto_hash/groestl512/opteron/work/hash.c:36:(.text+0x...): undefined reference to `Q1024ASM'
try.c: /usr/bin/ld: .../supercop-data/h2atom/amd64/try/c/gcc_-march=native_-mtune=native_-O_-fwrapv_-fPIC_-fPIE_-gdwarf-4_-Wall/timingleaks/crypto_hash/groestl512/opteron/work/hash.c:37:(.text+0x...): undefined reference to `P1024ASM'
try.c: /usr/bin/ld: libcrypto_hash_groestl512.a(hash.o): in function `OutputTransformation':
try.c: .../supercop-data/h2atom/amd64/try/c/gcc_-march=native_-mtune=native_-O_-fwrapv_-fPIC_-fPIE_-gdwarf-4_-Wall/timingleaks/crypto_hash/groestl512/opteron/work/hash.c:56:(.text+0x...): undefined reference to `P1024ASM'
try.c: collect2: error: ld returned 1 exit status
Number of similar (implementation,compiler) pairs: 1, namely:
| Implementation | Compiler |
| T:opteron | gcc -march=native -mtune=native -O -fwrapv -fPIC -fPIE -gdwarf-4 -Wall (13.3.0) |
Compiler output
try.c: /usr/bin/ld: libcrypto_hash_groestl512.a(hash.o): in function `Transform':
try.c: .../supercop-data/h2atom/amd64/try/c/gcc_-march=native_-mtune=native_-Os_-fwrapv_-fPIC_-fPIE_-gdwarf-4_-Wall/timingleaks/crypto_hash/groestl512/opteron/work/hash.c:36:(.text+0x...): undefined reference to `Q1024ASM'
try.c: /usr/bin/ld: .../supercop-data/h2atom/amd64/try/c/gcc_-march=native_-mtune=native_-Os_-fwrapv_-fPIC_-fPIE_-gdwarf-4_-Wall/timingleaks/crypto_hash/groestl512/opteron/work/hash.c:37:(.text+0x...): undefined reference to `P1024ASM'
try.c: /usr/bin/ld: libcrypto_hash_groestl512.a(hash.o): in function `OutputTransformation':
try.c: .../supercop-data/h2atom/amd64/try/c/gcc_-march=native_-mtune=native_-Os_-fwrapv_-fPIC_-fPIE_-gdwarf-4_-Wall/timingleaks/crypto_hash/groestl512/opteron/work/hash.c:56:(.text+0x...): undefined reference to `P1024ASM'
try.c: collect2: error: ld returned 1 exit status
Number of similar (implementation,compiler) pairs: 1, namely:
| Implementation | Compiler |
| T:opteron | gcc -march=native -mtune=native -Os -fwrapv -fPIC -fPIE -gdwarf-4 -Wall (13.3.0) |
Compiler output
groestl.c: groestl.c:2812:17: warning: variable 'buf' set but not used [-Wunused-but-set-variable]
groestl.c: 2812 | unsigned char *buf;
groestl.c: | ^
groestl.c: groestl.c:2948:17: warning: variable 'buf' set but not used [-Wunused-but-set-variable]
groestl.c: 2948 | unsigned char *buf;
groestl.c: | ^
groestl.c: 2 warnings generated.
Number of similar (implementation,compiler) pairs: 10, namely:
| Implementation | Compiler |
| T:sphlib | clang -march=native -O2 -fwrapv -Qunused-arguments -fPIC -fPIE -gdwarf-4 -Wall (Ubuntu_Clang_18.1.3_(1ubuntu1)) |
| T:sphlib | clang -march=native -O3 -fwrapv -Qunused-arguments -fPIC -fPIE -gdwarf-4 -Wall (Ubuntu_Clang_18.1.3_(1ubuntu1)) |
| T:sphlib | clang -march=native -O -fwrapv -Qunused-arguments -fPIC -fPIE -gdwarf-4 -Wall (Ubuntu_Clang_18.1.3_(1ubuntu1)) |
| T:sphlib | clang -march=native -Os -fwrapv -Qunused-arguments -fPIC -fPIE -gdwarf-4 -Wall (Ubuntu_Clang_18.1.3_(1ubuntu1)) |
| T:sphlib | clang -mcpu=native -O3 -fwrapv -Qunused-arguments -fPIC -fPIE -gdwarf-4 -Wall (Ubuntu_Clang_18.1.3_(1ubuntu1)) |
| T:sphlib-small | clang -march=native -O2 -fwrapv -Qunused-arguments -fPIC -fPIE -gdwarf-4 -Wall (Ubuntu_Clang_18.1.3_(1ubuntu1)) |
| T:sphlib-small | clang -march=native -O3 -fwrapv -Qunused-arguments -fPIC -fPIE -gdwarf-4 -Wall (Ubuntu_Clang_18.1.3_(1ubuntu1)) |
| T:sphlib-small | clang -march=native -O -fwrapv -Qunused-arguments -fPIC -fPIE -gdwarf-4 -Wall (Ubuntu_Clang_18.1.3_(1ubuntu1)) |
| T:sphlib-small | clang -march=native -Os -fwrapv -Qunused-arguments -fPIC -fPIE -gdwarf-4 -Wall (Ubuntu_Clang_18.1.3_(1ubuntu1)) |
| T:sphlib-small | clang -mcpu=native -O3 -fwrapv -Qunused-arguments -fPIC -fPIE -gdwarf-4 -Wall (Ubuntu_Clang_18.1.3_(1ubuntu1)) |
Compiler output
groestl.c: groestl.c: In function 'groestl_small_close':
groestl.c: groestl.c:2812:24: warning: variable 'buf' set but not used [-Wunused-but-set-variable]
groestl.c: 2812 | unsigned char *buf;
groestl.c: | ^~~
groestl.c: groestl.c: In function 'groestl_big_close':
groestl.c: groestl.c:2948:24: warning: variable 'buf' set but not used [-Wunused-but-set-variable]
groestl.c: 2948 | unsigned char *buf;
groestl.c: | ^~~
Number of similar (implementation,compiler) pairs: 8, namely:
| Implementation | Compiler |
| T:sphlib | gcc -march=native -mtune=native -O2 -fwrapv -fPIC -fPIE -gdwarf-4 -Wall (13.3.0) |
| T:sphlib | gcc -march=native -mtune=native -O3 -fwrapv -fPIC -fPIE -gdwarf-4 -Wall (13.3.0) |
| T:sphlib | gcc -march=native -mtune=native -O -fwrapv -fPIC -fPIE -gdwarf-4 -Wall (13.3.0) |
| T:sphlib | gcc -march=native -mtune=native -Os -fwrapv -fPIC -fPIE -gdwarf-4 -Wall (13.3.0) |
| T:sphlib-small | gcc -march=native -mtune=native -O2 -fwrapv -fPIC -fPIE -gdwarf-4 -Wall (13.3.0) |
| T:sphlib-small | gcc -march=native -mtune=native -O3 -fwrapv -fPIC -fPIE -gdwarf-4 -Wall (13.3.0) |
| T:sphlib-small | gcc -march=native -mtune=native -O -fwrapv -fPIC -fPIE -gdwarf-4 -Wall (13.3.0) |
| T:sphlib-small | gcc -march=native -mtune=native -Os -fwrapv -fPIC -fPIE -gdwarf-4 -Wall (13.3.0) |
Compiler output
groestl.c: groestl.c:2742:18: warning: variable 'buf' set but not used [-Wunused-but-set-variable]
groestl.c: 2742 | unsigned char *buf;
groestl.c: | ^
groestl.c: groestl.c:2878:18: warning: variable 'buf' set but not used [-Wunused-but-set-variable]
groestl.c: 2878 | unsigned char *buf;
groestl.c: | ^
groestl.c: 2 warnings generated.
Number of similar (implementation,compiler) pairs: 5, namely:
| Implementation | Compiler |
| T:sphlib-adapted | clang -march=native -O2 -fwrapv -Qunused-arguments -fPIC -fPIE -gdwarf-4 -Wall (Ubuntu_Clang_18.1.3_(1ubuntu1)) |
| T:sphlib-adapted | clang -march=native -O3 -fwrapv -Qunused-arguments -fPIC -fPIE -gdwarf-4 -Wall (Ubuntu_Clang_18.1.3_(1ubuntu1)) |
| T:sphlib-adapted | clang -march=native -O -fwrapv -Qunused-arguments -fPIC -fPIE -gdwarf-4 -Wall (Ubuntu_Clang_18.1.3_(1ubuntu1)) |
| T:sphlib-adapted | clang -march=native -Os -fwrapv -Qunused-arguments -fPIC -fPIE -gdwarf-4 -Wall (Ubuntu_Clang_18.1.3_(1ubuntu1)) |
| T:sphlib-adapted | clang -mcpu=native -O3 -fwrapv -Qunused-arguments -fPIC -fPIE -gdwarf-4 -Wall (Ubuntu_Clang_18.1.3_(1ubuntu1)) |
Compiler output
groestl.c: groestl.c: In function 'groestl_small_close':
groestl.c: groestl.c:2742:18: warning: variable 'buf' set but not used [-Wunused-but-set-variable]
groestl.c: 2742 | unsigned char *buf;
groestl.c: | ^~~
groestl.c: groestl.c: In function 'groestl_big_close':
groestl.c: groestl.c:2878:18: warning: variable 'buf' set but not used [-Wunused-but-set-variable]
groestl.c: 2878 | unsigned char *buf;
groestl.c: | ^~~
Number of similar (implementation,compiler) pairs: 4, namely:
| Implementation | Compiler |
| T:sphlib-adapted | gcc -march=native -mtune=native -O2 -fwrapv -fPIC -fPIE -gdwarf-4 -Wall (13.3.0) |
| T:sphlib-adapted | gcc -march=native -mtune=native -O3 -fwrapv -fPIC -fPIE -gdwarf-4 -Wall (13.3.0) |
| T:sphlib-adapted | gcc -march=native -mtune=native -O -fwrapv -fPIC -fPIE -gdwarf-4 -Wall (13.3.0) |
| T:sphlib-adapted | gcc -march=native -mtune=native -Os -fwrapv -fPIC -fPIE -gdwarf-4 -Wall (13.3.0) |
Compiler output
hash.c: hash.c:104:12: warning: comparison of array 'ctx->chaining' equal to a null pointer is always false [-Wtautological-pointer-compare]
hash.c: 104 | if (ctx->chaining == NULL || ctx->buffer == NULL)
hash.c: | ~~~~~^~~~~~~~ ~~~~
hash.c: hash.c:104:37: warning: comparison of array 'ctx->buffer' equal to a null pointer is always false [-Wtautological-pointer-compare]
hash.c: 104 | if (ctx->chaining == NULL || ctx->buffer == NULL)
hash.c: | ~~~~~^~~~~~ ~~~~
hash.c: In file included from hash.c:19:
hash.c: ./groestl-asm-vperm.h:1196:3: error: invalid operand for instruction
hash.c: 1196 | VPERM_Transform_RoundConst();
hash.c: | ^
hash.c: ./groestl-asm-vperm.h:1173:3: note: expanded from macro 'VPERM_Transform_RoundConst'
hash.c: 1173 | VPERM_Transform_RoundConst_CNT2(0, 1);\
hash.c: | ^
hash.c: ./groestl-asm-vperm.h:1158:8: note: expanded from macro 'VPERM_Transform_RoundConst_CNT2'
hash.c: 1158 | asm ("movaps xmm0, [ROUND_CONST_P+"tostr(i)"*16]");\
hash.c: | ^
hash.c: <inline asm>:1:15: note: instantiated into assembly here
hash.c: 1 | movaps xmm0, [ROUND_CONST_P+0*16]
hash.c: | ^~~~~~~~~~~~~~~~~~~~
hash.c: In file included from hash.c:19:
hash.c: ./groestl-asm-vperm.h:1196:3: error: invalid operand for instruction
hash.c: 1196 | VPERM_Transform_RoundConst();
hash.c: | ^
hash.c: ./groestl-asm-vperm.h:1173:3: note: expanded from macro 'VPERM_Transform_RoundConst'
hash.c: 1173 | VPERM_Transform_RoundConst_CNT2(0, 1);\
hash.c: ...
Number of similar (implementation,compiler) pairs: 5, namely:
| Implementation | Compiler |
| T:vperm | clang -march=native -O2 -fwrapv -Qunused-arguments -fPIC -fPIE -gdwarf-4 -Wall (Ubuntu_Clang_18.1.3_(1ubuntu1)) |
| T:vperm | clang -march=native -O3 -fwrapv -Qunused-arguments -fPIC -fPIE -gdwarf-4 -Wall (Ubuntu_Clang_18.1.3_(1ubuntu1)) |
| T:vperm | clang -march=native -O -fwrapv -Qunused-arguments -fPIC -fPIE -gdwarf-4 -Wall (Ubuntu_Clang_18.1.3_(1ubuntu1)) |
| T:vperm | clang -march=native -Os -fwrapv -Qunused-arguments -fPIC -fPIE -gdwarf-4 -Wall (Ubuntu_Clang_18.1.3_(1ubuntu1)) |
| T:vperm | clang -mcpu=native -O3 -fwrapv -Qunused-arguments -fPIC -fPIE -gdwarf-4 -Wall (Ubuntu_Clang_18.1.3_(1ubuntu1)) |
Compiler output
hash.c: hash.c: In function 'Init':
hash.c: hash.c:104:21: warning: the comparison will always evaluate as 'false' for the address of 'chaining' will never be NULL [-Waddress]
hash.c: 104 | if (ctx->chaining == NULL || ctx->buffer == NULL)
hash.c: | ^~
hash.c: In file included from groestl-asm-vperm.h:13,
hash.c: from hash.c:19:
hash.c: hash.h:83:38: note: 'chaining' declared here
hash.c: 83 | __attribute__ ((aligned (32))) u64 chaining[SIZE/8]; /* actual state */
hash.c: | ^~~~~~~~
hash.c: hash.c:104:44: warning: the comparison will always evaluate as 'false' for the address of 'buffer' will never be NULL [-Waddress]
hash.c: 104 | if (ctx->chaining == NULL || ctx->buffer == NULL)
hash.c: | ^~
hash.c: hash.h:84:46: note: 'buffer' declared here
hash.c: 84 | __attribute__ ((aligned (32))) BitSequence buffer[SIZE]; /* data buffer */
hash.c: | ^~~~~~
try.c: /usr/bin/ld: libcrypto_hash_groestl512.a(hash.o): relocation R_X86_64_32S against symbol `ROUND_CONST_P' can not be used when making a PIE object; recompile with -fPIE
try.c: /usr/bin/ld: failed to set dynamic section sizes: bad value
try.c: collect2: error: ld returned 1 exit status
Number of similar (implementation,compiler) pairs: 4, namely:
| Implementation | Compiler |
| T:vperm | gcc -march=native -mtune=native -O2 -fwrapv -fPIC -fPIE -gdwarf-4 -Wall (13.3.0) |
| T:vperm | gcc -march=native -mtune=native -O3 -fwrapv -fPIC -fPIE -gdwarf-4 -Wall (13.3.0) |
| T:vperm | gcc -march=native -mtune=native -O -fwrapv -fPIC -fPIE -gdwarf-4 -Wall (13.3.0) |
| T:vperm | gcc -march=native -mtune=native -Os -fwrapv -fPIC -fPIE -gdwarf-4 -Wall (13.3.0) |
Compiler output
hash.c: hash.c:104:12: warning: comparison of array 'ctx->chaining' equal to a null pointer is always false [-Wtautological-pointer-compare]
hash.c: 104 | if (ctx->chaining == NULL || ctx->buffer == NULL)
hash.c: | ~~~~~^~~~~~~~ ~~~~
hash.c: hash.c:104:37: warning: comparison of array 'ctx->buffer' equal to a null pointer is always false [-Wtautological-pointer-compare]
hash.c: 104 | if (ctx->chaining == NULL || ctx->buffer == NULL)
hash.c: | ~~~~~^~~~~~ ~~~~
hash.c: 2 warnings generated.
Number of similar (implementation,compiler) pairs: 4, namely:
| Implementation | Compiler |
| T:vperm-intr | clang -march=native -O2 -fwrapv -Qunused-arguments -fPIC -fPIE -gdwarf-4 -Wall (Ubuntu_Clang_18.1.3_(1ubuntu1)) |
| T:vperm-intr | clang -march=native -O3 -fwrapv -Qunused-arguments -fPIC -fPIE -gdwarf-4 -Wall (Ubuntu_Clang_18.1.3_(1ubuntu1)) |
| T:vperm-intr | clang -march=native -O -fwrapv -Qunused-arguments -fPIC -fPIE -gdwarf-4 -Wall (Ubuntu_Clang_18.1.3_(1ubuntu1)) |
| T:vperm-intr | clang -march=native -Os -fwrapv -Qunused-arguments -fPIC -fPIE -gdwarf-4 -Wall (Ubuntu_Clang_18.1.3_(1ubuntu1)) |
Compiler output
hash.c: In file included from hash.c:34:
hash.c: ./groestl-intr-vperm.h:1102:3: error: always_inline function '_mm_shuffle_epi8' requires target feature 'ssse3', but would be inlined into function 'INIT' that is compiled without support for 'ssse3'
hash.c: 1102 | VPERM_Transform_RoundConst();
hash.c: | ^
hash.c: ./groestl-intr-vperm.h:1081:3: note: expanded from macro 'VPERM_Transform_RoundConst'
hash.c: 1081 | VPERM_Transform_RoundConst_CNT2(0, 1);\
hash.c: | ^
hash.c: ./groestl-intr-vperm.h:1070:3: note: expanded from macro 'VPERM_Transform_RoundConst_CNT2'
hash.c: 1070 | VPERM_Transform_State(xmm0, xmm1, xmm2, xmm3, VPERM_IPT, xmm4, xmm5, xmm6, xmm7, xmm8, xmm9, xmm10);\
hash.c: | ^
hash.c: ./groestl-intr-vperm.h:133:3: note: expanded from macro 'VPERM_Transform_State'
hash.c: 133 | VPERM_Transform_No_Const(a0, a1, t0, t1, t2, t3, c0, c1, c2);\
hash.c: | ^
hash.c: ./groestl-intr-vperm.h:88:8: note: expanded from macro 'VPERM_Transform_No_Const'
hash.c: 88 | t2 = _mm_shuffle_epi8(t2, a0);\
hash.c: | ^
hash.c: ./groestl-intr-vperm.h:1102:3: error: always_inline function '_mm_shuffle_epi8' requires target feature 'ssse3', but would be inlined into function 'INIT' that is compiled without support for 'ssse3'
hash.c: ./groestl-intr-vperm.h:1081:3: note: expanded from macro 'VPERM_Transform_RoundConst'
hash.c: 1081 | VPERM_Transform_RoundConst_CNT2(0, 1);\
hash.c: | ^
hash.c: ./groestl-intr-vperm.h:1070:3: note: expanded from macro 'VPERM_Transform_RoundConst_CNT2'
hash.c: 1070 | VPERM_Transform_State(xmm0, xmm1, xmm2, xmm3, VPERM_IPT, xmm4, xmm5, xmm6, xmm7, xmm8, xmm9, xmm10);\
hash.c: | ^
hash.c: ./groestl-intr-vperm.h:133:3: note: expanded from macro 'VPERM_Transform_State'
hash.c: 133 | VPERM_Transform_No_Const(a0, a1, t0, t1, t2, t3, c0, c1, c2);\
hash.c: ...
Number of similar (implementation,compiler) pairs: 1, namely:
| Implementation | Compiler |
| T:vperm-intr | clang -mcpu=native -O3 -fwrapv -Qunused-arguments -fPIC -fPIE -gdwarf-4 -Wall (Ubuntu_Clang_18.1.3_(1ubuntu1)) |
Compiler output
hash.c: hash.c: In function 'Init':
hash.c: hash.c:104:21: warning: the comparison will always evaluate as 'false' for the address of 'chaining' will never be NULL [-Waddress]
hash.c: 104 | if (ctx->chaining == NULL || ctx->buffer == NULL)
hash.c: | ^~
hash.c: In file included from groestl-intr-vperm.h:14,
hash.c: from hash.c:34:
hash.c: hash.h:83:38: note: 'chaining' declared here
hash.c: 83 | __attribute__ ((aligned (32))) u64 chaining[SIZE/8]; /* actual state */
hash.c: | ^~~~~~~~
hash.c: hash.c:104:44: warning: the comparison will always evaluate as 'false' for the address of 'buffer' will never be NULL [-Waddress]
hash.c: 104 | if (ctx->chaining == NULL || ctx->buffer == NULL)
hash.c: | ^~
hash.c: hash.h:84:46: note: 'buffer' declared here
hash.c: 84 | __attribute__ ((aligned (32))) BitSequence buffer[SIZE]; /* data buffer */
hash.c: | ^~~~~~
Number of similar (implementation,compiler) pairs: 4, namely:
| Implementation | Compiler |
| T:vperm-intr | gcc -march=native -mtune=native -O2 -fwrapv -fPIC -fPIE -gdwarf-4 -Wall (13.3.0) |
| T:vperm-intr | gcc -march=native -mtune=native -O3 -fwrapv -fPIC -fPIE -gdwarf-4 -Wall (13.3.0) |
| T:vperm-intr | gcc -march=native -mtune=native -O -fwrapv -fPIC -fPIE -gdwarf-4 -Wall (13.3.0) |
| T:vperm-intr | gcc -march=native -mtune=native -Os -fwrapv -fPIC -fPIE -gdwarf-4 -Wall (13.3.0) |
Namespace violations
hash.o memxor T
hash.o mixbytes T
hash.o permutation T
hash.o setmessage T
Number of similar (implementation,compiler) pairs: 9, namely:
| Implementation | Compiler |
| T:32bit-bytesliced-c-small | clang -march=native -O2 -fwrapv -Qunused-arguments -fPIC -fPIE -gdwarf-4 -Wall (Ubuntu_Clang_18.1.3_(1ubuntu1)) |
| T:32bit-bytesliced-c-small | clang -march=native -O3 -fwrapv -Qunused-arguments -fPIC -fPIE -gdwarf-4 -Wall (Ubuntu_Clang_18.1.3_(1ubuntu1)) |
| T:32bit-bytesliced-c-small | clang -march=native -O -fwrapv -Qunused-arguments -fPIC -fPIE -gdwarf-4 -Wall (Ubuntu_Clang_18.1.3_(1ubuntu1)) |
| T:32bit-bytesliced-c-small | clang -march=native -Os -fwrapv -Qunused-arguments -fPIC -fPIE -gdwarf-4 -Wall (Ubuntu_Clang_18.1.3_(1ubuntu1)) |
| T:32bit-bytesliced-c-small | clang -mcpu=native -O3 -fwrapv -Qunused-arguments -fPIC -fPIE -gdwarf-4 -Wall (Ubuntu_Clang_18.1.3_(1ubuntu1)) |
| T:32bit-bytesliced-c-small | gcc -march=native -mtune=native -O2 -fwrapv -fPIC -fPIE -gdwarf-4 -Wall (13.3.0) |
| T:32bit-bytesliced-c-small | gcc -march=native -mtune=native -O3 -fwrapv -fPIC -fPIE -gdwarf-4 -Wall (13.3.0) |
| T:32bit-bytesliced-c-small | gcc -march=native -mtune=native -O -fwrapv -fPIC -fPIE -gdwarf-4 -Wall (13.3.0) |
| T:32bit-bytesliced-c-small | gcc -march=native -mtune=native -Os -fwrapv -fPIC -fPIE -gdwarf-4 -Wall (13.3.0) |
Namespace violations
hash.o Final T
hash.o Hash T
hash.o Init T
hash.o OutputTransformation T
hash.o OutputTransformation1024 T
hash.o OutputTransformation512 T
hash.o PrintHash T
hash.o ROUNDP1024 T
hash.o ROUNDQ1024 T
hash.o T R
hash.o Transform T
hash.o Transform1024 T
hash.o Transform512 T
hash.o Update T
Number of similar (implementation,compiler) pairs: 9, namely:
| Implementation | Compiler |
| T:mmx | clang -march=native -O2 -fwrapv -Qunused-arguments -fPIC -fPIE -gdwarf-4 -Wall (Ubuntu_Clang_18.1.3_(1ubuntu1)) |
| T:mmx | clang -march=native -O3 -fwrapv -Qunused-arguments -fPIC -fPIE -gdwarf-4 -Wall (Ubuntu_Clang_18.1.3_(1ubuntu1)) |
| T:mmx | clang -march=native -O -fwrapv -Qunused-arguments -fPIC -fPIE -gdwarf-4 -Wall (Ubuntu_Clang_18.1.3_(1ubuntu1)) |
| T:mmx | clang -march=native -Os -fwrapv -Qunused-arguments -fPIC -fPIE -gdwarf-4 -Wall (Ubuntu_Clang_18.1.3_(1ubuntu1)) |
| T:mmx | clang -mcpu=native -O3 -fwrapv -Qunused-arguments -fPIC -fPIE -gdwarf-4 -Wall (Ubuntu_Clang_18.1.3_(1ubuntu1)) |
| T:mmx | gcc -march=native -mtune=native -O2 -fwrapv -fPIC -fPIE -gdwarf-4 -Wall (13.3.0) |
| T:mmx | gcc -march=native -mtune=native -O3 -fwrapv -fPIC -fPIE -gdwarf-4 -Wall (13.3.0) |
| T:mmx | gcc -march=native -mtune=native -O -fwrapv -fPIC -fPIE -gdwarf-4 -Wall (13.3.0) |
| T:mmx | gcc -march=native -mtune=native -Os -fwrapv -fPIC -fPIE -gdwarf-4 -Wall (13.3.0) |
Namespace violations
hash.o F1024 T
hash.o F512 T
hash.o Final T
hash.o Hash T
hash.o Init T
hash.o OutputTransformation T
hash.o PrintHash T
hash.o RND1024P T
hash.o RND1024Q T
hash.o RND512P T
hash.o RND512Q T
hash.o T R
hash.o Transform T
hash.o Update T
Number of similar (implementation,compiler) pairs: 9, namely:
| Implementation | Compiler |
| T:opt32 | clang -march=native -O2 -fwrapv -Qunused-arguments -fPIC -fPIE -gdwarf-4 -Wall (Ubuntu_Clang_18.1.3_(1ubuntu1)) |
| T:opt32 | clang -march=native -O3 -fwrapv -Qunused-arguments -fPIC -fPIE -gdwarf-4 -Wall (Ubuntu_Clang_18.1.3_(1ubuntu1)) |
| T:opt32 | clang -march=native -O -fwrapv -Qunused-arguments -fPIC -fPIE -gdwarf-4 -Wall (Ubuntu_Clang_18.1.3_(1ubuntu1)) |
| T:opt32 | clang -march=native -Os -fwrapv -Qunused-arguments -fPIC -fPIE -gdwarf-4 -Wall (Ubuntu_Clang_18.1.3_(1ubuntu1)) |
| T:opt32 | clang -mcpu=native -O3 -fwrapv -Qunused-arguments -fPIC -fPIE -gdwarf-4 -Wall (Ubuntu_Clang_18.1.3_(1ubuntu1)) |
| T:opt32 | gcc -march=native -mtune=native -O2 -fwrapv -fPIC -fPIE -gdwarf-4 -Wall (13.3.0) |
| T:opt32 | gcc -march=native -mtune=native -O3 -fwrapv -fPIC -fPIE -gdwarf-4 -Wall (13.3.0) |
| T:opt32 | gcc -march=native -mtune=native -O -fwrapv -fPIC -fPIE -gdwarf-4 -Wall (13.3.0) |
| T:opt32 | gcc -march=native -mtune=native -Os -fwrapv -fPIC -fPIE -gdwarf-4 -Wall (13.3.0) |
Namespace violations
hash.o Final T
hash.o Hash T
hash.o Init T
hash.o OutputTransformation T
hash.o PrintHash T
hash.o PrintState T
hash.o T D
hash.o Transform T
hash.o Update T
Number of similar (implementation,compiler) pairs: 9, namely:
| Implementation | Compiler |
| T:opt64 | clang -march=native -O2 -fwrapv -Qunused-arguments -fPIC -fPIE -gdwarf-4 -Wall (Ubuntu_Clang_18.1.3_(1ubuntu1)) |
| T:opt64 | clang -march=native -O3 -fwrapv -Qunused-arguments -fPIC -fPIE -gdwarf-4 -Wall (Ubuntu_Clang_18.1.3_(1ubuntu1)) |
| T:opt64 | clang -march=native -O -fwrapv -Qunused-arguments -fPIC -fPIE -gdwarf-4 -Wall (Ubuntu_Clang_18.1.3_(1ubuntu1)) |
| T:opt64 | clang -march=native -Os -fwrapv -Qunused-arguments -fPIC -fPIE -gdwarf-4 -Wall (Ubuntu_Clang_18.1.3_(1ubuntu1)) |
| T:opt64 | clang -mcpu=native -O3 -fwrapv -Qunused-arguments -fPIC -fPIE -gdwarf-4 -Wall (Ubuntu_Clang_18.1.3_(1ubuntu1)) |
| T:opt64 | gcc -march=native -mtune=native -O2 -fwrapv -fPIC -fPIE -gdwarf-4 -Wall (13.3.0) |
| T:opt64 | gcc -march=native -mtune=native -O3 -fwrapv -fPIC -fPIE -gdwarf-4 -Wall (13.3.0) |
| T:opt64 | gcc -march=native -mtune=native -O -fwrapv -fPIC -fPIE -gdwarf-4 -Wall (13.3.0) |
| T:opt64 | gcc -march=native -mtune=native -Os -fwrapv -fPIC -fPIE -gdwarf-4 -Wall (13.3.0) |
Namespace violations
groestl.o sph_groestl224 T
groestl.o sph_groestl224_addbits_and_close T
groestl.o sph_groestl224_close T
groestl.o sph_groestl224_init T
groestl.o sph_groestl256 T
groestl.o sph_groestl256_addbits_and_close T
groestl.o sph_groestl256_close T
groestl.o sph_groestl256_init T
groestl.o sph_groestl384 T
groestl.o sph_groestl384_addbits_and_close T
groestl.o sph_groestl384_close T
groestl.o sph_groestl384_init T
groestl.o sph_groestl512 T
groestl.o sph_groestl512_addbits_and_close T
groestl.o sph_groestl512_close T
groestl.o sph_groestl512_init T
Number of similar (implementation,compiler) pairs: 27, namely:
| Implementation | Compiler |
| T:sphlib | clang -march=native -O2 -fwrapv -Qunused-arguments -fPIC -fPIE -gdwarf-4 -Wall (Ubuntu_Clang_18.1.3_(1ubuntu1)) |
| T:sphlib | clang -march=native -O3 -fwrapv -Qunused-arguments -fPIC -fPIE -gdwarf-4 -Wall (Ubuntu_Clang_18.1.3_(1ubuntu1)) |
| T:sphlib | clang -march=native -O -fwrapv -Qunused-arguments -fPIC -fPIE -gdwarf-4 -Wall (Ubuntu_Clang_18.1.3_(1ubuntu1)) |
| T:sphlib | clang -march=native -Os -fwrapv -Qunused-arguments -fPIC -fPIE -gdwarf-4 -Wall (Ubuntu_Clang_18.1.3_(1ubuntu1)) |
| T:sphlib | clang -mcpu=native -O3 -fwrapv -Qunused-arguments -fPIC -fPIE -gdwarf-4 -Wall (Ubuntu_Clang_18.1.3_(1ubuntu1)) |
| T:sphlib | gcc -march=native -mtune=native -O2 -fwrapv -fPIC -fPIE -gdwarf-4 -Wall (13.3.0) |
| T:sphlib | gcc -march=native -mtune=native -O3 -fwrapv -fPIC -fPIE -gdwarf-4 -Wall (13.3.0) |
| T:sphlib | gcc -march=native -mtune=native -O -fwrapv -fPIC -fPIE -gdwarf-4 -Wall (13.3.0) |
| T:sphlib | gcc -march=native -mtune=native -Os -fwrapv -fPIC -fPIE -gdwarf-4 -Wall (13.3.0) |
| T:sphlib-adapted | clang -march=native -O2 -fwrapv -Qunused-arguments -fPIC -fPIE -gdwarf-4 -Wall (Ubuntu_Clang_18.1.3_(1ubuntu1)) |
| T:sphlib-adapted | clang -march=native -O3 -fwrapv -Qunused-arguments -fPIC -fPIE -gdwarf-4 -Wall (Ubuntu_Clang_18.1.3_(1ubuntu1)) |
| T:sphlib-adapted | clang -march=native -O -fwrapv -Qunused-arguments -fPIC -fPIE -gdwarf-4 -Wall (Ubuntu_Clang_18.1.3_(1ubuntu1)) |
| T:sphlib-adapted | clang -march=native -Os -fwrapv -Qunused-arguments -fPIC -fPIE -gdwarf-4 -Wall (Ubuntu_Clang_18.1.3_(1ubuntu1)) |
| T:sphlib-adapted | clang -mcpu=native -O3 -fwrapv -Qunused-arguments -fPIC -fPIE -gdwarf-4 -Wall (Ubuntu_Clang_18.1.3_(1ubuntu1)) |
| T:sphlib-adapted | gcc -march=native -mtune=native -O2 -fwrapv -fPIC -fPIE -gdwarf-4 -Wall (13.3.0) |
| T:sphlib-adapted | gcc -march=native -mtune=native -O3 -fwrapv -fPIC -fPIE -gdwarf-4 -Wall (13.3.0) |
| T:sphlib-adapted | gcc -march=native -mtune=native -O -fwrapv -fPIC -fPIE -gdwarf-4 -Wall (13.3.0) |
| T:sphlib-adapted | gcc -march=native -mtune=native -Os -fwrapv -fPIC -fPIE -gdwarf-4 -Wall (13.3.0) |
| T:sphlib-small | clang -march=native -O2 -fwrapv -Qunused-arguments -fPIC -fPIE -gdwarf-4 -Wall (Ubuntu_Clang_18.1.3_(1ubuntu1)) |
| T:sphlib-small | clang -march=native -O3 -fwrapv -Qunused-arguments -fPIC -fPIE -gdwarf-4 -Wall (Ubuntu_Clang_18.1.3_(1ubuntu1)) |
| T:sphlib-small | clang -march=native -O -fwrapv -Qunused-arguments -fPIC -fPIE -gdwarf-4 -Wall (Ubuntu_Clang_18.1.3_(1ubuntu1)) |
| T:sphlib-small | clang -march=native -Os -fwrapv -Qunused-arguments -fPIC -fPIE -gdwarf-4 -Wall (Ubuntu_Clang_18.1.3_(1ubuntu1)) |
| T:sphlib-small | clang -mcpu=native -O3 -fwrapv -Qunused-arguments -fPIC -fPIE -gdwarf-4 -Wall (Ubuntu_Clang_18.1.3_(1ubuntu1)) |
| T:sphlib-small | gcc -march=native -mtune=native -O2 -fwrapv -fPIC -fPIE -gdwarf-4 -Wall (13.3.0) |
| T:sphlib-small | gcc -march=native -mtune=native -O3 -fwrapv -fPIC -fPIE -gdwarf-4 -Wall (13.3.0) |
| T:sphlib-small | gcc -march=native -mtune=native -O -fwrapv -fPIC -fPIE -gdwarf-4 -Wall (13.3.0) |
| T:sphlib-small | gcc -march=native -mtune=native -Os -fwrapv -fPIC -fPIE -gdwarf-4 -Wall (13.3.0) |
Namespace violations
hash.o ALL_0F B
hash.o ALL_15 B
hash.o ALL_1B B
hash.o ALL_63 B
hash.o ALL_FF B
hash.o Final T
hash.o Hash T
hash.o INIT T
hash.o Init T
hash.o OF1024 T
hash.o OutputTransformation T
hash.o ROUND_CONST_L0 B
hash.o ROUND_CONST_L7 B
hash.o ROUND_CONST_Lx B
hash.o ROUND_CONST_P B
hash.o ROUND_CONST_Q B
hash.o SUBSH_MASK B
hash.o TF1024 T
hash.o TRANSP_MASK B
hash.o Transform T
hash.o Update T
hash.o VPERM_INV B
hash.o VPERM_IPT B
hash.o VPERM_OPT B
hash.o VPERM_SB1 B
hash.o VPERM_SB2 B
hash.o VPERM_SB4 B
hash.o VPERM_SBO B
Number of similar (implementation,compiler) pairs: 8, namely:
| Implementation | Compiler |
| T:vperm-intr | clang -march=native -O2 -fwrapv -Qunused-arguments -fPIC -fPIE -gdwarf-4 -Wall (Ubuntu_Clang_18.1.3_(1ubuntu1)) |
| T:vperm-intr | clang -march=native -O3 -fwrapv -Qunused-arguments -fPIC -fPIE -gdwarf-4 -Wall (Ubuntu_Clang_18.1.3_(1ubuntu1)) |
| T:vperm-intr | clang -march=native -O -fwrapv -Qunused-arguments -fPIC -fPIE -gdwarf-4 -Wall (Ubuntu_Clang_18.1.3_(1ubuntu1)) |
| T:vperm-intr | clang -march=native -Os -fwrapv -Qunused-arguments -fPIC -fPIE -gdwarf-4 -Wall (Ubuntu_Clang_18.1.3_(1ubuntu1)) |
| T:vperm-intr | gcc -march=native -mtune=native -O2 -fwrapv -fPIC -fPIE -gdwarf-4 -Wall (13.3.0) |
| T:vperm-intr | gcc -march=native -mtune=native -O3 -fwrapv -fPIC -fPIE -gdwarf-4 -Wall (13.3.0) |
| T:vperm-intr | gcc -march=native -mtune=native -O -fwrapv -fPIC -fPIE -gdwarf-4 -Wall (13.3.0) |
| T:vperm-intr | gcc -march=native -mtune=native -Os -fwrapv -fPIC -fPIE -gdwarf-4 -Wall (13.3.0) |