Test results for amd64, h2atom, crypto_dh/claus

[Page version: 20260919 18:54:16]

Measurements for amd64, h2atom, crypto_dh Test results for amd64, h2atom, crypto_dh Test results for crypto_dh/claus
Computer: h2atom
Microarchitecture: amd64; Bonnell (106ca)
Architecture: amd64
CPU ID: GenuineIntel-000106ca-bfe9fbff
SUPERCOP version: 20260330
Operation: crypto_dh
Primitive: claus
TimeObject sizeTest sizeImplementationCompilerBenchmark dateSUPERCOP version
489480382282 16 1681752615 145008 11816T:cryptoppclang++ -march=native -O -fwrapv -Qunused-arguments -fPIC -fPIE -gdwarf-4 -Wall2026052320260330
489483662180 16 2241751653 144984 12008T:cryptoppg++ -march=native -mtune=native -Os -fwrapv -fPIC -fPIE -gdwarf-4 -Wall2026052320260330
489778412279 16 1681753879 145008 11816T:cryptoppclang++ -march=native -O2 -fwrapv -Qunused-arguments -fPIC -fPIE -gdwarf-4 -Wall2026052320260330
489807032325 16 1681755367 145008 11816T:cryptoppclang++ -march=native -O3 -fwrapv -Qunused-arguments -fPIC -fPIE -gdwarf-4 -Wall2026052320260330
490009852969 16 2241757529 144992 12040T:cryptoppg++ -march=native -mtune=native -O3 -fwrapv -fPIC -fPIE -gdwarf-4 -Wall2026052320260330
490099192878 16 2241754821 144992 12040T:cryptoppg++ -march=native -mtune=native -O -fwrapv -fPIC -fPIE -gdwarf-4 -Wall2026052320260330
490333112969 16 2241755985 144992 12040T:cryptoppg++ -march=native -mtune=native -O2 -fwrapv -fPIC -fPIE -gdwarf-4 -Wall2026052320260330
585804542147 16 1681752409 145000 11816T:cryptoppclang++ -march=native -Os -fwrapv -Qunused-arguments -fPIC -fPIE -gdwarf-4 -Wall2026052320260330

Compiler output


try.cpp: In file included from try-anything.cpp:22:
try.cpp: .../supercop-data/h2atom/amd64/include/stq.h:32:13: warning: unused function 'stq_sort' [-Wunused-function]
try.cpp:    32 | static void stq_sort(stq_doublearray S,long long n)
try.cpp:       |             ^~~~~~~~
try.cpp: 1 warning generated.
try.cpp: In file included from try-anything.cpp:22:
try.cpp: .../supercop-data/h2atom/amd64/include/stq.h:32:13: warning: unused function 'stq_sort' [-Wunused-function]
try.cpp:    32 | static void stq_sort(stq_doublearray S,long long n)
try.cpp:       |             ^~~~~~~~
try.cpp: 1 warning generated.
measure.cpp: In file included from measure-anything.cpp:19:
measure.cpp: .../supercop-data/h2atom/amd64/include/stq.h:32:13: warning: unused function 'stq_sort' [-Wunused-function]
measure.cpp:    32 | static void stq_sort(stq_doublearray S,long long n)
measure.cpp:       |             ^~~~~~~~
measure.cpp: 1 warning generated.

Number of similar (implementation,compiler) pairs: 4, namely:
ImplementationCompiler
T:cryptoppclang++ -march=native -O2 -fwrapv -Qunused-arguments -fPIC -fPIE -gdwarf-4 -Wall (Ubuntu_Clang_18.1.3_(1ubuntu1))
T:cryptoppclang++ -march=native -O3 -fwrapv -Qunused-arguments -fPIC -fPIE -gdwarf-4 -Wall (Ubuntu_Clang_18.1.3_(1ubuntu1))
T:cryptoppclang++ -march=native -O -fwrapv -Qunused-arguments -fPIC -fPIE -gdwarf-4 -Wall (Ubuntu_Clang_18.1.3_(1ubuntu1))
T:cryptoppclang++ -march=native -Os -fwrapv -Qunused-arguments -fPIC -fPIE -gdwarf-4 -Wall (Ubuntu_Clang_18.1.3_(1ubuntu1))

Compiler output


try.cpp: In file included from try-anything.cpp:22:
try.cpp: .../supercop-data/h2atom/amd64/include/stq.h:32:13: warning: 'void stq_sort(std::vector<double>, long long int)' defined but not used [-Wunused-function]
try.cpp:    32 | static void stq_sort(stq_doublearray S,long long n)
try.cpp:       |             ^~~~~~~~
try.cpp: In file included from try-anything.cpp:22:
try.cpp: .../supercop-data/h2atom/amd64/include/stq.h:32:13: warning: 'void stq_sort(std::vector<double>, long long int)' defined but not used [-Wunused-function]
try.cpp:    32 | static void stq_sort(stq_doublearray S,long long n)
try.cpp:       |             ^~~~~~~~
measure.cpp: In file included from measure-anything.cpp:19:
measure.cpp: .../supercop-data/h2atom/amd64/include/stq.h:32:13: warning: 'void stq_sort(std::vector<double>, long long int)' defined but not used [-Wunused-function]
measure.cpp:    32 | static void stq_sort(stq_doublearray S,long long n)
measure.cpp:       |             ^~~~~~~~

Number of similar (implementation,compiler) pairs: 4, namely:
ImplementationCompiler
T:cryptoppg++ -march=native -mtune=native -O2 -fwrapv -fPIC -fPIE -gdwarf-4 -Wall (13.3.0)
T:cryptoppg++ -march=native -mtune=native -O3 -fwrapv -fPIC -fPIE -gdwarf-4 -Wall (13.3.0)
T:cryptoppg++ -march=native -mtune=native -O -fwrapv -fPIC -fPIE -gdwarf-4 -Wall (13.3.0)
T:cryptoppg++ -march=native -mtune=native -Os -fwrapv -fPIC -fPIE -gdwarf-4 -Wall (13.3.0)

Compiler output


keypair.cpp: keypair.cpp:1:10: fatal error: 'gmpxx.h' file not found
keypair.cpp:     1 | #include <gmpxx.h>
keypair.cpp:       |          ^~~~~~~~~
keypair.cpp: 1 error generated.

Number of similar (implementation,compiler) pairs: 4, namely:
ImplementationCompiler
T:gmpclang++ -march=native -O2 -fwrapv -Qunused-arguments -fPIC -fPIE -gdwarf-4 -Wall (Ubuntu_Clang_18.1.3_(1ubuntu1))
T:gmpclang++ -march=native -O3 -fwrapv -Qunused-arguments -fPIC -fPIE -gdwarf-4 -Wall (Ubuntu_Clang_18.1.3_(1ubuntu1))
T:gmpclang++ -march=native -O -fwrapv -Qunused-arguments -fPIC -fPIE -gdwarf-4 -Wall (Ubuntu_Clang_18.1.3_(1ubuntu1))
T:gmpclang++ -march=native -Os -fwrapv -Qunused-arguments -fPIC -fPIE -gdwarf-4 -Wall (Ubuntu_Clang_18.1.3_(1ubuntu1))

Compiler output


keypair.cpp: keypair.cpp:1:10: fatal error: gmpxx.h: No such file or directory
keypair.cpp:     1 | #include <gmpxx.h>
keypair.cpp:       |          ^~~~~~~~~
keypair.cpp: compilation terminated.

Number of similar (implementation,compiler) pairs: 4, namely:
ImplementationCompiler
T:gmpg++ -march=native -mtune=native -O2 -fwrapv -fPIC -fPIE -gdwarf-4 -Wall (13.3.0)
T:gmpg++ -march=native -mtune=native -O3 -fwrapv -fPIC -fPIE -gdwarf-4 -Wall (13.3.0)
T:gmpg++ -march=native -mtune=native -O -fwrapv -fPIC -fPIE -gdwarf-4 -Wall (13.3.0)
T:gmpg++ -march=native -mtune=native -Os -fwrapv -fPIC -fPIE -gdwarf-4 -Wall (13.3.0)

Compiler output


keypair.cpp: keypair.cpp:1:10: fatal error: 'NTL/ZZ.h' file not found
keypair.cpp:     1 | #include <NTL/ZZ.h>
keypair.cpp:       |          ^~~~~~~~~~
keypair.cpp: 1 error generated.

Number of similar (implementation,compiler) pairs: 4, namely:
ImplementationCompiler
T:ntlclang++ -march=native -O2 -fwrapv -Qunused-arguments -fPIC -fPIE -gdwarf-4 -Wall (Ubuntu_Clang_18.1.3_(1ubuntu1))
T:ntlclang++ -march=native -O3 -fwrapv -Qunused-arguments -fPIC -fPIE -gdwarf-4 -Wall (Ubuntu_Clang_18.1.3_(1ubuntu1))
T:ntlclang++ -march=native -O -fwrapv -Qunused-arguments -fPIC -fPIE -gdwarf-4 -Wall (Ubuntu_Clang_18.1.3_(1ubuntu1))
T:ntlclang++ -march=native -Os -fwrapv -Qunused-arguments -fPIC -fPIE -gdwarf-4 -Wall (Ubuntu_Clang_18.1.3_(1ubuntu1))

Compiler output


keypair.cpp: keypair.cpp:1:10: fatal error: NTL/ZZ.h: No such file or directory
keypair.cpp:     1 | #include <NTL/ZZ.h>
keypair.cpp:       |          ^~~~~~~~~~
keypair.cpp: compilation terminated.

Number of similar (implementation,compiler) pairs: 4, namely:
ImplementationCompiler
T:ntlg++ -march=native -mtune=native -O2 -fwrapv -fPIC -fPIE -gdwarf-4 -Wall (13.3.0)
T:ntlg++ -march=native -mtune=native -O3 -fwrapv -fPIC -fPIE -gdwarf-4 -Wall (13.3.0)
T:ntlg++ -march=native -mtune=native -O -fwrapv -fPIC -fPIE -gdwarf-4 -Wall (13.3.0)
T:ntlg++ -march=native -mtune=native -Os -fwrapv -fPIC -fPIE -gdwarf-4 -Wall (13.3.0)

Compiler output


keypair.c: keypair.c:2:10: fatal error: 'openssl/bn.h' file not found
keypair.c:     2 | #include <openssl/bn.h>
keypair.c:       |          ^~~~~~~~~~~~~~
keypair.c: 1 error generated.

Number of similar (implementation,compiler) pairs: 10, namely:
ImplementationCompiler
T:opensslclang -march=native -O2 -fwrapv -Qunused-arguments -fPIC -fPIE -gdwarf-4 -Wall (Ubuntu_Clang_18.1.3_(1ubuntu1))
T:opensslclang -march=native -O3 -fwrapv -Qunused-arguments -fPIC -fPIE -gdwarf-4 -Wall (Ubuntu_Clang_18.1.3_(1ubuntu1))
T:opensslclang -march=native -O -fwrapv -Qunused-arguments -fPIC -fPIE -gdwarf-4 -Wall (Ubuntu_Clang_18.1.3_(1ubuntu1))
T:opensslclang -march=native -Os -fwrapv -Qunused-arguments -fPIC -fPIE -gdwarf-4 -Wall (Ubuntu_Clang_18.1.3_(1ubuntu1))
T:opensslclang -mcpu=native -O3 -fwrapv -Qunused-arguments -fPIC -fPIE -gdwarf-4 -Wall (Ubuntu_Clang_18.1.3_(1ubuntu1))
T:opensslnewclang -march=native -O2 -fwrapv -Qunused-arguments -fPIC -fPIE -gdwarf-4 -Wall (Ubuntu_Clang_18.1.3_(1ubuntu1))
T:opensslnewclang -march=native -O3 -fwrapv -Qunused-arguments -fPIC -fPIE -gdwarf-4 -Wall (Ubuntu_Clang_18.1.3_(1ubuntu1))
T:opensslnewclang -march=native -O -fwrapv -Qunused-arguments -fPIC -fPIE -gdwarf-4 -Wall (Ubuntu_Clang_18.1.3_(1ubuntu1))
T:opensslnewclang -march=native -Os -fwrapv -Qunused-arguments -fPIC -fPIE -gdwarf-4 -Wall (Ubuntu_Clang_18.1.3_(1ubuntu1))
T:opensslnewclang -mcpu=native -O3 -fwrapv -Qunused-arguments -fPIC -fPIE -gdwarf-4 -Wall (Ubuntu_Clang_18.1.3_(1ubuntu1))

Compiler output


keypair.c: keypair.c:2:10: fatal error: openssl/bn.h: No such file or directory
keypair.c:     2 | #include <openssl/bn.h>
keypair.c:       |          ^~~~~~~~~~~~~~
keypair.c: compilation terminated.

Number of similar (implementation,compiler) pairs: 8, namely:
ImplementationCompiler
T:opensslgcc -march=native -mtune=native -O2 -fwrapv -fPIC -fPIE -gdwarf-4 -Wall (13.3.0)
T:opensslgcc -march=native -mtune=native -O3 -fwrapv -fPIC -fPIE -gdwarf-4 -Wall (13.3.0)
T:opensslgcc -march=native -mtune=native -O -fwrapv -fPIC -fPIE -gdwarf-4 -Wall (13.3.0)
T:opensslgcc -march=native -mtune=native -Os -fwrapv -fPIC -fPIE -gdwarf-4 -Wall (13.3.0)
T:opensslnewgcc -march=native -mtune=native -O2 -fwrapv -fPIC -fPIE -gdwarf-4 -Wall (13.3.0)
T:opensslnewgcc -march=native -mtune=native -O3 -fwrapv -fPIC -fPIE -gdwarf-4 -Wall (13.3.0)
T:opensslnewgcc -march=native -mtune=native -O -fwrapv -fPIC -fPIE -gdwarf-4 -Wall (13.3.0)
T:opensslnewgcc -march=native -mtune=native -Os -fwrapv -fPIC -fPIE -gdwarf-4 -Wall (13.3.0)