Test results for amd64, h2atom, crypto_core/aes256encrypt

[Page version: 20260919 18:54:16]

Measurements for amd64, h2atom, crypto_core Test results for amd64, h2atom, crypto_core Test results for crypto_core/aes256encrypt
Computer: h2atom
Microarchitecture: amd64; Bonnell (106ca)
Architecture: amd64
CPU ID: GenuineIntel-000106ca-bfe9fbff
SUPERCOP version: 20260330
Operation: crypto_core
Primitive: aes256encrypt
TimeObject sizeTest sizeImplementationCompilerBenchmark dateSUPERCOP version
10936245 0 029252 1240 1512T:dolbeau/std-4ftclang -march=native -O2 -fwrapv -Qunused-arguments -fPIC -fPIE -gdwarf-4 -Wall2026050320260330
10936245 0 030444 1240 1512T:dolbeau/std-4ftclang -march=native -O3 -fwrapv -Qunused-arguments -fPIC -fPIE -gdwarf-4 -Wall2026050320260330
12794230 0 027236 1240 1512T:dolbeau/std-2ftclang -march=native -O2 -fwrapv -Qunused-arguments -fPIC -fPIE -gdwarf-4 -Wall2026050320260330
12794230 0 028428 1240 1512T:dolbeau/std-2ftclang -march=native -O3 -fwrapv -Qunused-arguments -fPIC -fPIE -gdwarf-4 -Wall2026050320260330
12963196 0 026212 1240 1512T:dolbeau/std-1ftclang -march=native -O2 -fwrapv -Qunused-arguments -fPIC -fPIE -gdwarf-4 -Wall2026050320260330
12963196 0 027404 1240 1512T:dolbeau/std-1ftclang -march=native -O3 -fwrapv -Qunused-arguments -fPIC -fPIE -gdwarf-4 -Wall2026050320260330
13276379 0 027518 1232 1512T:dolbeau/std-4ftclang -march=native -Os -fwrapv -Qunused-arguments -fPIC -fPIE -gdwarf-4 -Wall2026050320260330
13426359 0 029827 1224 1608T:dolbeau/std-4ftgcc -march=native -mtune=native -O2 -fwrapv -fPIC -fPIE -gdwarf-4 -Wall2026050320260330
13426359 0 030907 1224 1608T:dolbeau/std-4ftgcc -march=native -mtune=native -O3 -fwrapv -fPIC -fPIE -gdwarf-4 -Wall2026050320260330
13786245 0 027988 1240 1512T:dolbeau/std-4ftclang -march=native -O -fwrapv -Qunused-arguments -fPIC -fPIE -gdwarf-4 -Wall2026050320260330
14193285 0 024430 1232 1512T:dolbeau/std-1ftclang -march=native -Os -fwrapv -Qunused-arguments -fPIC -fPIE -gdwarf-4 -Wall2026050320260330
14214230 0 025972 1240 1512T:dolbeau/std-2ftclang -march=native -O -fwrapv -Qunused-arguments -fPIC -fPIE -gdwarf-4 -Wall2026050320260330
14714309 0 025454 1232 1512T:dolbeau/std-2ftclang -march=native -Os -fwrapv -Qunused-arguments -fPIC -fPIE -gdwarf-4 -Wall2026050320260330
14944347 0 027827 1224 1608T:dolbeau/std-2ftgcc -march=native -mtune=native -O2 -fwrapv -fPIC -fPIE -gdwarf-4 -Wall2026050320260330
14944347 0 028907 1224 1608T:dolbeau/std-2ftgcc -march=native -mtune=native -O3 -fwrapv -fPIC -fPIE -gdwarf-4 -Wall2026050320260330
14946361 0 027737 1200 1576T:dolbeau/std-4ftgcc -march=native -mtune=native -Os -fwrapv -fPIC -fPIE -gdwarf-4 -Wall2026050320260330
15353196 0 024948 1240 1512T:dolbeau/std-1ftclang -march=native -O -fwrapv -Qunused-arguments -fPIC -fPIE -gdwarf-4 -Wall2026050320260330
15716392 0 029122 1216 1608T:dolbeau/std-4ftgcc -march=native -mtune=native -O -fwrapv -fPIC -fPIE -gdwarf-4 -Wall2026050320260330
16083309 0 024681 1200 1576T:dolbeau/std-1ftgcc -march=native -mtune=native -Os -fwrapv -fPIC -fPIE -gdwarf-4 -Wall2026050320260330
16096301 0 030524 1240 1512T:dolbeau/std-4ftclang -mcpu=native -O3 -fwrapv -Qunused-arguments -fPIC -fPIE -gdwarf-4 -Wall2026050320260330
17284234 0 028460 1240 1512T:dolbeau/std-2ftclang -mcpu=native -O3 -fwrapv -Qunused-arguments -fPIC -fPIE -gdwarf-4 -Wall2026050320260330
17553190 0 027404 1240 1512T:dolbeau/std-1ftclang -mcpu=native -O3 -fwrapv -Qunused-arguments -fPIC -fPIE -gdwarf-4 -Wall2026050320260330
17703357 0 026835 1224 1608T:dolbeau/std-1ftgcc -march=native -mtune=native -O2 -fwrapv -fPIC -fPIE -gdwarf-4 -Wall2026050320260330
17703357 0 027915 1224 1608T:dolbeau/std-1ftgcc -march=native -mtune=native -O3 -fwrapv -fPIC -fPIE -gdwarf-4 -Wall2026050320260330
19854371 0 027106 1216 1608T:dolbeau/std-2ftgcc -march=native -mtune=native -O -fwrapv -fPIC -fPIE -gdwarf-4 -Wall2026050320260330
20224350 0 025721 1200 1576T:dolbeau/std-2ftgcc -march=native -mtune=native -Os -fwrapv -fPIC -fPIE -gdwarf-4 -Wall2026050320260330
22493372 0 026114 1216 1608T:dolbeau/std-1ftgcc -march=native -mtune=native -O -fwrapv -fPIC -fPIE -gdwarf-4 -Wall2026050320260330
7704603901 0 028100 1240 1512refclang -march=native -O3 -fwrapv -Qunused-arguments -fPIC -fPIE -gdwarf-4 -Wall2026050320260330
8384765617 0 030195 1224 1608refgcc -march=native -mtune=native -O3 -fwrapv -fPIC -fPIE -gdwarf-4 -Wall2026050320260330
8548263858 0 028068 1240 1512refclang -mcpu=native -O3 -fwrapv -Qunused-arguments -fPIC -fPIE -gdwarf-4 -Wall2026050320260330
12334842082 0 025563 1224 1608refgcc -march=native -mtune=native -O2 -fwrapv -fPIC -fPIE -gdwarf-4 -Wall2026050320260330
16925283134 0 026132 1240 1512refclang -march=native -O2 -fwrapv -Qunused-arguments -fPIC -fPIE -gdwarf-4 -Wall2026050320260330
19509971580 0 022710 1232 1512refclang -march=native -Os -fwrapv -Qunused-arguments -fPIC -fPIE -gdwarf-4 -Wall2026050320260330
25473071756 0 023500 1240 1512refclang -march=native -O -fwrapv -Qunused-arguments -fPIC -fPIE -gdwarf-4 -Wall2026050320260330
33718271726 0 023113 1200 1576refgcc -march=native -mtune=native -Os -fwrapv -fPIC -fPIE -gdwarf-4 -Wall2026050320260330
35010832059 0 024818 1216 1608refgcc -march=native -mtune=native -O -fwrapv -fPIC -fPIE -gdwarf-4 -Wall2026050320260330

Compiler output


core.c: core.c:43:3: error: '__builtin_ia32_aeskeygenassist128' needs target feature aes
core.c:    43 |   BLOCK1(0x01);
core.c:       |   ^
core.c: core.c:24:11: note: expanded from macro 'BLOCK1'
core.c:    24 |   temp1 = _mm_aeskeygenassist_si128(temp2, IMM); \
core.c:       |           ^
core.c: /usr/lib/llvm-18/lib/clang/18/include/__wmmintrin_aes.h:136:13: note: expanded from macro '_mm_aeskeygenassist_si128'
core.c:   136 |   ((__m128i)__builtin_ia32_aeskeygenassist128((__v2di)(__m128i)(C), (int)(R)))
core.c:       |             ^
core.c: core.c:44:3: error: '__builtin_ia32_aeskeygenassist128' needs target feature aes
core.c:    44 |   BLOCK2(0x01);
core.c:       |   ^
core.c: core.c:34:11: note: expanded from macro 'BLOCK2'
core.c:    34 |   temp1 = _mm_aeskeygenassist_si128(temp0, IMM); \
core.c:       |           ^
core.c: /usr/lib/llvm-18/lib/clang/18/include/__wmmintrin_aes.h:136:13: note: expanded from macro '_mm_aeskeygenassist_si128'
core.c:   136 |   ((__m128i)__builtin_ia32_aeskeygenassist128((__v2di)(__m128i)(C), (int)(R)))
core.c:       |             ^
core.c: core.c:46:3: error: '__builtin_ia32_aeskeygenassist128' needs target feature aes
core.c:    46 |   BLOCK1(0x02);
core.c:       |   ^
core.c: core.c:24:11: note: expanded from macro 'BLOCK1'
core.c:    24 |   temp1 = _mm_aeskeygenassist_si128(temp2, IMM); \
core.c:       |           ^
core.c: /usr/lib/llvm-18/lib/clang/18/include/__wmmintrin_aes.h:136:13: note: expanded from macro '_mm_aeskeygenassist_si128'
core.c: ...

Number of similar (implementation,compiler) pairs: 5, namely:
ImplementationCompiler
dolbeau/aesenc-intclang -march=native -O2 -fwrapv -Qunused-arguments -fPIC -fPIE -gdwarf-4 -Wall (Ubuntu_Clang_18.1.3_(1ubuntu1))
dolbeau/aesenc-intclang -march=native -O3 -fwrapv -Qunused-arguments -fPIC -fPIE -gdwarf-4 -Wall (Ubuntu_Clang_18.1.3_(1ubuntu1))
dolbeau/aesenc-intclang -march=native -O -fwrapv -Qunused-arguments -fPIC -fPIE -gdwarf-4 -Wall (Ubuntu_Clang_18.1.3_(1ubuntu1))
dolbeau/aesenc-intclang -march=native -Os -fwrapv -Qunused-arguments -fPIC -fPIE -gdwarf-4 -Wall (Ubuntu_Clang_18.1.3_(1ubuntu1))
dolbeau/aesenc-intclang -mcpu=native -O3 -fwrapv -Qunused-arguments -fPIC -fPIE -gdwarf-4 -Wall (Ubuntu_Clang_18.1.3_(1ubuntu1))

Compiler output


core.c: core.c: In function 'aes256ni_encrypt':
core.c: core.c:69: warning: ignoring '#pragma unroll ' [-Wunknown-pragmas]
core.c:    69 | #pragma unroll(13)
core.c:       |
core.c: In file included from /usr/lib/gcc/x86_64-linux-gnu/13/include/immintrin.h:41,
core.c:                  from core.c:9:
core.c: /usr/lib/gcc/x86_64-linux-gnu/13/include/wmmintrin.h: In function 'aes256ni_setkey_encrypt':
core.c: /usr/lib/gcc/x86_64-linux-gnu/13/include/wmmintrin.h:87:1: error: inlining failed in call to 'always_inline' '_mm_aeskeygenassist_si128': target specific option mismatch
core.c:    87 | _mm_aeskeygenassist_si128 (__m128i __X, const int __C)
core.c:       | ^~~~~~~~~~~~~~~~~~~~~~~~~
core.c: core.c:24:11: note: called from here
core.c:    24 |   temp1 = _mm_aeskeygenassist_si128(temp2, IMM); \
core.c:       |           ^~~~~~~~~~~~~~~~~~~~~~~~~~~~~~~~~~~~~
core.c: core.c:61:3: note: in expansion of macro 'BLOCK1'
core.c:    61 |   BLOCK1(0x40);
core.c:       |   ^~~~~~
core.c: /usr/lib/gcc/x86_64-linux-gnu/13/include/wmmintrin.h:87:1: error: inlining failed in call to 'always_inline' '_mm_aeskeygenassist_si128': target specific option mismatch
core.c:    87 | _mm_aeskeygenassist_si128 (__m128i __X, const int __C)
core.c:       | ^~~~~~~~~~~~~~~~~~~~~~~~~
core.c: core.c:34:11: note: called from here
core.c:    34 |   temp1 = _mm_aeskeygenassist_si128(temp0, IMM); \
core.c:       |           ^~~~~~~~~~~~~~~~~~~~~~~~~~~~~~~~~~~~~
core.c: core.c:59:3: note: in expansion of macro 'BLOCK2'
core.c:    59 |   BLOCK2(0x20);
core.c:       |   ^~~~~~
core.c: ...

Number of similar (implementation,compiler) pairs: 4, namely:
ImplementationCompiler
dolbeau/aesenc-intgcc -march=native -mtune=native -O2 -fwrapv -fPIC -fPIE -gdwarf-4 -Wall (13.3.0)
dolbeau/aesenc-intgcc -march=native -mtune=native -O3 -fwrapv -fPIC -fPIE -gdwarf-4 -Wall (13.3.0)
dolbeau/aesenc-intgcc -march=native -mtune=native -O -fwrapv -fPIC -fPIE -gdwarf-4 -Wall (13.3.0)
dolbeau/aesenc-intgcc -march=native -mtune=native -Os -fwrapv -fPIC -fPIE -gdwarf-4 -Wall (13.3.0)

Compiler output


core.c: In file included from core.c:9:
core.c: stdaes-common.h:548:21: warning: 'KT3' defined but not used [-Wunused-variable]
core.c:   548 | static unsigned int KT3[256] = KT0Data;
core.c:       |                     ^~~
core.c: stdaes-common.h:541:21: warning: 'KT2' defined but not used [-Wunused-variable]
core.c:   541 | static unsigned int KT2[256] = KT0Data;
core.c:       |                     ^~~
core.c: stdaes-common.h:534:21: warning: 'KT1' defined but not used [-Wunused-variable]
core.c:   534 | static unsigned int KT1[256] = KT0Data;
core.c:       |                     ^~~
core.c: stdaes-common.h:527:21: warning: 'KT0' defined but not used [-Wunused-variable]
core.c:   527 | static unsigned int KT0[256] = KT0Data;
core.c:       |                     ^~~
core.c: stdaes-common.h:450:21: warning: 'RT3' defined but not used [-Wunused-variable]
core.c:   450 | static unsigned int RT3[256] = { RT };
core.c:       |                     ^~~
core.c: stdaes-common.h:443:21: warning: 'RT2' defined but not used [-Wunused-variable]
core.c:   443 | static unsigned int RT2[256] = { RT };
core.c:       |                     ^~~
core.c: stdaes-common.h:436:21: warning: 'RT1' defined but not used [-Wunused-variable]
core.c:   436 | static unsigned int RT1[256] = { RT };
core.c:       |                     ^~~
core.c: stdaes-common.h:429:21: warning: 'RT0' defined but not used [-Wunused-variable]
core.c:   429 | static unsigned int RT0[256] = { RT };
core.c:       |                     ^~~
core.c: ...

Number of similar (implementation,compiler) pairs: 12, namely:
ImplementationCompiler
T:dolbeau/std-1ftgcc -march=native -mtune=native -O2 -fwrapv -fPIC -fPIE -gdwarf-4 -Wall (13.3.0)
T:dolbeau/std-1ftgcc -march=native -mtune=native -O3 -fwrapv -fPIC -fPIE -gdwarf-4 -Wall (13.3.0)
T:dolbeau/std-1ftgcc -march=native -mtune=native -O -fwrapv -fPIC -fPIE -gdwarf-4 -Wall (13.3.0)
T:dolbeau/std-1ftgcc -march=native -mtune=native -Os -fwrapv -fPIC -fPIE -gdwarf-4 -Wall (13.3.0)
T:dolbeau/std-2ftgcc -march=native -mtune=native -O2 -fwrapv -fPIC -fPIE -gdwarf-4 -Wall (13.3.0)
T:dolbeau/std-2ftgcc -march=native -mtune=native -O3 -fwrapv -fPIC -fPIE -gdwarf-4 -Wall (13.3.0)
T:dolbeau/std-2ftgcc -march=native -mtune=native -O -fwrapv -fPIC -fPIE -gdwarf-4 -Wall (13.3.0)
T:dolbeau/std-2ftgcc -march=native -mtune=native -Os -fwrapv -fPIC -fPIE -gdwarf-4 -Wall (13.3.0)
T:dolbeau/std-4ftgcc -march=native -mtune=native -O2 -fwrapv -fPIC -fPIE -gdwarf-4 -Wall (13.3.0)
T:dolbeau/std-4ftgcc -march=native -mtune=native -O3 -fwrapv -fPIC -fPIE -gdwarf-4 -Wall (13.3.0)
T:dolbeau/std-4ftgcc -march=native -mtune=native -O -fwrapv -fPIC -fPIE -gdwarf-4 -Wall (13.3.0)
T:dolbeau/std-4ftgcc -march=native -mtune=native -Os -fwrapv -fPIC -fPIE -gdwarf-4 -Wall (13.3.0)

Compiler output


core.c: core.c:1:10: fatal error: 'openssl/aes.h' file not found
core.c:     1 | #include <openssl/aes.h>
core.c:       |          ^~~~~~~~~~~~~~~
core.c: 1 error generated.

Number of similar (implementation,compiler) pairs: 5, namely:
ImplementationCompiler
T:opensslclang -march=native -O2 -fwrapv -Qunused-arguments -fPIC -fPIE -gdwarf-4 -Wall (Ubuntu_Clang_18.1.3_(1ubuntu1))
T:opensslclang -march=native -O3 -fwrapv -Qunused-arguments -fPIC -fPIE -gdwarf-4 -Wall (Ubuntu_Clang_18.1.3_(1ubuntu1))
T:opensslclang -march=native -O -fwrapv -Qunused-arguments -fPIC -fPIE -gdwarf-4 -Wall (Ubuntu_Clang_18.1.3_(1ubuntu1))
T:opensslclang -march=native -Os -fwrapv -Qunused-arguments -fPIC -fPIE -gdwarf-4 -Wall (Ubuntu_Clang_18.1.3_(1ubuntu1))
T:opensslclang -mcpu=native -O3 -fwrapv -Qunused-arguments -fPIC -fPIE -gdwarf-4 -Wall (Ubuntu_Clang_18.1.3_(1ubuntu1))

Compiler output


core.c: core.c:1:10: fatal error: openssl/aes.h: No such file or directory
core.c:     1 | #include <openssl/aes.h>
core.c:       |          ^~~~~~~~~~~~~~~
core.c: compilation terminated.

Number of similar (implementation,compiler) pairs: 4, namely:
ImplementationCompiler
T:opensslgcc -march=native -mtune=native -O2 -fwrapv -fPIC -fPIE -gdwarf-4 -Wall (13.3.0)
T:opensslgcc -march=native -mtune=native -O3 -fwrapv -fPIC -fPIE -gdwarf-4 -Wall (13.3.0)
T:opensslgcc -march=native -mtune=native -O -fwrapv -fPIC -fPIE -gdwarf-4 -Wall (13.3.0)
T:opensslgcc -march=native -mtune=native -Os -fwrapv -fPIC -fPIE -gdwarf-4 -Wall (13.3.0)

Passed TIMECOP


TIMECOP iterations: 1

Number of similar (implementation,compiler) pairs: 9, namely:
ImplementationCompiler
refclang -march=native -O2 -fwrapv -Qunused-arguments -fPIC -fPIE -gdwarf-4 -Wall (Ubuntu_Clang_18.1.3_(1ubuntu1))
refclang -march=native -O3 -fwrapv -Qunused-arguments -fPIC -fPIE -gdwarf-4 -Wall (Ubuntu_Clang_18.1.3_(1ubuntu1))
refclang -march=native -O -fwrapv -Qunused-arguments -fPIC -fPIE -gdwarf-4 -Wall (Ubuntu_Clang_18.1.3_(1ubuntu1))
refclang -march=native -Os -fwrapv -Qunused-arguments -fPIC -fPIE -gdwarf-4 -Wall (Ubuntu_Clang_18.1.3_(1ubuntu1))
refclang -mcpu=native -O3 -fwrapv -Qunused-arguments -fPIC -fPIE -gdwarf-4 -Wall (Ubuntu_Clang_18.1.3_(1ubuntu1))
refgcc -march=native -mtune=native -O2 -fwrapv -fPIC -fPIE -gdwarf-4 -Wall (13.3.0)
refgcc -march=native -mtune=native -O3 -fwrapv -fPIC -fPIE -gdwarf-4 -Wall (13.3.0)
refgcc -march=native -mtune=native -O -fwrapv -fPIC -fPIE -gdwarf-4 -Wall (13.3.0)
refgcc -march=native -mtune=native -Os -fwrapv -fPIC -fPIE -gdwarf-4 -Wall (13.3.0)