Test results for amd64, h2atom, crypto_core/aes256decrypt

[Page version: 20260919 18:54:16]

Measurements for amd64, h2atom, crypto_core Test results for amd64, h2atom, crypto_core Test results for crypto_core/aes256decrypt
Computer: h2atom
Microarchitecture: amd64; Bonnell (106ca)
Architecture: amd64
CPU ID: GenuineIntel-000106ca-bfe9fbff
SUPERCOP version: 20260330
Operation: crypto_core
Primitive: aes256decrypt
TimeObject sizeTest sizeImplementationCompilerBenchmark dateSUPERCOP version
200111635 0 034644 1240 1512T:dolbeau/std-4rt-nodkclang -march=native -O2 -fwrapv -Qunused-arguments -fPIC -fPIE -gdwarf-4 -Wall2026050320260330
200111635 0 035836 1240 1512T:dolbeau/std-4rt-nodkclang -march=native -O3 -fwrapv -Qunused-arguments -fPIC -fPIE -gdwarf-4 -Wall2026050320260330
21415499 0 026873 1200 1576T:dolbeau/std-1rt-nodkgcc -march=native -mtune=native -Os -fwrapv -fPIC -fPIE -gdwarf-4 -Wall2026050320260330
21987568 0 031043 1224 1608T:dolbeau/std-2rt-nodkgcc -march=native -mtune=native -O2 -fwrapv -fPIC -fPIE -gdwarf-4 -Wall2026050320260330
21987568 0 032123 1224 1608T:dolbeau/std-2rt-nodkgcc -march=native -mtune=native -O3 -fwrapv -fPIC -fPIE -gdwarf-4 -Wall2026050320260330
22115670 0 026814 1232 1512T:dolbeau/std-1rt-nodkclang -march=native -Os -fwrapv -Qunused-arguments -fPIC -fPIE -gdwarf-4 -Wall2026050320260330
221811627 0 033380 1240 1512T:dolbeau/std-4rt-nodkclang -march=native -O -fwrapv -Qunused-arguments -fPIC -fPIE -gdwarf-4 -Wall2026050320260330
22435553 0 029027 1224 1608T:dolbeau/std-1rt-nodkgcc -march=native -mtune=native -O2 -fwrapv -fPIC -fPIE -gdwarf-4 -Wall2026050320260330
22435553 0 030107 1224 1608T:dolbeau/std-1rt-nodkgcc -march=native -mtune=native -O3 -fwrapv -fPIC -fPIE -gdwarf-4 -Wall2026050320260330
22747714 0 028846 1232 1512T:dolbeau/std-2rt-nodkclang -march=native -Os -fwrapv -Qunused-arguments -fPIC -fPIE -gdwarf-4 -Wall2026050320260330
23225523 0 028532 1240 1512T:dolbeau/std-1rt-nodkclang -march=native -O2 -fwrapv -Qunused-arguments -fPIC -fPIE -gdwarf-4 -Wall2026050320260330
23225523 0 029724 1240 1512T:dolbeau/std-1rt-nodkclang -march=native -O3 -fwrapv -Qunused-arguments -fPIC -fPIE -gdwarf-4 -Wall2026050320260330
23237556 0 028921 1200 1576T:dolbeau/std-2rt-nodkgcc -march=native -mtune=native -Os -fwrapv -fPIC -fPIE -gdwarf-4 -Wall2026050320260330
238711768 0 035235 1224 1608T:dolbeau/std-4rt-nodkgcc -march=native -mtune=native -O2 -fwrapv -fPIC -fPIE -gdwarf-4 -Wall2026050320260330
238711768 0 036315 1224 1608T:dolbeau/std-4rt-nodkgcc -march=native -mtune=native -O3 -fwrapv -fPIC -fPIE -gdwarf-4 -Wall2026050320260330
240511657 0 033033 1200 1576T:dolbeau/std-4rt-nodkgcc -march=native -mtune=native -Os -fwrapv -fPIC -fPIE -gdwarf-4 -Wall2026050320260330
245011804 0 034546 1216 1608T:dolbeau/std-4rt-nodkgcc -march=native -mtune=native -O -fwrapv -fPIC -fPIE -gdwarf-4 -Wall2026050320260330
246111842 0 032974 1232 1512T:dolbeau/std-4rt-nodkclang -march=native -Os -fwrapv -Qunused-arguments -fPIC -fPIE -gdwarf-4 -Wall2026050320260330
24887650 0 030660 1240 1512T:dolbeau/std-2rt-nodkclang -march=native -O2 -fwrapv -Qunused-arguments -fPIC -fPIE -gdwarf-4 -Wall2026050320260330
24887650 0 031852 1240 1512T:dolbeau/std-2rt-nodkclang -march=native -O3 -fwrapv -Qunused-arguments -fPIC -fPIE -gdwarf-4 -Wall2026050320260330
25245518 0 027268 1240 1512T:dolbeau/std-1rt-nodkclang -march=native -O -fwrapv -Qunused-arguments -fPIC -fPIE -gdwarf-4 -Wall2026050320260330
25285565 0 028306 1216 1608T:dolbeau/std-1rt-nodkgcc -march=native -mtune=native -O -fwrapv -fPIC -fPIE -gdwarf-4 -Wall2026050320260330
25447634 0 030370 1216 1608T:dolbeau/std-2rt-nodkgcc -march=native -mtune=native -O -fwrapv -fPIC -fPIE -gdwarf-4 -Wall2026050320260330
267811603 0 035820 1240 1512T:dolbeau/std-4rt-nodkclang -mcpu=native -O3 -fwrapv -Qunused-arguments -fPIC -fPIE -gdwarf-4 -Wall2026050320260330
27687650 0 029396 1240 1512T:dolbeau/std-2rt-nodkclang -march=native -O -fwrapv -Qunused-arguments -fPIC -fPIE -gdwarf-4 -Wall2026050320260330
28305502 0 029724 1240 1512T:dolbeau/std-1rt-nodkclang -mcpu=native -O3 -fwrapv -Qunused-arguments -fPIC -fPIE -gdwarf-4 -Wall2026050320260330
30157670 0 031884 1240 1512T:dolbeau/std-2rt-nodkclang -mcpu=native -O3 -fwrapv -Qunused-arguments -fPIC -fPIE -gdwarf-4 -Wall2026050320260330
9126395229 0 029420 1240 1512refclang -march=native -O3 -fwrapv -Qunused-arguments -fPIC -fPIE -gdwarf-4 -Wall2026050320260330
98961510000 0 034595 1224 1608refgcc -march=native -mtune=native -O3 -fwrapv -fPIC -fPIE -gdwarf-4 -Wall2026050320260330
10127405298 0 029500 1240 1512refclang -mcpu=native -O3 -fwrapv -Qunused-arguments -fPIC -fPIE -gdwarf-4 -Wall2026050320260330
14667972694 0 026195 1224 1608refgcc -march=native -mtune=native -O2 -fwrapv -fPIC -fPIE -gdwarf-4 -Wall2026050320260330
20177632977 0 025988 1240 1512refclang -march=native -O2 -fwrapv -Qunused-arguments -fPIC -fPIE -gdwarf-4 -Wall2026050320260330
21190312047 0 023182 1232 1512refclang -march=native -Os -fwrapv -Qunused-arguments -fPIC -fPIE -gdwarf-4 -Wall2026050320260330
29662982329 0 024076 1240 1512refclang -march=native -O -fwrapv -Qunused-arguments -fPIC -fPIE -gdwarf-4 -Wall2026050320260330
40149002195 0 023593 1200 1576refgcc -march=native -mtune=native -Os -fwrapv -fPIC -fPIE -gdwarf-4 -Wall2026050320260330
41488212646 0 025410 1216 1608refgcc -march=native -mtune=native -O -fwrapv -fPIC -fPIE -gdwarf-4 -Wall2026050320260330

Compiler output


core.c: core.c:72:16: error: always_inline function '_mm_aesimc_si128' requires target feature 'aes', but would be inlined into function 'aes256ni_setkey_decrypt' that is compiled without support for 'aes'
core.c:    72 |     rkeys[i] = _mm_aesimc_si128(tkeys[14-i]);
core.c:       |                ^
core.c: core.c:43:3: error: '__builtin_ia32_aeskeygenassist128' needs target feature aes
core.c:    43 |   BLOCK1(0x01);
core.c:       |   ^
core.c: core.c:24:11: note: expanded from macro 'BLOCK1'
core.c:    24 |   temp1 = _mm_aeskeygenassist_si128(temp2, IMM); \
core.c:       |           ^
core.c: /usr/lib/llvm-18/lib/clang/18/include/__wmmintrin_aes.h:136:13: note: expanded from macro '_mm_aeskeygenassist_si128'
core.c:   136 |   ((__m128i)__builtin_ia32_aeskeygenassist128((__v2di)(__m128i)(C), (int)(R)))
core.c:       |             ^
core.c: core.c:44:3: error: '__builtin_ia32_aeskeygenassist128' needs target feature aes
core.c:    44 |   BLOCK2(0x01);
core.c:       |   ^
core.c: core.c:34:11: note: expanded from macro 'BLOCK2'
core.c:    34 |   temp1 = _mm_aeskeygenassist_si128(temp0, IMM); \
core.c:       |           ^
core.c: /usr/lib/llvm-18/lib/clang/18/include/__wmmintrin_aes.h:136:13: note: expanded from macro '_mm_aeskeygenassist_si128'
core.c:   136 |   ((__m128i)__builtin_ia32_aeskeygenassist128((__v2di)(__m128i)(C), (int)(R)))
core.c:       |             ^
core.c: core.c:46:3: error: '__builtin_ia32_aeskeygenassist128' needs target feature aes
core.c:    46 |   BLOCK1(0x02);
core.c:       |   ^
core.c: core.c:24:11: note: expanded from macro 'BLOCK1'
core.c: ...

Number of similar (implementation,compiler) pairs: 5, namely:
ImplementationCompiler
dolbeau/aesenc-intclang -march=native -O2 -fwrapv -Qunused-arguments -fPIC -fPIE -gdwarf-4 -Wall (Ubuntu_Clang_18.1.3_(1ubuntu1))
dolbeau/aesenc-intclang -march=native -O3 -fwrapv -Qunused-arguments -fPIC -fPIE -gdwarf-4 -Wall (Ubuntu_Clang_18.1.3_(1ubuntu1))
dolbeau/aesenc-intclang -march=native -O -fwrapv -Qunused-arguments -fPIC -fPIE -gdwarf-4 -Wall (Ubuntu_Clang_18.1.3_(1ubuntu1))
dolbeau/aesenc-intclang -march=native -Os -fwrapv -Qunused-arguments -fPIC -fPIE -gdwarf-4 -Wall (Ubuntu_Clang_18.1.3_(1ubuntu1))
dolbeau/aesenc-intclang -mcpu=native -O3 -fwrapv -Qunused-arguments -fPIC -fPIE -gdwarf-4 -Wall (Ubuntu_Clang_18.1.3_(1ubuntu1))

Compiler output


core.c: core.c: In function 'aes256ni_setkey_decrypt':
core.c: core.c:70: warning: ignoring '#pragma unroll ' [-Wunknown-pragmas]
core.c:    70 | #pragma unroll(13)
core.c:       |
core.c: core.c: In function 'aes256ni_decrypt':
core.c: core.c:80: warning: ignoring '#pragma unroll ' [-Wunknown-pragmas]
core.c:    80 | #pragma unroll(13)
core.c:       |
core.c: In file included from /usr/lib/gcc/x86_64-linux-gnu/13/include/immintrin.h:41,
core.c:                  from core.c:9:
core.c: /usr/lib/gcc/x86_64-linux-gnu/13/include/wmmintrin.h: In function 'aes256ni_setkey_encrypt':
core.c: /usr/lib/gcc/x86_64-linux-gnu/13/include/wmmintrin.h:87:1: error: inlining failed in call to 'always_inline' '_mm_aeskeygenassist_si128': target specific option mismatch
core.c:    87 | _mm_aeskeygenassist_si128 (__m128i __X, const int __C)
core.c:       | ^~~~~~~~~~~~~~~~~~~~~~~~~
core.c: core.c:24:11: note: called from here
core.c:    24 |   temp1 = _mm_aeskeygenassist_si128(temp2, IMM); \
core.c:       |           ^~~~~~~~~~~~~~~~~~~~~~~~~~~~~~~~~~~~~
core.c: core.c:61:3: note: in expansion of macro 'BLOCK1'
core.c:    61 |   BLOCK1(0x40);
core.c:       |   ^~~~~~
core.c: /usr/lib/gcc/x86_64-linux-gnu/13/include/wmmintrin.h:87:1: error: inlining failed in call to 'always_inline' '_mm_aeskeygenassist_si128': target specific option mismatch
core.c:    87 | _mm_aeskeygenassist_si128 (__m128i __X, const int __C)
core.c:       | ^~~~~~~~~~~~~~~~~~~~~~~~~
core.c: core.c:34:11: note: called from here
core.c:    34 |   temp1 = _mm_aeskeygenassist_si128(temp0, IMM); \
core.c: ...

Number of similar (implementation,compiler) pairs: 4, namely:
ImplementationCompiler
dolbeau/aesenc-intgcc -march=native -mtune=native -O2 -fwrapv -fPIC -fPIE -gdwarf-4 -Wall (13.3.0)
dolbeau/aesenc-intgcc -march=native -mtune=native -O3 -fwrapv -fPIC -fPIE -gdwarf-4 -Wall (13.3.0)
dolbeau/aesenc-intgcc -march=native -mtune=native -O -fwrapv -fPIC -fPIE -gdwarf-4 -Wall (13.3.0)
dolbeau/aesenc-intgcc -march=native -mtune=native -Os -fwrapv -fPIC -fPIE -gdwarf-4 -Wall (13.3.0)

Compiler output


core.c: In file included from core.c:9:
core.c: stdaes-common.h:548:21: warning: 'KT3' defined but not used [-Wunused-variable]
core.c:   548 | static unsigned int KT3[256] = KT0Data;
core.c:       |                     ^~~
core.c: stdaes-common.h:541:21: warning: 'KT2' defined but not used [-Wunused-variable]
core.c:   541 | static unsigned int KT2[256] = KT0Data;
core.c:       |                     ^~~
core.c: stdaes-common.h:534:21: warning: 'KT1' defined but not used [-Wunused-variable]
core.c:   534 | static unsigned int KT1[256] = KT0Data;
core.c:       |                     ^~~
core.c: stdaes-common.h:450:21: warning: 'RT3' defined but not used [-Wunused-variable]
core.c:   450 | static unsigned int RT3[256] = { RT };
core.c:       |                     ^~~
core.c: stdaes-common.h:443:21: warning: 'RT2' defined but not used [-Wunused-variable]
core.c:   443 | static unsigned int RT2[256] = { RT };
core.c:       |                     ^~~
core.c: stdaes-common.h:436:21: warning: 'RT1' defined but not used [-Wunused-variable]
core.c:   436 | static unsigned int RT1[256] = { RT };
core.c:       |                     ^~~
core.c: stdaes-common.h:108:21: warning: 'FT3' defined but not used [-Wunused-variable]
core.c:   108 | static unsigned int FT3[256] = { FT };
core.c:       |                     ^~~
core.c: stdaes-common.h:100:21: warning: 'FT2' defined but not used [-Wunused-variable]
core.c:   100 | static unsigned int FT2[256] = { FT };
core.c:       |                     ^~~
core.c: ...

Number of similar (implementation,compiler) pairs: 4, namely:
ImplementationCompiler
T:dolbeau/std-1rt-nodkgcc -march=native -mtune=native -O2 -fwrapv -fPIC -fPIE -gdwarf-4 -Wall (13.3.0)
T:dolbeau/std-1rt-nodkgcc -march=native -mtune=native -O3 -fwrapv -fPIC -fPIE -gdwarf-4 -Wall (13.3.0)
T:dolbeau/std-1rt-nodkgcc -march=native -mtune=native -O -fwrapv -fPIC -fPIE -gdwarf-4 -Wall (13.3.0)
T:dolbeau/std-1rt-nodkgcc -march=native -mtune=native -Os -fwrapv -fPIC -fPIE -gdwarf-4 -Wall (13.3.0)

Compiler output


core.c: In file included from core.c:9:
core.c: stdaes-common.h:548:21: warning: 'KT3' defined but not used [-Wunused-variable]
core.c:   548 | static unsigned int KT3[256] = KT0Data;
core.c:       |                     ^~~
core.c: stdaes-common.h:541:21: warning: 'KT2' defined but not used [-Wunused-variable]
core.c:   541 | static unsigned int KT2[256] = KT0Data;
core.c:       |                     ^~~
core.c: stdaes-common.h:450:21: warning: 'RT3' defined but not used [-Wunused-variable]
core.c:   450 | static unsigned int RT3[256] = { RT };
core.c:       |                     ^~~
core.c: stdaes-common.h:443:21: warning: 'RT2' defined but not used [-Wunused-variable]
core.c:   443 | static unsigned int RT2[256] = { RT };
core.c:       |                     ^~~
core.c: stdaes-common.h:108:21: warning: 'FT3' defined but not used [-Wunused-variable]
core.c:   108 | static unsigned int FT3[256] = { FT };
core.c:       |                     ^~~
core.c: stdaes-common.h:100:21: warning: 'FT2' defined but not used [-Wunused-variable]
core.c:   100 | static unsigned int FT2[256] = { FT };
core.c:       |                     ^~~
core.c: stdaes-common.h:92:21: warning: 'FT1' defined but not used [-Wunused-variable]
core.c:    92 | static unsigned int FT1[256] = { FT };
core.c:       |                     ^~~
core.c: stdaes-common.h:84:21: warning: 'FT0' defined but not used [-Wunused-variable]
core.c:    84 | static unsigned int FT0[256] = { FT };
core.c:       |                     ^~~

Number of similar (implementation,compiler) pairs: 4, namely:
ImplementationCompiler
T:dolbeau/std-2rt-nodkgcc -march=native -mtune=native -O2 -fwrapv -fPIC -fPIE -gdwarf-4 -Wall (13.3.0)
T:dolbeau/std-2rt-nodkgcc -march=native -mtune=native -O3 -fwrapv -fPIC -fPIE -gdwarf-4 -Wall (13.3.0)
T:dolbeau/std-2rt-nodkgcc -march=native -mtune=native -O -fwrapv -fPIC -fPIE -gdwarf-4 -Wall (13.3.0)
T:dolbeau/std-2rt-nodkgcc -march=native -mtune=native -Os -fwrapv -fPIC -fPIE -gdwarf-4 -Wall (13.3.0)

Compiler output


core.c: In file included from core.c:9:
core.c: stdaes-common.h:108:21: warning: 'FT3' defined but not used [-Wunused-variable]
core.c:   108 | static unsigned int FT3[256] = { FT };
core.c:       |                     ^~~
core.c: stdaes-common.h:100:21: warning: 'FT2' defined but not used [-Wunused-variable]
core.c:   100 | static unsigned int FT2[256] = { FT };
core.c:       |                     ^~~
core.c: stdaes-common.h:92:21: warning: 'FT1' defined but not used [-Wunused-variable]
core.c:    92 | static unsigned int FT1[256] = { FT };
core.c:       |                     ^~~
core.c: stdaes-common.h:84:21: warning: 'FT0' defined but not used [-Wunused-variable]
core.c:    84 | static unsigned int FT0[256] = { FT };
core.c:       |                     ^~~

Number of similar (implementation,compiler) pairs: 4, namely:
ImplementationCompiler
T:dolbeau/std-4rt-nodkgcc -march=native -mtune=native -O2 -fwrapv -fPIC -fPIE -gdwarf-4 -Wall (13.3.0)
T:dolbeau/std-4rt-nodkgcc -march=native -mtune=native -O3 -fwrapv -fPIC -fPIE -gdwarf-4 -Wall (13.3.0)
T:dolbeau/std-4rt-nodkgcc -march=native -mtune=native -O -fwrapv -fPIC -fPIE -gdwarf-4 -Wall (13.3.0)
T:dolbeau/std-4rt-nodkgcc -march=native -mtune=native -Os -fwrapv -fPIC -fPIE -gdwarf-4 -Wall (13.3.0)

Compiler output


core.c: core.c:1:10: fatal error: 'openssl/aes.h' file not found
core.c:     1 | #include <openssl/aes.h>
core.c:       |          ^~~~~~~~~~~~~~~
core.c: 1 error generated.

Number of similar (implementation,compiler) pairs: 5, namely:
ImplementationCompiler
T:opensslclang -march=native -O2 -fwrapv -Qunused-arguments -fPIC -fPIE -gdwarf-4 -Wall (Ubuntu_Clang_18.1.3_(1ubuntu1))
T:opensslclang -march=native -O3 -fwrapv -Qunused-arguments -fPIC -fPIE -gdwarf-4 -Wall (Ubuntu_Clang_18.1.3_(1ubuntu1))
T:opensslclang -march=native -O -fwrapv -Qunused-arguments -fPIC -fPIE -gdwarf-4 -Wall (Ubuntu_Clang_18.1.3_(1ubuntu1))
T:opensslclang -march=native -Os -fwrapv -Qunused-arguments -fPIC -fPIE -gdwarf-4 -Wall (Ubuntu_Clang_18.1.3_(1ubuntu1))
T:opensslclang -mcpu=native -O3 -fwrapv -Qunused-arguments -fPIC -fPIE -gdwarf-4 -Wall (Ubuntu_Clang_18.1.3_(1ubuntu1))

Compiler output


core.c: core.c:1:10: fatal error: openssl/aes.h: No such file or directory
core.c:     1 | #include <openssl/aes.h>
core.c:       |          ^~~~~~~~~~~~~~~
core.c: compilation terminated.

Number of similar (implementation,compiler) pairs: 4, namely:
ImplementationCompiler
T:opensslgcc -march=native -mtune=native -O2 -fwrapv -fPIC -fPIE -gdwarf-4 -Wall (13.3.0)
T:opensslgcc -march=native -mtune=native -O3 -fwrapv -fPIC -fPIE -gdwarf-4 -Wall (13.3.0)
T:opensslgcc -march=native -mtune=native -O -fwrapv -fPIC -fPIE -gdwarf-4 -Wall (13.3.0)
T:opensslgcc -march=native -mtune=native -Os -fwrapv -fPIC -fPIE -gdwarf-4 -Wall (13.3.0)

Passed TIMECOP


TIMECOP iterations: 1

Number of similar (implementation,compiler) pairs: 9, namely:
ImplementationCompiler
refclang -march=native -O2 -fwrapv -Qunused-arguments -fPIC -fPIE -gdwarf-4 -Wall (Ubuntu_Clang_18.1.3_(1ubuntu1))
refclang -march=native -O3 -fwrapv -Qunused-arguments -fPIC -fPIE -gdwarf-4 -Wall (Ubuntu_Clang_18.1.3_(1ubuntu1))
refclang -march=native -O -fwrapv -Qunused-arguments -fPIC -fPIE -gdwarf-4 -Wall (Ubuntu_Clang_18.1.3_(1ubuntu1))
refclang -march=native -Os -fwrapv -Qunused-arguments -fPIC -fPIE -gdwarf-4 -Wall (Ubuntu_Clang_18.1.3_(1ubuntu1))
refclang -mcpu=native -O3 -fwrapv -Qunused-arguments -fPIC -fPIE -gdwarf-4 -Wall (Ubuntu_Clang_18.1.3_(1ubuntu1))
refgcc -march=native -mtune=native -O2 -fwrapv -fPIC -fPIE -gdwarf-4 -Wall (13.3.0)
refgcc -march=native -mtune=native -O3 -fwrapv -fPIC -fPIE -gdwarf-4 -Wall (13.3.0)
refgcc -march=native -mtune=native -O -fwrapv -fPIC -fPIE -gdwarf-4 -Wall (13.3.0)
refgcc -march=native -mtune=native -Os -fwrapv -fPIC -fPIE -gdwarf-4 -Wall (13.3.0)